[INFO] Scanning for projects...
[INFO]                                                                         
[INFO] ------------------------------------------------------------------------
[INFO] Building Joda-Time 2.8.1
[INFO] ------------------------------------------------------------------------
[INFO] 
[INFO] --- maven-resources-plugin:2.7:resources (default-resources) @ joda-time ---
[INFO] Using 'UTF-8' encoding to copy filtered resources.
[INFO] Copying 2 resources to META-INF
[INFO] Copying 10 resources
[INFO] 
[INFO] --- maven-compiler-plugin:3.3:compile (default-compile) @ joda-time ---
[INFO] Changes detected - recompiling the module!
[INFO] Compiling 166 source files to /home/perham/Study/LittleDarwin/Cases/joda-time-2.8.1/target/classes
[INFO] 
[INFO] --- exec-maven-plugin:1.4.0:java (compile-tzdb) @ joda-time ---
Writing zoneinfo files
Writing ZoneInfoMap
[INFO] 
[INFO] --- maven-resources-plugin:2.7:testResources (default-testResources) @ joda-time ---
[INFO] Using 'UTF-8' encoding to copy filtered resources.
[INFO] Copying 34 resources
[INFO] 
[INFO] --- maven-compiler-plugin:3.3:testCompile (default-testCompile) @ joda-time ---
[INFO] Nothing to compile - all classes are up to date
[INFO] 
[INFO] --- maven-surefire-plugin:2.18.1:test (default-test) @ joda-time ---
[INFO] Surefire report directory: /home/perham/Study/LittleDarwin/Cases/joda-time-2.8.1/target/surefire-reports

-------------------------------------------------------
 T E S T S
-------------------------------------------------------
Running org.joda.time.TestAllPackages

TestBuddhistChronology.testCalendar

TestCopticChronology.testCalendar

TestEthiopicChronology.testCalendar

TestIslamicChronology.testCalendar

Testing Gregorian chronology over 1000 iterations
Failure on weekyear.set
org.joda.time.chrono.gj.TestGJWeekyearField
	vs. org.joda.time.chrono.BasicWeekyearDateTimeField
Datetime: Sat 1960-03-26T03:29:34.468Z / 1960-W1963855873-6
Millis from 1970: -308262625532
Sat -0049-03-24T03:29:34.468Z / -49-W1963855873-6 != Sat 29604272-07-20T03:29:34.468Z / 29604272-W1511919617-6
-63706422625532 != 934158440662174468
Original value as reported by first field: 1960
Original value as reported by second field: 1960
First new value as reported by first field: -49
First new value as reported by second field: -49
Second new value as reported by first field: 29604272
Second new value as reported by second field: 29604272
Value to set for first field: -49
Value to set for second field: -49
Failure index: 0
Test millis: -308262625532
Test value: -49
Test millis2: -46922557997542

Testing Julian chronology over 1000 iterations
Failure on weekyear.set
org.joda.time.chrono.gj.TestJulianWeekyearField
	vs. org.joda.time.field.SkipDateTimeField
Datetime: Sat 1960-03-13T03:29:34.468Z / 1960-W-788656127-6
Millis from 1970: -308262625532
Sat -0049-03-17T03:29:34.468Z / -49-W-788656127-6 != Sat 30143820-10-16T03:29:34.468Z / 30143820-W-1360130047-6
-63675577825532 != 951204471622174468
Original value as reported by first field: 1960
Original value as reported by second field: 1960
First new value as reported by first field: -49
First new value as reported by second field: -49
Second new value as reported by first field: 30143820
Second new value as reported by second field: 30143820
Value to set for first field: -49
Value to set for second field: -49
Failure index: 0
Test millis: -308262625532
Test value: -49
Test millis2: -46922557997542
Writing zoneinfo files
Writing ZoneInfoMap
Tests run: 4157, Failures: 48, Errors: 20, Skipped: 0, Time elapsed: 4.869 sec <<< FAILURE! - in org.joda.time.TestAllPackages
testGet_DateTimeFieldType(org.joda.time.TestInstant_Basics)  Time elapsed: 0.006 sec  <<< FAILURE!
junit.framework.AssertionFailedError: expected:<23> but was:<-1509949439>
	at junit.framework.Assert.fail(Assert.java:47)
	at junit.framework.Assert.failNotEquals(Assert.java:280)
	at junit.framework.Assert.assertEquals(Assert.java:64)
	at junit.framework.Assert.assertEquals(Assert.java:198)
	at junit.framework.Assert.assertEquals(Assert.java:204)
	at org.joda.time.TestInstant_Basics.testGet_DateTimeFieldType(TestInstant_Basics.java:125)

testGet_DateTimeField(org.joda.time.TestInstant_Basics)  Time elapsed: 0 sec  <<< FAILURE!
junit.framework.AssertionFailedError: expected:<23> but was:<653918209>
	at junit.framework.Assert.fail(Assert.java:47)
	at junit.framework.Assert.failNotEquals(Assert.java:280)
	at junit.framework.Assert.assertEquals(Assert.java:64)
	at junit.framework.Assert.assertEquals(Assert.java:198)
	at junit.framework.Assert.assertEquals(Assert.java:204)
	at org.joda.time.TestInstant_Basics.testGet_DateTimeField(TestInstant_Basics.java:155)

testGet_DateTimeFieldType(org.joda.time.TestDateTime_Basics)  Time elapsed: 0.001 sec  <<< FAILURE!
junit.framework.AssertionFailedError: expected:<23> but was:<653918209>
	at junit.framework.Assert.fail(Assert.java:47)
	at junit.framework.Assert.failNotEquals(Assert.java:280)
	at junit.framework.Assert.assertEquals(Assert.java:64)
	at junit.framework.Assert.assertEquals(Assert.java:198)
	at junit.framework.Assert.assertEquals(Assert.java:204)
	at org.joda.time.TestDateTime_Basics.testGet_DateTimeFieldType(TestDateTime_Basics.java:177)

testGet_DateTimeField(org.joda.time.TestDateTime_Basics)  Time elapsed: 0.001 sec  <<< FAILURE!
junit.framework.AssertionFailedError: expected:<23> but was:<653918209>
	at junit.framework.Assert.fail(Assert.java:47)
	at junit.framework.Assert.failNotEquals(Assert.java:280)
	at junit.framework.Assert.assertEquals(Assert.java:64)
	at junit.framework.Assert.assertEquals(Assert.java:198)
	at junit.framework.Assert.assertEquals(Assert.java:204)
	at org.joda.time.TestDateTime_Basics.testGet_DateTimeField(TestDateTime_Basics.java:147)

testGetters(org.joda.time.TestDateTime_Basics)  Time elapsed: 0 sec  <<< FAILURE!
junit.framework.AssertionFailedError: expected:<23> but was:<653918209>
	at junit.framework.Assert.fail(Assert.java:47)
	at junit.framework.Assert.failNotEquals(Assert.java:280)
	at junit.framework.Assert.assertEquals(Assert.java:64)
	at junit.framework.Assert.assertEquals(Assert.java:198)
	at junit.framework.Assert.assertEquals(Assert.java:204)
	at org.joda.time.TestDateTime_Basics.testGetters(TestDateTime_Basics.java:240)

testWithers(org.joda.time.TestDateTime_Basics)  Time elapsed: 0.001 sec  <<< ERROR!
org.joda.time.IllegalFieldValueException: Value 1519607809 for weekOfWeekyear must be in the range [1,52]
	at org.joda.time.field.FieldUtils.verifyValueBounds(FieldUtils.java:234)
	at org.joda.time.field.PreciseDurationDateTimeField.set(PreciseDurationDateTimeField.java:79)
	at org.joda.time.chrono.GJChronology.convertByWeekyear(GJChronology.java:95)
	at org.joda.time.chrono.GJChronology.gregorianToJulianByWeekyear(GJChronology.java:589)
	at org.joda.time.chrono.GJChronology$CutoverField.gregorianToJulian(GJChronology.java:929)
	at org.joda.time.chrono.GJChronology$CutoverField.set(GJChronology.java:731)
	at org.joda.time.chrono.ZonedChronology$ZonedDateTimeField.set(ZonedChronology.java:482)
	at org.joda.time.DateTime.withWeekOfWeekyear(DateTime.java:1750)
	at org.joda.time.TestDateTime_Basics.testWithers(TestDateTime_Basics.java:259)

testPropertySetWeekOfWeekyear(org.joda.time.TestDateTime_Properties)  Time elapsed: 0.001 sec  <<< ERROR!
org.joda.time.IllegalFieldValueException: Value 4 for weekOfWeekyear is not supported: Illegal instant due to time zone offset transition (daylight savings time 'gap'): 21404590-08-30T00:00:00.000 (Europe/London)
	at org.joda.time.chrono.ZonedChronology$ZonedDateTimeField.set(ZonedChronology.java:486)
	at org.joda.time.DateTime$Property.setCopy(DateTime.java:2220)
	at org.joda.time.TestDateTime_Properties.testPropertySetWeekOfWeekyear(TestDateTime_Properties.java:908)
Caused by: org.joda.time.IllegalInstantException: Illegal instant due to time zone offset transition (daylight savings time 'gap'): 21404590-08-30T00:00:00.000 (Europe/London)
	at org.joda.time.chrono.ZonedChronology$ZonedDateTimeField.set(ZonedChronology.java:485)
	... 28 more

testPropertySetTextWeekOfWeekyear(org.joda.time.TestDateTime_Properties)  Time elapsed: 0.002 sec  <<< FAILURE!
junit.framework.ComparisonFailure: expected:<2[004-01-19T00:00:00.000Z]> but was:<2[1404590-08-30T00:00:00.000+01:00]>
	at junit.framework.Assert.assertEquals(Assert.java:81)
	at junit.framework.Assert.assertEquals(Assert.java:87)
	at org.joda.time.TestDateTime_Properties.testPropertySetTextWeekOfWeekyear(TestDateTime_Properties.java:926)

testPropertyCompareToWeekOfWeekyear(org.joda.time.TestDateTime_Properties)  Time elapsed: 0 sec  <<< FAILURE!
junit.framework.AssertionFailedError: expected:<true> but was:<false>
	at junit.framework.Assert.fail(Assert.java:47)
	at junit.framework.Assert.failNotEquals(Assert.java:280)
	at junit.framework.Assert.assertEquals(Assert.java:64)
	at junit.framework.Assert.assertEquals(Assert.java:146)
	at junit.framework.Assert.assertEquals(Assert.java:152)
	at org.joda.time.TestDateTime_Properties.testPropertyCompareToWeekOfWeekyear(TestDateTime_Properties.java:932)

testPropertyGetWeekOfWeekyear(org.joda.time.TestDateTime_Properties)  Time elapsed: 0.001 sec  <<< FAILURE!
junit.framework.AssertionFailedError: expected:<24> but was:<-330301439>
	at junit.framework.Assert.fail(Assert.java:47)
	at junit.framework.Assert.failNotEquals(Assert.java:280)
	at junit.framework.Assert.assertEquals(Assert.java:64)
	at junit.framework.Assert.assertEquals(Assert.java:198)
	at junit.framework.Assert.assertEquals(Assert.java:204)
	at org.joda.time.TestDateTime_Properties.testPropertyGetWeekOfWeekyear(TestDateTime_Properties.java:845)

testPropertyAddWrapFieldWeekOfWeekyear(org.joda.time.TestDateTime_Properties)  Time elapsed: 0.001 sec  <<< FAILURE!
junit.framework.ComparisonFailure: expected:<2[004-06-14]T00:00:00.000+01:00> but was:<2[1404591-05-16]T00:00:00.000+01:00>
	at junit.framework.Assert.assertEquals(Assert.java:81)
	at junit.framework.Assert.assertEquals(Assert.java:87)
	at org.joda.time.TestDateTime_Properties.testPropertyAddWrapFieldWeekOfWeekyear(TestDateTime_Properties.java:894)

testGet_DateTimeFieldType(org.joda.time.TestMutableDateTime_Basics)  Time elapsed: 0.001 sec  <<< FAILURE!
junit.framework.AssertionFailedError: expected:<23> but was:<653918209>
	at junit.framework.Assert.fail(Assert.java:47)
	at junit.framework.Assert.failNotEquals(Assert.java:280)
	at junit.framework.Assert.assertEquals(Assert.java:64)
	at junit.framework.Assert.assertEquals(Assert.java:198)
	at junit.framework.Assert.assertEquals(Assert.java:204)
	at org.joda.time.TestMutableDateTime_Basics.testGet_DateTimeFieldType(TestMutableDateTime_Basics.java:161)

testGet_DateTimeField(org.joda.time.TestMutableDateTime_Basics)  Time elapsed: 0 sec  <<< FAILURE!
junit.framework.AssertionFailedError: expected:<23> but was:<653918209>
	at junit.framework.Assert.fail(Assert.java:47)
	at junit.framework.Assert.failNotEquals(Assert.java:280)
	at junit.framework.Assert.assertEquals(Assert.java:64)
	at junit.framework.Assert.assertEquals(Assert.java:198)
	at junit.framework.Assert.assertEquals(Assert.java:204)
	at org.joda.time.TestMutableDateTime_Basics.testGet_DateTimeField(TestMutableDateTime_Basics.java:131)

testGetMethods(org.joda.time.TestMutableDateTime_Basics)  Time elapsed: 0.001 sec  <<< FAILURE!
junit.framework.AssertionFailedError: expected:<23> but was:<653918209>
	at junit.framework.Assert.fail(Assert.java:47)
	at junit.framework.Assert.failNotEquals(Assert.java:280)
	at junit.framework.Assert.assertEquals(Assert.java:64)
	at junit.framework.Assert.assertEquals(Assert.java:198)
	at junit.framework.Assert.assertEquals(Assert.java:204)
	at org.joda.time.TestMutableDateTime_Basics.testGetMethods(TestMutableDateTime_Basics.java:196)

testSetWeekyear_int1(org.joda.time.TestMutableDateTime_Sets)  Time elapsed: 0 sec  <<< ERROR!
org.joda.time.IllegalFieldValueException: Value 2001 for weekyear is not supported: Illegal instant due to time zone offset transition (daylight savings time 'gap'): 7538123-05-02T05:06:07.008 (Europe/London)
	at org.joda.time.chrono.ZonedChronology$ZonedDateTimeField.set(ZonedChronology.java:486)
	at org.joda.time.MutableDateTime.setWeekyear(MutableDateTime.java:674)
	at org.joda.time.TestMutableDateTime_Sets.testSetWeekyear_int1(TestMutableDateTime_Sets.java:519)
Caused by: org.joda.time.IllegalInstantException: Illegal instant due to time zone offset transition (daylight savings time 'gap'): 7538123-05-02T05:06:07.008 (Europe/London)
	at org.joda.time.chrono.ZonedChronology$ZonedDateTimeField.set(ZonedChronology.java:485)
	... 28 more

testSetWeekOfWeekyear_int1(org.joda.time.TestMutableDateTime_Sets)  Time elapsed: 0.001 sec  <<< ERROR!
org.joda.time.IllegalFieldValueException: Value 2 for weekOfWeekyear is not supported: Illegal instant due to time zone offset transition (daylight savings time 'gap'): 20067555-01-02T05:06:07.008 (Europe/London)
	at org.joda.time.chrono.ZonedChronology$ZonedDateTimeField.set(ZonedChronology.java:486)
	at org.joda.time.MutableDateTime.setWeekOfWeekyear(MutableDateTime.java:720)
	at org.joda.time.TestMutableDateTime_Sets.testSetWeekOfWeekyear_int1(TestMutableDateTime_Sets.java:526)
Caused by: org.joda.time.IllegalInstantException: Illegal instant due to time zone offset transition (daylight savings time 'gap'): 20067555-01-02T05:06:07.008 (Europe/London)
	at org.joda.time.chrono.ZonedChronology$ZonedDateTimeField.set(ZonedChronology.java:485)
	... 28 more

testAddWeekyears_int1(org.joda.time.TestMutableDateTime_Adds)  Time elapsed: 0 sec  <<< FAILURE!
junit.framework.ComparisonFailure: expected:<[2001-06-10]T05:06:07.008+01:00> but was:<[7538123-05-02]T05:06:07.008+01:00>
	at junit.framework.Assert.assertEquals(Assert.java:81)
	at junit.framework.Assert.assertEquals(Assert.java:87)
	at org.joda.time.TestMutableDateTime_Adds.testAddWeekyears_int1(TestMutableDateTime_Adds.java:278)

testPropertySetWeekOfWeekyear(org.joda.time.TestMutableDateTime_Properties)  Time elapsed: 0.001 sec  <<< ERROR!
org.joda.time.IllegalFieldValueException: Value 4 for weekOfWeekyear is not supported: Illegal instant due to time zone offset transition (daylight savings time 'gap'): 21404590-08-30T00:00:00.000 (Europe/London)
	at org.joda.time.chrono.ZonedChronology$ZonedDateTimeField.set(ZonedChronology.java:486)
	at org.joda.time.MutableDateTime$Property.set(MutableDateTime.java:1384)
	at org.joda.time.TestMutableDateTime_Properties.testPropertySetWeekOfWeekyear(TestMutableDateTime_Properties.java:431)
Caused by: org.joda.time.IllegalInstantException: Illegal instant due to time zone offset transition (daylight savings time 'gap'): 21404590-08-30T00:00:00.000 (Europe/London)
	at org.joda.time.chrono.ZonedChronology$ZonedDateTimeField.set(ZonedChronology.java:485)
	... 28 more

testPropertySetTextWeekOfWeekyear(org.joda.time.TestMutableDateTime_Properties)  Time elapsed: 0 sec  <<< FAILURE!
junit.framework.ComparisonFailure: expected:<2[004-01-19T00:00:00.000Z]> but was:<2[1404590-08-30T00:00:00.000+01:00]>
	at junit.framework.Assert.assertEquals(Assert.java:81)
	at junit.framework.Assert.assertEquals(Assert.java:87)
	at org.joda.time.TestMutableDateTime_Properties.testPropertySetTextWeekOfWeekyear(TestMutableDateTime_Properties.java:438)

testPropertyGetWeekOfWeekyear(org.joda.time.TestMutableDateTime_Properties)  Time elapsed: 0 sec  <<< FAILURE!
junit.framework.AssertionFailedError: expected:<24> but was:<-330301439>
	at junit.framework.Assert.fail(Assert.java:47)
	at junit.framework.Assert.failNotEquals(Assert.java:280)
	at junit.framework.Assert.assertEquals(Assert.java:64)
	at junit.framework.Assert.assertEquals(Assert.java:198)
	at junit.framework.Assert.assertEquals(Assert.java:204)
	at org.joda.time.TestMutableDateTime_Properties.testPropertyGetWeekOfWeekyear(TestMutableDateTime_Properties.java:403)

testPropertyAddWrapFieldWeekOfWeekyear(org.joda.time.TestMutableDateTime_Properties)  Time elapsed: 0 sec  <<< FAILURE!
junit.framework.ComparisonFailure: expected:<2[003-12]-29T00:00:00.000Z> but was:<2[1404590-11]-29T00:00:00.000Z>
	at junit.framework.Assert.assertEquals(Assert.java:81)
	at junit.framework.Assert.assertEquals(Assert.java:87)
	at org.joda.time.TestMutableDateTime_Properties.testPropertyAddWrapFieldWeekOfWeekyear(TestMutableDateTime_Properties.java:426)

testGet_DateTimeFieldType(org.joda.time.TestDateMidnight_Basics)  Time elapsed: 0.001 sec  <<< FAILURE!
junit.framework.AssertionFailedError: expected:<23> but was:<-1509949439>
	at junit.framework.Assert.fail(Assert.java:47)
	at junit.framework.Assert.failNotEquals(Assert.java:280)
	at junit.framework.Assert.assertEquals(Assert.java:64)
	at junit.framework.Assert.assertEquals(Assert.java:198)
	at junit.framework.Assert.assertEquals(Assert.java:204)
	at org.joda.time.TestDateMidnight_Basics.testGet_DateTimeFieldType(TestDateMidnight_Basics.java:192)

testGet_DateTimeField(org.joda.time.TestDateMidnight_Basics)  Time elapsed: 0.001 sec  <<< FAILURE!
junit.framework.AssertionFailedError: expected:<23> but was:<-1509949439>
	at junit.framework.Assert.fail(Assert.java:47)
	at junit.framework.Assert.failNotEquals(Assert.java:280)
	at junit.framework.Assert.assertEquals(Assert.java:64)
	at junit.framework.Assert.assertEquals(Assert.java:198)
	at junit.framework.Assert.assertEquals(Assert.java:204)
	at org.joda.time.TestDateMidnight_Basics.testGet_DateTimeField(TestDateMidnight_Basics.java:162)

testGetters(org.joda.time.TestDateMidnight_Basics)  Time elapsed: 0 sec  <<< FAILURE!
junit.framework.AssertionFailedError: expected:<23> but was:<-1509949439>
	at junit.framework.Assert.fail(Assert.java:47)
	at junit.framework.Assert.failNotEquals(Assert.java:280)
	at junit.framework.Assert.assertEquals(Assert.java:64)
	at junit.framework.Assert.assertEquals(Assert.java:198)
	at junit.framework.Assert.assertEquals(Assert.java:204)
	at org.joda.time.TestDateMidnight_Basics.testGetters(TestDateMidnight_Basics.java:228)

testWithers(org.joda.time.TestDateMidnight_Basics)  Time elapsed: 0.001 sec  <<< ERROR!
org.joda.time.IllegalFieldValueException: Value 6 for weekOfWeekyear is not supported: Illegal instant due to time zone offset transition (daylight savings time 'gap'): 13868434-10-24T00:00:00.000 (Europe/London)
	at org.joda.time.chrono.ZonedChronology$ZonedDateTimeField.set(ZonedChronology.java:486)
	at org.joda.time.DateMidnight.withWeekOfWeekyear(DateMidnight.java:1038)
	at org.joda.time.TestDateMidnight_Basics.testWithers(TestDateMidnight_Basics.java:247)
Caused by: org.joda.time.IllegalInstantException: Illegal instant due to time zone offset transition (daylight savings time 'gap'): 13868434-10-24T00:00:00.000 (Europe/London)
	at org.joda.time.chrono.ZonedChronology$ZonedDateTimeField.set(ZonedChronology.java:485)
	... 28 more

testPropertyGetWeekOfWeekyear(org.joda.time.TestDateMidnight_Properties)  Time elapsed: 0.001 sec  <<< FAILURE!
junit.framework.AssertionFailedError: expected:<24> but was:<-330301439>
	at junit.framework.Assert.fail(Assert.java:47)
	at junit.framework.Assert.failNotEquals(Assert.java:280)
	at junit.framework.Assert.assertEquals(Assert.java:64)
	at junit.framework.Assert.assertEquals(Assert.java:198)
	at junit.framework.Assert.assertEquals(Assert.java:204)
	at org.joda.time.TestDateMidnight_Properties.testPropertyGetWeekOfWeekyear(TestDateMidnight_Properties.java:438)

testGet_DateTimeFieldType(org.joda.time.TestLocalDateTime_Basics)  Time elapsed: 0.001 sec  <<< FAILURE!
junit.framework.AssertionFailedError: expected:<24> but was:<641949697>
	at junit.framework.Assert.fail(Assert.java:47)
	at junit.framework.Assert.failNotEquals(Assert.java:280)
	at junit.framework.Assert.assertEquals(Assert.java:64)
	at junit.framework.Assert.assertEquals(Assert.java:198)
	at junit.framework.Assert.assertEquals(Assert.java:204)
	at org.joda.time.TestLocalDateTime_Basics.testGet_DateTimeFieldType(TestLocalDateTime_Basics.java:123)

testGetters(org.joda.time.TestLocalDateTime_Basics)  Time elapsed: 0 sec  <<< FAILURE!
junit.framework.AssertionFailedError: expected:<24> but was:<641949697>
	at junit.framework.Assert.fail(Assert.java:47)
	at junit.framework.Assert.failNotEquals(Assert.java:280)
	at junit.framework.Assert.assertEquals(Assert.java:64)
	at junit.framework.Assert.assertEquals(Assert.java:198)
	at junit.framework.Assert.assertEquals(Assert.java:204)
	at org.joda.time.TestLocalDateTime_Basics.testGetters(TestLocalDateTime_Basics.java:723)

testWithers(org.joda.time.TestLocalDateTime_Basics)  Time elapsed: 0.001 sec  <<< ERROR!
org.joda.time.IllegalFieldValueException: Value 1519607809 for weekOfWeekyear must be in the range [1,52]
	at org.joda.time.field.FieldUtils.verifyValueBounds(FieldUtils.java:234)
	at org.joda.time.field.PreciseDurationDateTimeField.set(PreciseDurationDateTimeField.java:79)
	at org.joda.time.chrono.GJChronology.convertByWeekyear(GJChronology.java:95)
	at org.joda.time.chrono.GJChronology.gregorianToJulianByWeekyear(GJChronology.java:589)
	at org.joda.time.chrono.GJChronology$CutoverField.gregorianToJulian(GJChronology.java:929)
	at org.joda.time.chrono.GJChronology$CutoverField.set(GJChronology.java:731)
	at org.joda.time.LocalDateTime.withWeekOfWeekyear(LocalDateTime.java:1809)
	at org.joda.time.TestLocalDateTime_Basics.testWithers(TestLocalDateTime_Basics.java:744)

testGet_DateTimeFieldType(org.joda.time.TestLocalDate_Basics)  Time elapsed: 0.001 sec  <<< FAILURE!
junit.framework.AssertionFailedError: expected:<24> but was:<-723517439>
	at junit.framework.Assert.fail(Assert.java:47)
	at junit.framework.Assert.failNotEquals(Assert.java:280)
	at junit.framework.Assert.assertEquals(Assert.java:64)
	at junit.framework.Assert.assertEquals(Assert.java:198)
	at junit.framework.Assert.assertEquals(Assert.java:204)
	at org.joda.time.TestLocalDate_Basics.testGet_DateTimeFieldType(TestLocalDate_Basics.java:128)

testGetters(org.joda.time.TestLocalDate_Basics)  Time elapsed: 0.001 sec  <<< FAILURE!
junit.framework.AssertionFailedError: expected:<24> but was:<-723517439>
	at junit.framework.Assert.fail(Assert.java:47)
	at junit.framework.Assert.failNotEquals(Assert.java:280)
	at junit.framework.Assert.assertEquals(Assert.java:64)
	at junit.framework.Assert.assertEquals(Assert.java:198)
	at junit.framework.Assert.assertEquals(Assert.java:204)
	at org.joda.time.TestLocalDate_Basics.testGetters(TestLocalDate_Basics.java:630)

testWithers(org.joda.time.TestLocalDate_Basics)  Time elapsed: 0 sec  <<< FAILURE!
junit.framework.AssertionFailedError: expected:<1970> but was:<13868434>
	at junit.framework.Assert.fail(Assert.java:47)
	at junit.framework.Assert.failNotEquals(Assert.java:280)
	at junit.framework.Assert.assertEquals(Assert.java:64)
	at junit.framework.Assert.assertEquals(Assert.java:198)
	at junit.framework.Assert.assertEquals(Assert.java:204)
	at org.joda.time.TestLocalDate_Basics.check(TestLocalDate_Basics.java:1155)
	at org.joda.time.TestLocalDate_Basics.testWithers(TestLocalDate_Basics.java:646)

testWOW(org.joda.time.TestDateTimeComparator)  Time elapsed: 0 sec  <<< FAILURE!
junit.framework.AssertionFailedError: WOWM1a expected:<-1> but was:<0>
	at junit.framework.Assert.fail(Assert.java:47)
	at junit.framework.Assert.failNotEquals(Assert.java:280)
	at junit.framework.Assert.assertEquals(Assert.java:64)
	at junit.framework.Assert.assertEquals(Assert.java:198)
	at org.joda.time.TestDateTimeComparator.testWOW(TestDateTimeComparator.java:525)

testListWOW(org.joda.time.TestDateTimeComparator)  Time elapsed: 0.001 sec  <<< FAILURE!
junit.framework.AssertionFailedError: ListWOW expected:<true> but was:<false>
	at junit.framework.Assert.fail(Assert.java:47)
	at junit.framework.Assert.failNotEquals(Assert.java:280)
	at junit.framework.Assert.assertEquals(Assert.java:64)
	at junit.framework.Assert.assertEquals(Assert.java:146)
	at org.joda.time.TestDateTimeComparator.testListWOW(TestDateTimeComparator.java:771)

testKeyYears(org.joda.time.chrono.TestBuddhistChronology)  Time elapsed: 0.001 sec  <<< FAILURE!
junit.framework.AssertionFailedError: expected:<2126> but was:<2125>
	at junit.framework.Assert.fail(Assert.java:47)
	at junit.framework.Assert.failNotEquals(Assert.java:280)
	at junit.framework.Assert.assertEquals(Assert.java:64)
	at junit.framework.Assert.assertEquals(Assert.java:198)
	at junit.framework.Assert.assertEquals(Assert.java:204)
	at org.joda.time.chrono.TestBuddhistChronology.testKeyYears(TestBuddhistChronology.java:322)

testCutoverAddWeekyears(org.joda.time.chrono.TestGJChronology)  Time elapsed: 0 sec  <<< ERROR!
org.joda.time.IllegalFieldValueException: Cannot parse "1582-W01-1": Value 1605369857 for weekOfWeekyear must be in the range [1,52]
	at org.joda.time.field.FieldUtils.verifyValueBounds(FieldUtils.java:234)
	at org.joda.time.field.PreciseDurationDateTimeField.set(PreciseDurationDateTimeField.java:79)
	at org.joda.time.chrono.GJChronology.convertByWeekyear(GJChronology.java:95)
	at org.joda.time.chrono.GJChronology.gregorianToJulianByWeekyear(GJChronology.java:589)
	at org.joda.time.chrono.GJChronology$CutoverField.gregorianToJulian(GJChronology.java:929)
	at org.joda.time.chrono.GJChronology$CutoverField.set(GJChronology.java:731)
	at org.joda.time.format.DateTimeParserBucket$SavedField.set(DateTimeParserBucket.java:568)
	at org.joda.time.format.DateTimeParserBucket.computeMillis(DateTimeParserBucket.java:447)
	at org.joda.time.format.DateTimeParserBucket.doParseMillis(DateTimeParserBucket.java:182)
	at org.joda.time.format.DateTimeFormatter.parseMillis(DateTimeFormatter.java:780)
	at org.joda.time.convert.StringConverter.getInstantMillis(StringConverter.java:65)
	at org.joda.time.base.BaseDateTime.<init>(BaseDateTime.java:175)
	at org.joda.time.DateTime.<init>(DateTime.java:302)
	at org.joda.time.chrono.TestGJChronology.testAdd(TestGJChronology.java:482)
	at org.joda.time.chrono.TestGJChronology.testCutoverAddWeekyears(TestGJChronology.java:401)

testCutoverAddWeeks(org.joda.time.chrono.TestGJChronology)  Time elapsed: 0.001 sec  <<< ERROR!
org.joda.time.IllegalFieldValueException: Cannot parse "1582-W01-1": Value 1605369857 for weekOfWeekyear must be in the range [1,52]
	at org.joda.time.field.FieldUtils.verifyValueBounds(FieldUtils.java:234)
	at org.joda.time.field.PreciseDurationDateTimeField.set(PreciseDurationDateTimeField.java:79)
	at org.joda.time.chrono.GJChronology.convertByWeekyear(GJChronology.java:95)
	at org.joda.time.chrono.GJChronology.gregorianToJulianByWeekyear(GJChronology.java:589)
	at org.joda.time.chrono.GJChronology$CutoverField.gregorianToJulian(GJChronology.java:929)
	at org.joda.time.chrono.GJChronology$CutoverField.set(GJChronology.java:731)
	at org.joda.time.format.DateTimeParserBucket$SavedField.set(DateTimeParserBucket.java:568)
	at org.joda.time.format.DateTimeParserBucket.computeMillis(DateTimeParserBucket.java:447)
	at org.joda.time.format.DateTimeParserBucket.doParseMillis(DateTimeParserBucket.java:182)
	at org.joda.time.format.DateTimeFormatter.parseMillis(DateTimeFormatter.java:780)
	at org.joda.time.convert.StringConverter.getInstantMillis(StringConverter.java:65)
	at org.joda.time.base.BaseDateTime.<init>(BaseDateTime.java:175)
	at org.joda.time.DateTime.<init>(DateTime.java:302)
	at org.joda.time.chrono.TestGJChronology.testAdd(TestGJChronology.java:482)
	at org.joda.time.chrono.TestGJChronology.testCutoverAddWeeks(TestGJChronology.java:448)

test_plusWeekyears_positiveToZero_crossCutover(org.joda.time.chrono.TestGJDate)  Time elapsed: 0 sec  <<< ERROR!
org.joda.time.IllegalFieldValueException: Value -1449132031 for weekOfWeekyear must be in the range [1,52]
	at org.joda.time.field.FieldUtils.verifyValueBounds(FieldUtils.java:234)
	at org.joda.time.field.PreciseDurationDateTimeField.set(PreciseDurationDateTimeField.java:79)
	at org.joda.time.chrono.GJChronology$CutoverField.set(GJChronology.java:727)
	at org.joda.time.LocalDate.withWeekOfWeekyear(LocalDate.java:1676)
	at org.joda.time.chrono.TestGJDate.test_plusWeekyears_positiveToZero_crossCutover(TestGJDate.java:117)

test_plusWeekyears_positiveToNegative_crossCutover(org.joda.time.chrono.TestGJDate)  Time elapsed: 0 sec  <<< ERROR!
org.joda.time.IllegalFieldValueException: Value -1449132031 for weekOfWeekyear must be in the range [1,52]
	at org.joda.time.field.FieldUtils.verifyValueBounds(FieldUtils.java:234)
	at org.joda.time.field.PreciseDurationDateTimeField.set(PreciseDurationDateTimeField.java:79)
	at org.joda.time.chrono.GJChronology$CutoverField.set(GJChronology.java:727)
	at org.joda.time.LocalDate.withWeekOfWeekyear(LocalDate.java:1676)
	at org.joda.time.chrono.TestGJDate.test_plusWeekyears_positiveToNegative_crossCutover(TestGJDate.java:123)

testChronology(org.joda.time.chrono.gj.MainTest)  Time elapsed: 0.004 sec  <<< FAILURE!
junit.framework.AssertionFailedError
	at junit.framework.Assert.fail(Assert.java:47)
	at org.joda.time.chrono.gj.MainTest.testChronology(MainTest.java:158)

testChronology(org.joda.time.chrono.gj.MainTest)  Time elapsed: 0.004 sec  <<< FAILURE!
junit.framework.AssertionFailedError
	at junit.framework.Assert.fail(Assert.java:47)
	at org.joda.time.chrono.gj.MainTest.testChronology(MainTest.java:158)

testGetInstantMillis_Object(org.joda.time.convert.TestStringConverter)  Time elapsed: 0.001 sec  <<< FAILURE!
junit.framework.AssertionFailedError: expected:<1086710400000> but was:<51369627744000000>
	at junit.framework.Assert.fail(Assert.java:47)
	at junit.framework.Assert.failNotEquals(Assert.java:280)
	at junit.framework.Assert.assertEquals(Assert.java:64)
	at junit.framework.Assert.assertEquals(Assert.java:133)
	at junit.framework.Assert.assertEquals(Assert.java:139)
	at org.joda.time.convert.TestStringConverter.testGetInstantMillis_Object(TestStringConverter.java:129)

testParseLocalDate_weekyear_month_week_2010(org.joda.time.format.TestDateTimeFormatter)  Time elapsed: 0.001 sec  <<< ERROR!
org.joda.time.IllegalFieldValueException: Cannot parse "2010-01-01": Value 1605369857 for weekOfWeekyear must be in the range [1,52]
	at org.joda.time.field.FieldUtils.verifyValueBounds(FieldUtils.java:234)
	at org.joda.time.field.PreciseDurationDateTimeField.set(PreciseDurationDateTimeField.java:79)
	at org.joda.time.chrono.GJChronology.convertByWeekyear(GJChronology.java:95)
	at org.joda.time.chrono.GJChronology.gregorianToJulianByWeekyear(GJChronology.java:589)
	at org.joda.time.chrono.GJChronology$CutoverField.gregorianToJulian(GJChronology.java:929)
	at org.joda.time.chrono.GJChronology$CutoverField.set(GJChronology.java:731)
	at org.joda.time.format.DateTimeParserBucket$SavedField.set(DateTimeParserBucket.java:568)
	at org.joda.time.format.DateTimeParserBucket.computeMillis(DateTimeParserBucket.java:447)
	at org.joda.time.format.DateTimeParserBucket.computeMillis(DateTimeParserBucket.java:411)
	at org.joda.time.format.DateTimeFormatter.parseLocalDateTime(DateTimeFormatter.java:841)
	at org.joda.time.format.DateTimeFormatter.parseLocalDate(DateTimeFormatter.java:798)
	at org.joda.time.format.TestDateTimeFormatter.testParseLocalDate_weekyear_month_week_2010(TestDateTimeFormatter.java:428)

testParseLocalDate_weekyear_month_week_2011(org.joda.time.format.TestDateTimeFormatter)  Time elapsed: 0 sec  <<< ERROR!
org.joda.time.IllegalFieldValueException: Cannot parse "2011-01-01": Value -1811939327 for weekOfWeekyear must be in the range [1,52]
	at org.joda.time.field.FieldUtils.verifyValueBounds(FieldUtils.java:234)
	at org.joda.time.field.PreciseDurationDateTimeField.set(PreciseDurationDateTimeField.java:79)
	at org.joda.time.chrono.GJChronology.convertByWeekyear(GJChronology.java:95)
	at org.joda.time.chrono.GJChronology.gregorianToJulianByWeekyear(GJChronology.java:589)
	at org.joda.time.chrono.GJChronology$CutoverField.gregorianToJulian(GJChronology.java:929)
	at org.joda.time.chrono.GJChronology$CutoverField.set(GJChronology.java:731)
	at org.joda.time.format.DateTimeParserBucket$SavedField.set(DateTimeParserBucket.java:568)
	at org.joda.time.format.DateTimeParserBucket.computeMillis(DateTimeParserBucket.java:447)
	at org.joda.time.format.DateTimeParserBucket.computeMillis(DateTimeParserBucket.java:411)
	at org.joda.time.format.DateTimeFormatter.parseLocalDateTime(DateTimeFormatter.java:841)
	at org.joda.time.format.DateTimeFormatter.parseLocalDate(DateTimeFormatter.java:798)
	at org.joda.time.format.TestDateTimeFormatter.testParseLocalDate_weekyear_month_week_2011(TestDateTimeFormatter.java:434)

testParseLocalDate_weekyear_month_week_2012(org.joda.time.format.TestDateTimeFormatter)  Time elapsed: 0.001 sec  <<< FAILURE!
junit.framework.AssertionFailedError: expected:<2012-01-02> but was:<13908668-04-27>
	at junit.framework.Assert.fail(Assert.java:47)
	at junit.framework.Assert.failNotEquals(Assert.java:280)
	at junit.framework.Assert.assertEquals(Assert.java:64)
	at junit.framework.Assert.assertEquals(Assert.java:71)
	at org.joda.time.format.TestDateTimeFormatter.testParseLocalDate_weekyear_month_week_2012(TestDateTimeFormatter.java:440)

testParseLocalDate_year_month_week_2010(org.joda.time.format.TestDateTimeFormatter)  Time elapsed: 0.001 sec  <<< ERROR!
org.joda.time.IllegalFieldValueException: Cannot parse "2010-01-01": Value 1333788673 for weekOfWeekyear must be in the range [1,52]
	at org.joda.time.field.FieldUtils.verifyValueBounds(FieldUtils.java:234)
	at org.joda.time.field.PreciseDurationDateTimeField.set(PreciseDurationDateTimeField.java:79)
	at org.joda.time.chrono.GJChronology.convertByWeekyear(GJChronology.java:95)
	at org.joda.time.chrono.GJChronology.gregorianToJulianByWeekyear(GJChronology.java:589)
	at org.joda.time.chrono.GJChronology$CutoverField.gregorianToJulian(GJChronology.java:929)
	at org.joda.time.chrono.GJChronology$CutoverField.set(GJChronology.java:731)
	at org.joda.time.format.DateTimeParserBucket$SavedField.set(DateTimeParserBucket.java:568)
	at org.joda.time.format.DateTimeParserBucket.computeMillis(DateTimeParserBucket.java:451)
	at org.joda.time.format.DateTimeParserBucket.computeMillis(DateTimeParserBucket.java:411)
	at org.joda.time.format.DateTimeFormatter.parseLocalDateTime(DateTimeFormatter.java:841)
	at org.joda.time.format.DateTimeFormatter.parseLocalDate(DateTimeFormatter.java:798)
	at org.joda.time.format.TestDateTimeFormatter.testParseLocalDate_year_month_week_2010(TestDateTimeFormatter.java:454)

testParseLocalDate_year_month_week_2011(org.joda.time.format.TestDateTimeFormatter)  Time elapsed: 0 sec  <<< FAILURE!
junit.framework.AssertionFailedError: expected:<2011-01-03> but was:<-7533958-10-29>
	at junit.framework.Assert.fail(Assert.java:47)
	at junit.framework.Assert.failNotEquals(Assert.java:280)
	at junit.framework.Assert.assertEquals(Assert.java:64)
	at junit.framework.Assert.assertEquals(Assert.java:71)
	at org.joda.time.format.TestDateTimeFormatter.testParseLocalDate_year_month_week_2011(TestDateTimeFormatter.java:460)

testParseLocalDate_year_month_week_2012(org.joda.time.format.TestDateTimeFormatter)  Time elapsed: 0 sec  <<< FAILURE!
junit.framework.AssertionFailedError: expected:<2012-01-02> but was:<-7533957-10-27>
	at junit.framework.Assert.fail(Assert.java:47)
	at junit.framework.Assert.failNotEquals(Assert.java:280)
	at junit.framework.Assert.assertEquals(Assert.java:64)
	at junit.framework.Assert.assertEquals(Assert.java:71)
	at org.joda.time.format.TestDateTimeFormatter.testParseLocalDate_year_month_week_2012(TestDateTimeFormatter.java:466)

testParseLocalDate_year_month_week_2013(org.joda.time.format.TestDateTimeFormatter)  Time elapsed: 0.001 sec  <<< ERROR!
org.joda.time.IllegalFieldValueException: Cannot parse "2013-01-01": Value -1690304511 for weekOfWeekyear must be in the range [1,52]
	at org.joda.time.field.FieldUtils.verifyValueBounds(FieldUtils.java:234)
	at org.joda.time.field.PreciseDurationDateTimeField.set(PreciseDurationDateTimeField.java:79)
	at org.joda.time.chrono.GJChronology.convertByWeekyear(GJChronology.java:95)
	at org.joda.time.chrono.GJChronology.gregorianToJulianByWeekyear(GJChronology.java:589)
	at org.joda.time.chrono.GJChronology$CutoverField.gregorianToJulian(GJChronology.java:929)
	at org.joda.time.chrono.GJChronology$CutoverField.set(GJChronology.java:731)
	at org.joda.time.format.DateTimeParserBucket$SavedField.set(DateTimeParserBucket.java:568)
	at org.joda.time.format.DateTimeParserBucket.computeMillis(DateTimeParserBucket.java:451)
	at org.joda.time.format.DateTimeParserBucket.computeMillis(DateTimeParserBucket.java:411)
	at org.joda.time.format.DateTimeFormatter.parseLocalDateTime(DateTimeFormatter.java:841)
	at org.joda.time.format.DateTimeFormatter.parseLocalDate(DateTimeFormatter.java:798)
	at org.joda.time.format.TestDateTimeFormatter.testParseLocalDate_year_month_week_2013(TestDateTimeFormatter.java:472)

testParseLocalDate_year_month_week_2014(org.joda.time.format.TestDateTimeFormatter)  Time elapsed: 0.001 sec  <<< ERROR!
org.joda.time.IllegalFieldValueException: Cannot parse "2014-01-01": Value 999292929 for weekOfWeekyear must be in the range [1,52]
	at org.joda.time.field.FieldUtils.verifyValueBounds(FieldUtils.java:234)
	at org.joda.time.field.PreciseDurationDateTimeField.set(PreciseDurationDateTimeField.java:79)
	at org.joda.time.chrono.GJChronology.convertByWeekyear(GJChronology.java:95)
	at org.joda.time.chrono.GJChronology.gregorianToJulianByWeekyear(GJChronology.java:589)
	at org.joda.time.chrono.GJChronology$CutoverField.gregorianToJulian(GJChronology.java:929)
	at org.joda.time.chrono.GJChronology$CutoverField.set(GJChronology.java:731)
	at org.joda.time.format.DateTimeParserBucket$SavedField.set(DateTimeParserBucket.java:568)
	at org.joda.time.format.DateTimeParserBucket.computeMillis(DateTimeParserBucket.java:447)
	at org.joda.time.format.DateTimeParserBucket.computeMillis(DateTimeParserBucket.java:411)
	at org.joda.time.format.DateTimeFormatter.parseLocalDateTime(DateTimeFormatter.java:841)
	at org.joda.time.format.DateTimeFormatter.parseLocalDate(DateTimeFormatter.java:798)
	at org.joda.time.format.TestDateTimeFormatter.testParseLocalDate_year_month_week_2014(TestDateTimeFormatter.java:478)

testParseLocalDate_year_month_week_2015(org.joda.time.format.TestDateTimeFormatter)  Time elapsed: 0 sec  <<< ERROR!
org.joda.time.IllegalFieldValueException: Cannot parse "2015-01-01": Value -2024800255 for weekOfWeekyear must be in the range [1,52]
	at org.joda.time.field.FieldUtils.verifyValueBounds(FieldUtils.java:234)
	at org.joda.time.field.PreciseDurationDateTimeField.set(PreciseDurationDateTimeField.java:79)
	at org.joda.time.chrono.GJChronology.convertByWeekyear(GJChronology.java:95)
	at org.joda.time.chrono.GJChronology.gregorianToJulianByWeekyear(GJChronology.java:589)
	at org.joda.time.chrono.GJChronology$CutoverField.gregorianToJulian(GJChronology.java:929)
	at org.joda.time.chrono.GJChronology$CutoverField.set(GJChronology.java:731)
	at org.joda.time.format.DateTimeParserBucket$SavedField.set(DateTimeParserBucket.java:568)
	at org.joda.time.format.DateTimeParserBucket.computeMillis(DateTimeParserBucket.java:447)
	at org.joda.time.format.DateTimeParserBucket.computeMillis(DateTimeParserBucket.java:411)
	at org.joda.time.format.DateTimeFormatter.parseLocalDateTime(DateTimeFormatter.java:841)
	at org.joda.time.format.DateTimeFormatter.parseLocalDate(DateTimeFormatter.java:798)
	at org.joda.time.format.TestDateTimeFormatter.testParseLocalDate_year_month_week_2015(TestDateTimeFormatter.java:484)

testParseLocalDate_year_month_week_2016(org.joda.time.format.TestDateTimeFormatter)  Time elapsed: 0.001 sec  <<< ERROR!
org.joda.time.IllegalFieldValueException: Cannot parse "2016-01-01": Value 1333788673 for weekOfWeekyear must be in the range [1,53]
	at org.joda.time.field.FieldUtils.verifyValueBounds(FieldUtils.java:234)
	at org.joda.time.field.PreciseDurationDateTimeField.set(PreciseDurationDateTimeField.java:79)
	at org.joda.time.chrono.GJChronology.convertByWeekyear(GJChronology.java:95)
	at org.joda.time.chrono.GJChronology.gregorianToJulianByWeekyear(GJChronology.java:589)
	at org.joda.time.chrono.GJChronology$CutoverField.gregorianToJulian(GJChronology.java:929)
	at org.joda.time.chrono.GJChronology$CutoverField.set(GJChronology.java:731)
	at org.joda.time.format.DateTimeParserBucket$SavedField.set(DateTimeParserBucket.java:568)
	at org.joda.time.format.DateTimeParserBucket.computeMillis(DateTimeParserBucket.java:451)
	at org.joda.time.format.DateTimeParserBucket.computeMillis(DateTimeParserBucket.java:411)
	at org.joda.time.format.DateTimeFormatter.parseLocalDateTime(DateTimeFormatter.java:841)
	at org.joda.time.format.DateTimeFormatter.parseLocalDate(DateTimeFormatter.java:798)
	at org.joda.time.format.TestDateTimeFormatter.testParseLocalDate_year_month_week_2016(TestDateTimeFormatter.java:490)

testFormat_weekyearOfEra_twoDigit(org.joda.time.format.TestDateTimeFormat)  Time elapsed: 0 sec  <<< FAILURE!
junit.framework.AssertionFailedError: expected:<2003-12-29T00:00:00.000Z> but was:<-30142484-10-23T00:00:00.000Z>
	at junit.framework.Assert.fail(Assert.java:47)
	at junit.framework.Assert.failNotEquals(Assert.java:280)
	at junit.framework.Assert.assertEquals(Assert.java:64)
	at junit.framework.Assert.assertEquals(Assert.java:71)
	at org.joda.time.format.TestDateTimeFormat.testFormat_weekyearOfEra_twoDigit(TestDateTimeFormat.java:392)

testFormat_weekOfWeekyear(org.joda.time.format.TestDateTimeFormat)  Time elapsed: 0.001 sec  <<< FAILURE!
junit.framework.ComparisonFailure: 2004-06-09T10:20:30.040Z expected:<[24]> but was:<[1035165697]>
	at junit.framework.Assert.assertEquals(Assert.java:81)
	at org.joda.time.format.TestDateTimeFormat.testFormat_weekOfWeekyear(TestDateTimeFormat.java:499)

testFormat_basicWeekDate(org.joda.time.format.TestISODateTimeFormat)  Time elapsed: 0.001 sec  <<< FAILURE!
junit.framework.ComparisonFailure: expected:<2004W[24]3> but was:<2004W[1035165697]3>
	at junit.framework.Assert.assertEquals(Assert.java:81)
	at junit.framework.Assert.assertEquals(Assert.java:87)
	at org.joda.time.format.TestISODateTimeFormat.testFormat_basicWeekDate(TestISODateTimeFormat.java:387)

testFormat_basicWeekDateTime(org.joda.time.format.TestISODateTimeFormat)  Time elapsed: 0 sec  <<< FAILURE!
junit.framework.ComparisonFailure: expected:<2004W[24]3T102030.040Z> but was:<2004W[1035165697]3T102030.040Z>
	at junit.framework.Assert.assertEquals(Assert.java:81)
	at junit.framework.Assert.assertEquals(Assert.java:87)
	at org.joda.time.format.TestISODateTimeFormat.testFormat_basicWeekDateTime(TestISODateTimeFormat.java:398)

testFormat_basicWeekDateTimeNoMillis(org.joda.time.format.TestISODateTimeFormat)  Time elapsed: 0.001 sec  <<< FAILURE!
junit.framework.ComparisonFailure: expected:<2004W[24]3T102030Z> but was:<2004W[1035165697]3T102030Z>
	at junit.framework.Assert.assertEquals(Assert.java:81)
	at junit.framework.Assert.assertEquals(Assert.java:87)
	at org.joda.time.format.TestISODateTimeFormat.testFormat_basicWeekDateTimeNoMillis(TestISODateTimeFormat.java:409)

testFormat_weekyearWeek(org.joda.time.format.TestISODateTimeFormat)  Time elapsed: 0.001 sec  <<< FAILURE!
junit.framework.ComparisonFailure: expected:<2004-W[24]> but was:<2004-W[1035165697]>
	at junit.framework.Assert.assertEquals(Assert.java:81)
	at junit.framework.Assert.assertEquals(Assert.java:87)
	at org.joda.time.format.TestISODateTimeFormat.testFormat_weekyearWeek(TestISODateTimeFormat.java:465)

testFormat_weekyearWeekDay(org.joda.time.format.TestISODateTimeFormat)  Time elapsed: 0 sec  <<< FAILURE!
junit.framework.ComparisonFailure: expected:<2004-W[24]-3> but was:<2004-W[1035165697]-3>
	at junit.framework.Assert.assertEquals(Assert.java:81)
	at junit.framework.Assert.assertEquals(Assert.java:87)
	at org.joda.time.format.TestISODateTimeFormat.testFormat_weekyearWeekDay(TestISODateTimeFormat.java:476)

testFormat_weekDate(org.joda.time.format.TestISODateTimeFormat)  Time elapsed: 0.001 sec  <<< FAILURE!
junit.framework.ComparisonFailure: expected:<2004-W[24]-3> but was:<2004-W[1035165697]-3>
	at junit.framework.Assert.assertEquals(Assert.java:81)
	at junit.framework.Assert.assertEquals(Assert.java:87)
	at org.joda.time.format.TestISODateTimeFormat.testFormat_weekDate(TestISODateTimeFormat.java:243)

testFormat_weekDateTime(org.joda.time.format.TestISODateTimeFormat)  Time elapsed: 0 sec  <<< FAILURE!
junit.framework.ComparisonFailure: expected:<2004-W[24]-3T10:20:30.040Z> but was:<2004-W[1035165697]-3T10:20:30.040Z>
	at junit.framework.Assert.assertEquals(Assert.java:81)
	at junit.framework.Assert.assertEquals(Assert.java:87)
	at org.joda.time.format.TestISODateTimeFormat.testFormat_weekDateTime(TestISODateTimeFormat.java:254)

testFormat_weekDateTimeNoMillis(org.joda.time.format.TestISODateTimeFormat)  Time elapsed: 0.001 sec  <<< FAILURE!
junit.framework.ComparisonFailure: expected:<2004-W[24]-3T10:20:30Z> but was:<2004-W[1035165697]-3T10:20:30Z>
	at junit.framework.Assert.assertEquals(Assert.java:81)
	at junit.framework.Assert.assertEquals(Assert.java:87)
	at org.joda.time.format.TestISODateTimeFormat.testFormat_weekDateTimeNoMillis(TestISODateTimeFormat.java:265)

test_basicWeekDate(org.joda.time.format.TestISODateTimeFormatParsing)  Time elapsed: 0 sec  <<< ERROR!
org.joda.time.IllegalFieldValueException: Value 27 for weekOfWeekyear is not supported: Illegal instant due to time zone offset transition (daylight savings time 'gap'): 21987386-07-06T00:00:00.000 (Europe/London)
	at org.joda.time.chrono.ZonedChronology$ZonedDateTimeField.set(ZonedChronology.java:486)
	at org.joda.time.DateTime.withWeekOfWeekyear(DateTime.java:1750)
	at org.joda.time.format.TestISODateTimeFormatParsing.test_basicWeekDate(TestISODateTimeFormatParsing.java:724)
Caused by: org.joda.time.IllegalInstantException: Illegal instant due to time zone offset transition (daylight savings time 'gap'): 21987386-07-06T00:00:00.000 (Europe/London)
	at org.joda.time.chrono.ZonedChronology$ZonedDateTimeField.set(ZonedChronology.java:485)
	... 28 more

test_basicWeekDateTime(org.joda.time.format.TestISODateTimeFormatParsing)  Time elapsed: 0.001 sec  <<< FAILURE!
junit.framework.AssertionFailedError: expected:<21026530-12-20T10:20:30.400Z> but was:<25648685-12-23T10:20:30.400Z>
	at junit.framework.Assert.fail(Assert.java:47)
	at junit.framework.Assert.failNotEquals(Assert.java:280)
	at junit.framework.Assert.assertEquals(Assert.java:64)
	at junit.framework.Assert.assertEquals(Assert.java:71)
	at org.joda.time.format.TestISODateTimeFormatParsing.assertParse(TestISODateTimeFormatParsing.java:841)
	at org.joda.time.format.TestISODateTimeFormatParsing.test_basicWeekDateTime(TestISODateTimeFormatParsing.java:734)

test_basicWeekDateTimeNoMillis(org.joda.time.format.TestISODateTimeFormatParsing)  Time elapsed: 0 sec  <<< FAILURE!
junit.framework.AssertionFailedError: expected:<-34421428-02-19T10:20:30.000Z> but was:<-29799273-02-23T10:20:30.000Z>
	at junit.framework.Assert.fail(Assert.java:47)
	at junit.framework.Assert.failNotEquals(Assert.java:280)
	at junit.framework.Assert.assertEquals(Assert.java:64)
	at junit.framework.Assert.assertEquals(Assert.java:71)
	at org.joda.time.format.TestISODateTimeFormatParsing.assertParse(TestISODateTimeFormatParsing.java:841)
	at org.joda.time.format.TestISODateTimeFormatParsing.test_basicWeekDateTimeNoMillis(TestISODateTimeFormatParsing.java:751)

test_weekDate(org.joda.time.format.TestISODateTimeFormatParsing)  Time elapsed: 0.001 sec  <<< ERROR!
org.joda.time.IllegalFieldValueException: Value 27 for weekOfWeekyear is not supported: Illegal instant due to time zone offset transition (daylight savings time 'gap'): 21987386-07-06T00:00:00.000 (Europe/London)
	at org.joda.time.chrono.ZonedChronology$ZonedDateTimeField.set(ZonedChronology.java:486)
	at org.joda.time.DateTime.withWeekOfWeekyear(DateTime.java:1750)
	at org.joda.time.format.TestISODateTimeFormatParsing.test_weekDate(TestISODateTimeFormatParsing.java:520)
Caused by: org.joda.time.IllegalInstantException: Illegal instant due to time zone offset transition (daylight savings time 'gap'): 21987386-07-06T00:00:00.000 (Europe/London)
	at org.joda.time.chrono.ZonedChronology$ZonedDateTimeField.set(ZonedChronology.java:485)
	... 28 more

test_weekDateTime(org.joda.time.format.TestISODateTimeFormatParsing)  Time elapsed: 0 sec  <<< FAILURE!
junit.framework.AssertionFailedError: expected:<21026530-12-20T10:20:30.400Z> but was:<25648685-12-23T10:20:30.400Z>
	at junit.framework.Assert.fail(Assert.java:47)
	at junit.framework.Assert.failNotEquals(Assert.java:280)
	at junit.framework.Assert.assertEquals(Assert.java:64)
	at junit.framework.Assert.assertEquals(Assert.java:71)
	at org.joda.time.format.TestISODateTimeFormatParsing.assertParse(TestISODateTimeFormatParsing.java:841)
	at org.joda.time.format.TestISODateTimeFormatParsing.test_weekDateTime(TestISODateTimeFormatParsing.java:533)

test_weekDateTimeNoMillis(org.joda.time.format.TestISODateTimeFormatParsing)  Time elapsed: 0.001 sec  <<< FAILURE!
junit.framework.AssertionFailedError: expected:<-34421428-02-19T10:20:30.000Z> but was:<-29799273-02-23T10:20:30.000Z>
	at junit.framework.Assert.fail(Assert.java:47)
	at junit.framework.Assert.failNotEquals(Assert.java:280)
	at junit.framework.Assert.assertEquals(Assert.java:64)
	at junit.framework.Assert.assertEquals(Assert.java:71)
	at org.joda.time.format.TestISODateTimeFormatParsing.assertParse(TestISODateTimeFormatParsing.java:841)
	at org.joda.time.format.TestISODateTimeFormatParsing.test_weekDateTimeNoMillis(TestISODateTimeFormatParsing.java:553)


Results :

Failed tests: 
  org.joda.time.TestDateMidnight_Basics#testGet_DateTimeField AssertionFailedError
  org.joda.time.TestDateMidnight_Basics#testGet_DateTimeFieldType AssertionFailedError
  org.joda.time.TestDateMidnight_Basics#testGetters AssertionFailedError expecte...
  org.joda.time.TestDateMidnight_Properties#testPropertyGetWeekOfWeekyear AssertionFailedError
  org.joda.time.TestDateTimeComparator#testListWOW AssertionFailedError ListWOW ...
  org.joda.time.TestDateTimeComparator#testWOW AssertionFailedError WOWM1a expec...
  org.joda.time.TestDateTime_Basics#testGet_DateTimeField AssertionFailedError e...
  org.joda.time.TestDateTime_Basics#testGet_DateTimeFieldType AssertionFailedError
  org.joda.time.TestDateTime_Basics#testGetters AssertionFailedError expected:<2...
  org.joda.time.TestDateTime_Properties#testPropertyAddWrapFieldWeekOfWeekyear ComparisonFailure
  org.joda.time.TestDateTime_Properties#testPropertyCompareToWeekOfWeekyear AssertionFailedError
  org.joda.time.TestDateTime_Properties#testPropertyGetWeekOfWeekyear AssertionFailedError
  org.joda.time.TestDateTime_Properties#testPropertySetTextWeekOfWeekyear ComparisonFailure
  org.joda.time.TestInstant_Basics#testGet_DateTimeField AssertionFailedError ex...
  org.joda.time.TestInstant_Basics#testGet_DateTimeFieldType AssertionFailedError
  org.joda.time.TestLocalDateTime_Basics#testGet_DateTimeFieldType AssertionFailedError
  org.joda.time.TestLocalDateTime_Basics#testGetters AssertionFailedError expect...
  org.joda.time.TestLocalDate_Basics#testGet_DateTimeFieldType AssertionFailedError
  org.joda.time.TestLocalDate_Basics#testGetters AssertionFailedError expected:<...
  org.joda.time.TestLocalDate_Basics#testWithers AssertionFailedError expected:<...
  org.joda.time.TestMutableDateTime_Adds#testAddWeekyears_int1 ComparisonFailure
  org.joda.time.TestMutableDateTime_Basics#testGetMethods AssertionFailedError e...
  org.joda.time.TestMutableDateTime_Basics#testGet_DateTimeField AssertionFailedError
  org.joda.time.TestMutableDateTime_Basics#testGet_DateTimeFieldType AssertionFailedError
  org.joda.time.TestMutableDateTime_Properties#testPropertyAddWrapFieldWeekOfWeekyear ComparisonFailure
  org.joda.time.TestMutableDateTime_Properties#testPropertyGetWeekOfWeekyear AssertionFailedError
  org.joda.time.TestMutableDateTime_Properties#testPropertySetTextWeekOfWeekyear ComparisonFailure
  org.joda.time.chrono.TestBuddhistChronology#testKeyYears AssertionFailedError ...
org.joda.time.chrono.gj.MainTest.testChronology(org.joda.time.chrono.gj.MainTest)
  Run 1: org.joda.time.chrono.gj.MainTest#testChronology AssertionFailedError
  Run 2: org.joda.time.chrono.gj.MainTest#testChronology AssertionFailedError

  org.joda.time.convert.TestStringConverter#testGetInstantMillis_Object AssertionFailedError
  org.joda.time.format.TestDateTimeFormat#testFormat_weekOfWeekyear ComparisonFailure
  org.joda.time.format.TestDateTimeFormat#testFormat_weekyearOfEra_twoDigit AssertionFailedError
  org.joda.time.format.TestDateTimeFormatter#testParseLocalDate_weekyear_month_week_2012 AssertionFailedError
  org.joda.time.format.TestDateTimeFormatter#testParseLocalDate_year_month_week_2011 AssertionFailedError
  org.joda.time.format.TestDateTimeFormatter#testParseLocalDate_year_month_week_2012 AssertionFailedError
  org.joda.time.format.TestISODateTimeFormat#testFormat_basicWeekDate ComparisonFailure
  org.joda.time.format.TestISODateTimeFormat#testFormat_basicWeekDateTime ComparisonFailure
  org.joda.time.format.TestISODateTimeFormat#testFormat_basicWeekDateTimeNoMillis ComparisonFailure
  org.joda.time.format.TestISODateTimeFormat#testFormat_weekDate ComparisonFailure
  org.joda.time.format.TestISODateTimeFormat#testFormat_weekDateTime ComparisonFailure
  org.joda.time.format.TestISODateTimeFormat#testFormat_weekDateTimeNoMillis ComparisonFailure
  org.joda.time.format.TestISODateTimeFormat#testFormat_weekyearWeek ComparisonFailure
  org.joda.time.format.TestISODateTimeFormat#testFormat_weekyearWeekDay ComparisonFailure
  org.joda.time.format.TestISODateTimeFormatParsing#test_basicWeekDateTime AssertionFailedError
  org.joda.time.format.TestISODateTimeFormatParsing#test_basicWeekDateTimeNoMillis AssertionFailedError
  org.joda.time.format.TestISODateTimeFormatParsing#test_weekDateTime AssertionFailedError
  org.joda.time.format.TestISODateTimeFormatParsing#test_weekDateTimeNoMillis AssertionFailedError
Tests in error: 
  org.joda.time.TestDateMidnight_Basics#testWithers IllegalFieldValueException V...
  org.joda.time.TestDateTime_Basics#testWithers IllegalFieldValueException Value...
  org.joda.time.TestDateTime_Properties#testPropertySetWeekOfWeekyear IllegalFieldValueException
  org.joda.time.TestLocalDateTime_Basics#testWithers IllegalFieldValueException ...
  org.joda.time.TestMutableDateTime_Properties#testPropertySetWeekOfWeekyear IllegalFieldValueException
  org.joda.time.TestMutableDateTime_Sets#testSetWeekOfWeekyear_int1 IllegalFieldValueException
  org.joda.time.TestMutableDateTime_Sets#testSetWeekyear_int1 IllegalFieldValueException
  org.joda.time.chrono.TestGJChronology#testCutoverAddWeeks IllegalFieldValueException
  org.joda.time.chrono.TestGJChronology#testCutoverAddWeekyears IllegalFieldValueException
  org.joda.time.chrono.TestGJDate#test_plusWeekyears_positiveToNegative_crossCutover IllegalFieldValueException
  org.joda.time.chrono.TestGJDate#test_plusWeekyears_positiveToZero_crossCutover IllegalFieldValueException
  org.joda.time.format.TestDateTimeFormatter#testParseLocalDate_weekyear_month_week_2010 IllegalFieldValueException
  org.joda.time.format.TestDateTimeFormatter#testParseLocalDate_weekyear_month_week_2011 IllegalFieldValueException
  org.joda.time.format.TestDateTimeFormatter#testParseLocalDate_year_month_week_2010 IllegalFieldValueException
  org.joda.time.format.TestDateTimeFormatter#testParseLocalDate_year_month_week_2013 IllegalFieldValueException
  org.joda.time.format.TestDateTimeFormatter#testParseLocalDate_year_month_week_2014 IllegalFieldValueException
  org.joda.time.format.TestDateTimeFormatter#testParseLocalDate_year_month_week_2015 IllegalFieldValueException
  org.joda.time.format.TestDateTimeFormatter#testParseLocalDate_year_month_week_2016 IllegalFieldValueException
  org.joda.time.format.TestISODateTimeFormatParsing#test_basicWeekDate IllegalFieldValueException
  org.joda.time.format.TestISODateTimeFormatParsing#test_weekDate IllegalFieldValueException

Tests run: 4156, Failures: 47, Errors: 20, Skipped: 0

[INFO] ------------------------------------------------------------------------
[INFO] BUILD FAILURE
[INFO] ------------------------------------------------------------------------
[INFO] Total time: 15.724s
[INFO] Finished at: Wed Aug 05 22:03:24 BST 2015
[INFO] Final Memory: 9M/213M
[INFO] ------------------------------------------------------------------------
[ERROR] Failed to execute goal org.apache.maven.plugins:maven-surefire-plugin:2.18.1:test (default-test) on project joda-time: There are test failures.
[ERROR] 
[ERROR] Please refer to /home/perham/Study/LittleDarwin/Cases/joda-time-2.8.1/target/surefire-reports for the individual test results.
[ERROR] -> [Help 1]
[ERROR] 
[ERROR] To see the full stack trace of the errors, re-run Maven with the -e switch.
[ERROR] Re-run Maven using the -X switch to enable full debug logging.
[ERROR] 
[ERROR] For more information about the errors and possible solutions, please read the following articles:
[ERROR] [Help 1] http://cwiki.apache.org/confluence/display/MAVEN/MojoFailureException
