[INFO] Scanning for projects...
[INFO]                                                                         
[INFO] ------------------------------------------------------------------------
[INFO] Building Joda-Time 2.8.1
[INFO] ------------------------------------------------------------------------
[INFO] 
[INFO] --- maven-resources-plugin:2.7:resources (default-resources) @ joda-time ---
[INFO] Using 'UTF-8' encoding to copy filtered resources.
[INFO] Copying 2 resources to META-INF
[INFO] Copying 10 resources
[INFO] 
[INFO] --- maven-compiler-plugin:3.3:compile (default-compile) @ joda-time ---
[INFO] Changes detected - recompiling the module!
[INFO] Compiling 166 source files to /home/perham/Study/LittleDarwin/Cases/joda-time-2.8.1/target/classes
[INFO] 
[INFO] --- exec-maven-plugin:1.4.0:java (compile-tzdb) @ joda-time ---
Writing zoneinfo files
Writing ZoneInfoMap
[INFO] 
[INFO] --- maven-resources-plugin:2.7:testResources (default-testResources) @ joda-time ---
[INFO] Using 'UTF-8' encoding to copy filtered resources.
[INFO] Copying 34 resources
[INFO] 
[INFO] --- maven-compiler-plugin:3.3:testCompile (default-testCompile) @ joda-time ---
[INFO] Nothing to compile - all classes are up to date
[INFO] 
[INFO] --- maven-surefire-plugin:2.18.1:test (default-test) @ joda-time ---
[INFO] Surefire report directory: /home/perham/Study/LittleDarwin/Cases/joda-time-2.8.1/target/surefire-reports

-------------------------------------------------------
 T E S T S
-------------------------------------------------------
Running org.joda.time.TestAllPackages

TestBuddhistChronology.testCalendar

TestCopticChronology.testCalendar

TestEthiopicChronology.testCalendar

TestIslamicChronology.testCalendar

Testing Gregorian chronology over 1000 iterations
Failure on weekyear.set
org.joda.time.chrono.gj.TestGJWeekyearField
	vs. org.joda.time.chrono.BasicWeekyearDateTimeField
Datetime: Tue 9205-05-26T00:30:28.338Z / 9205-W22-2
Millis from 1970: 228327121828338
Thu 0015-05-21T00:30:28.338Z / 15-W21-4 != Tue 0015-05-26T00:30:28.338Z / 15-W22-2
-61681735771662 != -61681303771662
Original value as reported by first field: 9205
Original value as reported by second field: 9205
First new value as reported by first field: 15
First new value as reported by second field: 15
Second new value as reported by first field: 15
Second new value as reported by second field: 15
Value to set for first field: 15
Value to set for second field: 15
Failure index: 1
Test millis: 228327121828338
Test value: 15
Test millis2: 218996928423649

Testing Julian chronology over 1000 iterations
Failure on weekyear.set
org.joda.time.chrono.gj.TestJulianWeekyearField
	vs. org.joda.time.field.SkipDateTimeField
Datetime: Tue 9205-03-20T00:30:28.338Z / 9205-W12-2
Millis from 1970: 228327121828338
Thu 0015-03-21T00:30:28.338Z / 15-W12-4 != Tue 0015-03-19T00:30:28.338Z / 15-W12-2
-61687178971662 != -61687351771662
Original value as reported by first field: 9205
Original value as reported by second field: 9205
First new value as reported by first field: 15
First new value as reported by second field: 15
Second new value as reported by first field: 15
Second new value as reported by second field: 15
Value to set for first field: 15
Value to set for second field: 15
Failure index: 1
Test millis: 228327121828338
Test value: 15
Test millis2: 218996928423649
Writing zoneinfo files
Writing ZoneInfoMap
Tests run: 4157, Failures: 139, Errors: 8, Skipped: 0, Time elapsed: 5.031 sec <<< FAILURE! - in org.joda.time.TestAllPackages
testGet_DateTimeFieldType(org.joda.time.TestInstant_Basics)  Time elapsed: 0.004 sec  <<< FAILURE!
junit.framework.AssertionFailedError: expected:<7> but was:<-3>
	at junit.framework.Assert.fail(Assert.java:47)
	at junit.framework.Assert.failNotEquals(Assert.java:280)
	at junit.framework.Assert.assertEquals(Assert.java:64)
	at junit.framework.Assert.assertEquals(Assert.java:198)
	at junit.framework.Assert.assertEquals(Assert.java:204)
	at org.joda.time.TestInstant_Basics.testGet_DateTimeFieldType(TestInstant_Basics.java:126)

testGet_DateTimeField(org.joda.time.TestInstant_Basics)  Time elapsed: 0 sec  <<< FAILURE!
junit.framework.AssertionFailedError: expected:<7> but was:<-5>
	at junit.framework.Assert.fail(Assert.java:47)
	at junit.framework.Assert.failNotEquals(Assert.java:280)
	at junit.framework.Assert.assertEquals(Assert.java:64)
	at junit.framework.Assert.assertEquals(Assert.java:198)
	at junit.framework.Assert.assertEquals(Assert.java:204)
	at org.joda.time.TestInstant_Basics.testGet_DateTimeField(TestInstant_Basics.java:156)

testGet_DateTimeFieldType(org.joda.time.TestDateTime_Basics)  Time elapsed: 0.001 sec  <<< FAILURE!
junit.framework.AssertionFailedError: expected:<7> but was:<-5>
	at junit.framework.Assert.fail(Assert.java:47)
	at junit.framework.Assert.failNotEquals(Assert.java:280)
	at junit.framework.Assert.assertEquals(Assert.java:64)
	at junit.framework.Assert.assertEquals(Assert.java:198)
	at junit.framework.Assert.assertEquals(Assert.java:204)
	at org.joda.time.TestDateTime_Basics.testGet_DateTimeFieldType(TestDateTime_Basics.java:178)

testGet_DateTimeField(org.joda.time.TestDateTime_Basics)  Time elapsed: 0 sec  <<< FAILURE!
junit.framework.AssertionFailedError: expected:<7> but was:<-5>
	at junit.framework.Assert.fail(Assert.java:47)
	at junit.framework.Assert.failNotEquals(Assert.java:280)
	at junit.framework.Assert.assertEquals(Assert.java:64)
	at junit.framework.Assert.assertEquals(Assert.java:198)
	at junit.framework.Assert.assertEquals(Assert.java:204)
	at org.joda.time.TestDateTime_Basics.testGet_DateTimeField(TestDateTime_Basics.java:148)

testWithDate_int_int_int_toDST1(org.joda.time.TestDateTime_Basics)  Time elapsed: 0.001 sec  <<< FAILURE!
junit.framework.AssertionFailedError: expected:<2010-03-28T03:55:00.000+01:00> but was:<2010-03-28T02:55:00.000+01:00>
	at junit.framework.Assert.fail(Assert.java:47)
	at junit.framework.Assert.failNotEquals(Assert.java:280)
	at junit.framework.Assert.assertEquals(Assert.java:64)
	at junit.framework.Assert.assertEquals(Assert.java:71)
	at org.joda.time.TestDateTime_Basics.testWithDate_int_int_int_toDST1(TestDateTime_Basics.java:847)

testWithDate_int_int_int_toDST2(org.joda.time.TestDateTime_Basics)  Time elapsed: 0.001 sec  <<< FAILURE!
junit.framework.AssertionFailedError: expected:<2010-03-28T03:55:00.000+01:00> but was:<2010-03-28T02:55:00.000+01:00>
	at junit.framework.Assert.fail(Assert.java:47)
	at junit.framework.Assert.failNotEquals(Assert.java:280)
	at junit.framework.Assert.assertEquals(Assert.java:64)
	at junit.framework.Assert.assertEquals(Assert.java:71)
	at org.joda.time.TestDateTime_Basics.testWithDate_int_int_int_toDST2(TestDateTime_Basics.java:855)

testWithTime_int_int_int_int_toDST(org.joda.time.TestDateTime_Basics)  Time elapsed: 0.004 sec  <<< FAILURE!
junit.framework.AssertionFailedError: expected:<2010-03-28T03:55:00.000+01:00> but was:<2010-03-28T02:55:00.000+01:00>
	at junit.framework.Assert.fail(Assert.java:47)
	at junit.framework.Assert.failNotEquals(Assert.java:280)
	at junit.framework.Assert.assertEquals(Assert.java:64)
	at junit.framework.Assert.assertEquals(Assert.java:71)
	at org.joda.time.TestDateTime_Basics.testWithTime_int_int_int_int_toDST(TestDateTime_Basics.java:898)

testGetters(org.joda.time.TestDateTime_Basics)  Time elapsed: 0.001 sec  <<< FAILURE!
junit.framework.AssertionFailedError: expected:<7> but was:<-5>
	at junit.framework.Assert.fail(Assert.java:47)
	at junit.framework.Assert.failNotEquals(Assert.java:280)
	at junit.framework.Assert.assertEquals(Assert.java:64)
	at junit.framework.Assert.assertEquals(Assert.java:198)
	at junit.framework.Assert.assertEquals(Assert.java:204)
	at org.joda.time.TestDateTime_Basics.testGetters(TestDateTime_Basics.java:241)

testWithers(org.joda.time.TestDateTime_Basics)  Time elapsed: 0.001 sec  <<< FAILURE!
junit.framework.AssertionFailedError: expected:<13> but was:<12>
	at junit.framework.Assert.fail(Assert.java:47)
	at junit.framework.Assert.failNotEquals(Assert.java:280)
	at junit.framework.Assert.assertEquals(Assert.java:64)
	at junit.framework.Assert.assertEquals(Assert.java:198)
	at junit.framework.Assert.assertEquals(Assert.java:204)
	at org.joda.time.TestDateTime_Basics.check(TestDateTime_Basics.java:1286)
	at org.joda.time.TestDateTime_Basics.testWithers(TestDateTime_Basics.java:258)

testToString_String_Locale(org.joda.time.TestDateTime_Basics)  Time elapsed: 0.01 sec  <<< FAILURE!
junit.framework.ComparisonFailure: expected:<[Sun] 9/6> but was:<[�] 9/6>
	at junit.framework.Assert.assertEquals(Assert.java:81)
	at junit.framework.Assert.assertEquals(Assert.java:87)
	at org.joda.time.TestDateTime_Basics.testToString_String_Locale(TestDateTime_Basics.java:518)

testPropertySetDayOfWeek(org.joda.time.TestDateTime_Properties)  Time elapsed: 0.001 sec  <<< FAILURE!
junit.framework.ComparisonFailure: expected:<2004-06-[10]T00:00:00.000+01:00> but was:<2004-06-[06]T00:00:00.000+01:00>
	at junit.framework.Assert.assertEquals(Assert.java:81)
	at junit.framework.Assert.assertEquals(Assert.java:87)
	at org.joda.time.TestDateTime_Properties.testPropertySetDayOfWeek(TestDateTime_Properties.java:1043)

testPropertySetTextDayOfWeek(org.joda.time.TestDateTime_Properties)  Time elapsed: 0.002 sec  <<< FAILURE!
junit.framework.ComparisonFailure: expected:<2004-06-[10]T00:00:00.000+01:00> but was:<2004-06-[06]T00:00:00.000+01:00>
	at junit.framework.Assert.assertEquals(Assert.java:81)
	at junit.framework.Assert.assertEquals(Assert.java:87)
	at org.joda.time.TestDateTime_Properties.testPropertySetTextDayOfWeek(TestDateTime_Properties.java:1059)

testPropertyWithMinimumValueMillisOfDayDSTGap(org.joda.time.TestDateTime_Properties)  Time elapsed: 0.002 sec  <<< FAILURE!
junit.framework.ComparisonFailure: expected:<2001-04-20T0[1:00:00.000+03]:00> but was:<2001-04-20T0[0:00:00.000+02]:00>
	at junit.framework.Assert.assertEquals(Assert.java:81)
	at junit.framework.Assert.assertEquals(Assert.java:87)
	at org.joda.time.TestDateTime_Properties.testPropertyWithMinimumValueMillisOfDayDSTGap(TestDateTime_Properties.java:665)

testPropertyGetWeekOfWeekyear(org.joda.time.TestDateTime_Properties)  Time elapsed: 0.001 sec  <<< FAILURE!
junit.framework.AssertionFailedError: expected:<24> but was:<23>
	at junit.framework.Assert.fail(Assert.java:47)
	at junit.framework.Assert.failNotEquals(Assert.java:280)
	at junit.framework.Assert.assertEquals(Assert.java:64)
	at junit.framework.Assert.assertEquals(Assert.java:198)
	at junit.framework.Assert.assertEquals(Assert.java:204)
	at org.joda.time.TestDateTime_Properties.testPropertyGetWeekOfWeekyear(TestDateTime_Properties.java:845)

testPropertyGetMaxMinValuesWeekOfWeekyear(org.joda.time.TestDateTime_Properties)  Time elapsed: 0 sec  <<< FAILURE!
junit.framework.AssertionFailedError: expected:<53> but was:<52>
	at junit.framework.Assert.fail(Assert.java:47)
	at junit.framework.Assert.failNotEquals(Assert.java:280)
	at junit.framework.Assert.assertEquals(Assert.java:64)
	at junit.framework.Assert.assertEquals(Assert.java:198)
	at junit.framework.Assert.assertEquals(Assert.java:204)
	at org.joda.time.TestDateTime_Properties.testPropertyGetMaxMinValuesWeekOfWeekyear(TestDateTime_Properties.java:864)

testPropertyAddWrapFieldWeekOfWeekyear(org.joda.time.TestDateTime_Properties)  Time elapsed: 0.001 sec  <<< FAILURE!
junit.framework.ComparisonFailure: expected:<200[3-12-29]T00:00:00.000Z> but was:<200[4-01-05]T00:00:00.000Z>
	at junit.framework.Assert.assertEquals(Assert.java:81)
	at junit.framework.Assert.assertEquals(Assert.java:87)
	at org.joda.time.TestDateTime_Properties.testPropertyAddWrapFieldWeekOfWeekyear(TestDateTime_Properties.java:900)

testPropertySetWeekOfWeekyear(org.joda.time.TestDateTime_Properties)  Time elapsed: 0 sec  <<< FAILURE!
junit.framework.ComparisonFailure: expected:<2004-01-[19]T00:00:00.000Z> but was:<2004-01-[26]T00:00:00.000Z>
	at junit.framework.Assert.assertEquals(Assert.java:81)
	at junit.framework.Assert.assertEquals(Assert.java:87)
	at org.joda.time.TestDateTime_Properties.testPropertySetWeekOfWeekyear(TestDateTime_Properties.java:910)

testPropertySetTextWeekOfWeekyear(org.joda.time.TestDateTime_Properties)  Time elapsed: 0.002 sec  <<< FAILURE!
junit.framework.ComparisonFailure: expected:<2004-01-[19]T00:00:00.000Z> but was:<2004-01-[26]T00:00:00.000Z>
	at junit.framework.Assert.assertEquals(Assert.java:81)
	at junit.framework.Assert.assertEquals(Assert.java:87)
	at org.joda.time.TestDateTime_Properties.testPropertySetTextWeekOfWeekyear(TestDateTime_Properties.java:926)

testPropertyGetDayOfWeek(org.joda.time.TestDateTime_Properties)  Time elapsed: 0 sec  <<< FAILURE!
junit.framework.AssertionFailedError: expected:<3> but was:<7>
	at junit.framework.Assert.fail(Assert.java:47)
	at junit.framework.Assert.failNotEquals(Assert.java:280)
	at junit.framework.Assert.assertEquals(Assert.java:64)
	at junit.framework.Assert.assertEquals(Assert.java:198)
	at junit.framework.Assert.assertEquals(Assert.java:204)
	at org.joda.time.TestDateTime_Properties.testPropertyGetDayOfWeek(TestDateTime_Properties.java:958)

testPropertyAddWrapFieldDayOfWeek(org.joda.time.TestDateTime_Properties)  Time elapsed: 0 sec  <<< FAILURE!
junit.framework.ComparisonFailure: expected:<2004-06-[10]T00:00:00.000+01:00> but was:<2004-06-[03]T00:00:00.000+01:00>
	at junit.framework.Assert.assertEquals(Assert.java:81)
	at junit.framework.Assert.assertEquals(Assert.java:87)
	at org.joda.time.TestDateTime_Properties.testPropertyAddWrapFieldDayOfWeek(TestDateTime_Properties.java:1025)

testGet_DateTimeFieldType(org.joda.time.TestMutableDateTime_Basics)  Time elapsed: 0.001 sec  <<< FAILURE!
junit.framework.AssertionFailedError: expected:<7> but was:<-5>
	at junit.framework.Assert.fail(Assert.java:47)
	at junit.framework.Assert.failNotEquals(Assert.java:280)
	at junit.framework.Assert.assertEquals(Assert.java:64)
	at junit.framework.Assert.assertEquals(Assert.java:198)
	at junit.framework.Assert.assertEquals(Assert.java:204)
	at org.joda.time.TestMutableDateTime_Basics.testGet_DateTimeFieldType(TestMutableDateTime_Basics.java:162)

testGet_DateTimeField(org.joda.time.TestMutableDateTime_Basics)  Time elapsed: 0 sec  <<< FAILURE!
junit.framework.AssertionFailedError: expected:<7> but was:<-5>
	at junit.framework.Assert.fail(Assert.java:47)
	at junit.framework.Assert.failNotEquals(Assert.java:280)
	at junit.framework.Assert.assertEquals(Assert.java:64)
	at junit.framework.Assert.assertEquals(Assert.java:198)
	at junit.framework.Assert.assertEquals(Assert.java:204)
	at org.joda.time.TestMutableDateTime_Basics.testGet_DateTimeField(TestMutableDateTime_Basics.java:132)

testGetMethods(org.joda.time.TestMutableDateTime_Basics)  Time elapsed: 0.001 sec  <<< FAILURE!
junit.framework.AssertionFailedError: expected:<7> but was:<-5>
	at junit.framework.Assert.fail(Assert.java:47)
	at junit.framework.Assert.failNotEquals(Assert.java:280)
	at junit.framework.Assert.assertEquals(Assert.java:64)
	at junit.framework.Assert.assertEquals(Assert.java:198)
	at junit.framework.Assert.assertEquals(Assert.java:204)
	at org.joda.time.TestMutableDateTime_Basics.testGetMethods(TestMutableDateTime_Basics.java:197)

testToString_String_String(org.joda.time.TestMutableDateTime_Basics)  Time elapsed: 0 sec  <<< FAILURE!
junit.framework.ComparisonFailure: expected:<[Sun] 9/6> but was:<[�] 9/6>
	at junit.framework.Assert.assertEquals(Assert.java:81)
	at junit.framework.Assert.assertEquals(Assert.java:87)
	at org.joda.time.TestMutableDateTime_Basics.testToString_String_String(TestMutableDateTime_Basics.java:422)

testSetWeekyear_int1(org.joda.time.TestMutableDateTime_Sets)  Time elapsed: 0 sec  <<< ERROR!
org.joda.time.IllegalFieldValueException: Value -1 for dayOfWeek must be in the range [1,7]
	at org.joda.time.field.FieldUtils.verifyValueBounds(FieldUtils.java:234)
	at org.joda.time.field.PreciseDurationDateTimeField.set(PreciseDurationDateTimeField.java:79)
	at org.joda.time.chrono.BasicWeekyearDateTimeField.set(BasicWeekyearDateTimeField.java:201)
	at org.joda.time.chrono.ZonedChronology$ZonedDateTimeField.set(ZonedChronology.java:482)
	at org.joda.time.MutableDateTime.setWeekyear(MutableDateTime.java:674)
	at org.joda.time.TestMutableDateTime_Sets.testSetWeekyear_int1(TestMutableDateTime_Sets.java:519)

testSetDayOfWeek_int1(org.joda.time.TestMutableDateTime_Sets)  Time elapsed: 0.001 sec  <<< ERROR!
org.joda.time.IllegalFieldValueException: Value 5 for dayOfWeek is not supported: Illegal instant due to time zone offset transition (daylight savings time 'gap'): 2002-06-15T05:06:07.008 (Europe/London)
	at org.joda.time.chrono.ZonedChronology$ZonedDateTimeField.set(ZonedChronology.java:486)
	at org.joda.time.MutableDateTime.setDayOfWeek(MutableDateTime.java:763)
	at org.joda.time.TestMutableDateTime_Sets.testSetDayOfWeek_int1(TestMutableDateTime_Sets.java:542)
Caused by: org.joda.time.IllegalInstantException: Illegal instant due to time zone offset transition (daylight savings time 'gap'): 2002-06-15T05:06:07.008 (Europe/London)
	at org.joda.time.chrono.ZonedChronology$ZonedDateTimeField.set(ZonedChronology.java:485)
	... 28 more

testAddWeekyears_int1(org.joda.time.TestMutableDateTime_Adds)  Time elapsed: 0.001 sec  <<< ERROR!
org.joda.time.IllegalFieldValueException: Value -1 for dayOfWeek must be in the range [1,7]
	at org.joda.time.field.FieldUtils.verifyValueBounds(FieldUtils.java:234)
	at org.joda.time.field.PreciseDurationDateTimeField.set(PreciseDurationDateTimeField.java:79)
	at org.joda.time.chrono.BasicWeekyearDateTimeField.set(BasicWeekyearDateTimeField.java:201)
	at org.joda.time.chrono.BasicWeekyearDateTimeField.add(BasicWeekyearDateTimeField.java:76)
	at org.joda.time.field.ImpreciseDateTimeField$LinkedDurationField.add(ImpreciseDateTimeField.java:183)
	at org.joda.time.chrono.ZonedChronology$ZonedDurationField.add(ZonedChronology.java:317)
	at org.joda.time.MutableDateTime.addWeekyears(MutableDateTime.java:685)
	at org.joda.time.TestMutableDateTime_Adds.testAddWeekyears_int1(TestMutableDateTime_Adds.java:277)

testPropertySetDayOfWeek(org.joda.time.TestMutableDateTime_Properties)  Time elapsed: 0.001 sec  <<< FAILURE!
junit.framework.ComparisonFailure: expected:<2004-06-[10]T00:00:00.000+01:00> but was:<2004-06-[06]T00:00:00.000+01:00>
	at junit.framework.Assert.assertEquals(Assert.java:81)
	at junit.framework.Assert.assertEquals(Assert.java:87)
	at org.joda.time.TestMutableDateTime_Properties.testPropertySetDayOfWeek(TestMutableDateTime_Properties.java:488)

testPropertySetTextDayOfWeek(org.joda.time.TestMutableDateTime_Properties)  Time elapsed: 0 sec  <<< FAILURE!
junit.framework.ComparisonFailure: expected:<2004-06-[10]T00:00:00.000+01:00> but was:<2004-06-[06]T00:00:00.000+01:00>
	at junit.framework.Assert.assertEquals(Assert.java:81)
	at junit.framework.Assert.assertEquals(Assert.java:87)
	at org.joda.time.TestMutableDateTime_Properties.testPropertySetTextDayOfWeek(TestMutableDateTime_Properties.java:494)

testPropertyGetWeekOfWeekyear(org.joda.time.TestMutableDateTime_Properties)  Time elapsed: 0 sec  <<< FAILURE!
junit.framework.AssertionFailedError: expected:<24> but was:<23>
	at junit.framework.Assert.fail(Assert.java:47)
	at junit.framework.Assert.failNotEquals(Assert.java:280)
	at junit.framework.Assert.assertEquals(Assert.java:64)
	at junit.framework.Assert.assertEquals(Assert.java:198)
	at junit.framework.Assert.assertEquals(Assert.java:204)
	at org.joda.time.TestMutableDateTime_Properties.testPropertyGetWeekOfWeekyear(TestMutableDateTime_Properties.java:403)

testPropertyAddWrapFieldWeekOfWeekyear(org.joda.time.TestMutableDateTime_Properties)  Time elapsed: 0 sec  <<< FAILURE!
junit.framework.ComparisonFailure: expected:<200[3-12-29]T00:00:00.000Z> but was:<200[4-01-05]T00:00:00.000Z>
	at junit.framework.Assert.assertEquals(Assert.java:81)
	at junit.framework.Assert.assertEquals(Assert.java:87)
	at org.joda.time.TestMutableDateTime_Properties.testPropertyAddWrapFieldWeekOfWeekyear(TestMutableDateTime_Properties.java:426)

testPropertySetWeekOfWeekyear(org.joda.time.TestMutableDateTime_Properties)  Time elapsed: 0.001 sec  <<< FAILURE!
junit.framework.ComparisonFailure: expected:<2004-01-[19]T00:00:00.000Z> but was:<2004-01-[26]T00:00:00.000Z>
	at junit.framework.Assert.assertEquals(Assert.java:81)
	at junit.framework.Assert.assertEquals(Assert.java:87)
	at org.joda.time.TestMutableDateTime_Properties.testPropertySetWeekOfWeekyear(TestMutableDateTime_Properties.java:432)

testPropertySetTextWeekOfWeekyear(org.joda.time.TestMutableDateTime_Properties)  Time elapsed: 0.001 sec  <<< FAILURE!
junit.framework.ComparisonFailure: expected:<2004-01-[19]T00:00:00.000Z> but was:<2004-01-[26]T00:00:00.000Z>
	at junit.framework.Assert.assertEquals(Assert.java:81)
	at junit.framework.Assert.assertEquals(Assert.java:87)
	at org.joda.time.TestMutableDateTime_Properties.testPropertySetTextWeekOfWeekyear(TestMutableDateTime_Properties.java:438)

testPropertyGetDayOfWeek(org.joda.time.TestMutableDateTime_Properties)  Time elapsed: 0 sec  <<< FAILURE!
junit.framework.AssertionFailedError: expected:<3> but was:<7>
	at junit.framework.Assert.fail(Assert.java:47)
	at junit.framework.Assert.failNotEquals(Assert.java:280)
	at junit.framework.Assert.assertEquals(Assert.java:64)
	at junit.framework.Assert.assertEquals(Assert.java:198)
	at junit.framework.Assert.assertEquals(Assert.java:204)
	at org.joda.time.TestMutableDateTime_Properties.testPropertyGetDayOfWeek(TestMutableDateTime_Properties.java:447)

testConstructor_long1_DateTimeZone(org.joda.time.TestDateMidnight_Constructors)  Time elapsed: 0 sec  <<< FAILURE!
junit.framework.AssertionFailedError: expected:<1017957600000> but was:<1017961200000>
	at junit.framework.Assert.fail(Assert.java:47)
	at junit.framework.Assert.failNotEquals(Assert.java:280)
	at junit.framework.Assert.assertEquals(Assert.java:64)
	at junit.framework.Assert.assertEquals(Assert.java:133)
	at junit.framework.Assert.assertEquals(Assert.java:139)
	at org.joda.time.TestDateMidnight_Constructors.testConstructor_long1_DateTimeZone(TestDateMidnight_Constructors.java:256)

testConstructor_long_nullDateTimeZone(org.joda.time.TestDateMidnight_Constructors)  Time elapsed: 0.001 sec  <<< FAILURE!
junit.framework.AssertionFailedError: expected:<1017961200000> but was:<1017964800000>
	at junit.framework.Assert.fail(Assert.java:47)
	at junit.framework.Assert.failNotEquals(Assert.java:280)
	at junit.framework.Assert.assertEquals(Assert.java:64)
	at junit.framework.Assert.assertEquals(Assert.java:133)
	at junit.framework.Assert.assertEquals(Assert.java:139)
	at org.joda.time.TestDateMidnight_Constructors.testConstructor_long_nullDateTimeZone(TestDateMidnight_Constructors.java:274)

testConstructor_long1_Chronology(org.joda.time.TestDateMidnight_Constructors)  Time elapsed: 0.001 sec  <<< FAILURE!
junit.framework.AssertionFailedError: expected:<1017961200000> but was:<1017964800000>
	at junit.framework.Assert.fail(Assert.java:47)
	at junit.framework.Assert.failNotEquals(Assert.java:280)
	at junit.framework.Assert.assertEquals(Assert.java:64)
	at junit.framework.Assert.assertEquals(Assert.java:133)
	at junit.framework.Assert.assertEquals(Assert.java:139)
	at org.joda.time.TestDateMidnight_Constructors.testConstructor_long1_Chronology(TestDateMidnight_Constructors.java:283)

testConstructor_long_nullChronology(org.joda.time.TestDateMidnight_Constructors)  Time elapsed: 0 sec  <<< FAILURE!
junit.framework.AssertionFailedError: expected:<1017961200000> but was:<1017964800000>
	at junit.framework.Assert.fail(Assert.java:47)
	at junit.framework.Assert.failNotEquals(Assert.java:280)
	at junit.framework.Assert.assertEquals(Assert.java:64)
	at junit.framework.Assert.assertEquals(Assert.java:133)
	at junit.framework.Assert.assertEquals(Assert.java:139)
	at org.joda.time.TestDateMidnight_Constructors.testConstructor_long_nullChronology(TestDateMidnight_Constructors.java:301)

testConstructor_Object_DateTimeZone(org.joda.time.TestDateMidnight_Constructors)  Time elapsed: 0.001 sec  <<< FAILURE!
junit.framework.AssertionFailedError: expected:<1017957600000> but was:<1017961200000>
	at junit.framework.Assert.fail(Assert.java:47)
	at junit.framework.Assert.failNotEquals(Assert.java:280)
	at junit.framework.Assert.assertEquals(Assert.java:64)
	at junit.framework.Assert.assertEquals(Assert.java:133)
	at junit.framework.Assert.assertEquals(Assert.java:139)
	at org.joda.time.TestDateMidnight_Constructors.testConstructor_Object_DateTimeZone(TestDateMidnight_Constructors.java:355)

testConstructor_Object_nullDateTimeZone(org.joda.time.TestDateMidnight_Constructors)  Time elapsed: 0 sec  <<< FAILURE!
junit.framework.AssertionFailedError: expected:<1017961200000> but was:<1017964800000>
	at junit.framework.Assert.fail(Assert.java:47)
	at junit.framework.Assert.failNotEquals(Assert.java:280)
	at junit.framework.Assert.assertEquals(Assert.java:64)
	at junit.framework.Assert.assertEquals(Assert.java:133)
	at junit.framework.Assert.assertEquals(Assert.java:139)
	at org.joda.time.TestDateMidnight_Constructors.testConstructor_Object_nullDateTimeZone(TestDateMidnight_Constructors.java:384)

testConstructor_long1(org.joda.time.TestDateMidnight_Constructors)  Time elapsed: 0.001 sec  <<< FAILURE!
junit.framework.AssertionFailedError: expected:<1017961200000> but was:<1017964800000>
	at junit.framework.Assert.fail(Assert.java:47)
	at junit.framework.Assert.failNotEquals(Assert.java:280)
	at junit.framework.Assert.assertEquals(Assert.java:64)
	at junit.framework.Assert.assertEquals(Assert.java:133)
	at junit.framework.Assert.assertEquals(Assert.java:139)
	at org.joda.time.TestDateMidnight_Constructors.testConstructor_long1(TestDateMidnight_Constructors.java:238)

testConstructor_Object(org.joda.time.TestDateMidnight_Constructors)  Time elapsed: 0.001 sec  <<< FAILURE!
junit.framework.AssertionFailedError: expected:<1017961200000> but was:<1017964800000>
	at junit.framework.Assert.fail(Assert.java:47)
	at junit.framework.Assert.failNotEquals(Assert.java:280)
	at junit.framework.Assert.assertEquals(Assert.java:64)
	at junit.framework.Assert.assertEquals(Assert.java:133)
	at junit.framework.Assert.assertEquals(Assert.java:139)
	at org.joda.time.TestDateMidnight_Constructors.testConstructor_Object(TestDateMidnight_Constructors.java:312)

testConstructor_Object_Chronology(org.joda.time.TestDateMidnight_Constructors)  Time elapsed: 0.001 sec  <<< FAILURE!
junit.framework.AssertionFailedError: expected:<1017961200000> but was:<1017964800000>
	at junit.framework.Assert.fail(Assert.java:47)
	at junit.framework.Assert.failNotEquals(Assert.java:280)
	at junit.framework.Assert.assertEquals(Assert.java:64)
	at junit.framework.Assert.assertEquals(Assert.java:133)
	at junit.framework.Assert.assertEquals(Assert.java:139)
	at org.joda.time.TestDateMidnight_Constructors.testConstructor_Object_Chronology(TestDateMidnight_Constructors.java:417)

testConstructor_Object_nullChronology(org.joda.time.TestDateMidnight_Constructors)  Time elapsed: 0.001 sec  <<< FAILURE!
junit.framework.AssertionFailedError: expected:<1017961200000> but was:<1017964800000>
	at junit.framework.Assert.fail(Assert.java:47)
	at junit.framework.Assert.failNotEquals(Assert.java:280)
	at junit.framework.Assert.assertEquals(Assert.java:64)
	at junit.framework.Assert.assertEquals(Assert.java:133)
	at junit.framework.Assert.assertEquals(Assert.java:139)
	at org.joda.time.TestDateMidnight_Constructors.testConstructor_Object_nullChronology(TestDateMidnight_Constructors.java:446)

testGet_DateTimeFieldType(org.joda.time.TestDateMidnight_Basics)  Time elapsed: 0 sec  <<< FAILURE!
junit.framework.AssertionFailedError: expected:<7> but was:<-3>
	at junit.framework.Assert.fail(Assert.java:47)
	at junit.framework.Assert.failNotEquals(Assert.java:280)
	at junit.framework.Assert.assertEquals(Assert.java:64)
	at junit.framework.Assert.assertEquals(Assert.java:198)
	at junit.framework.Assert.assertEquals(Assert.java:204)
	at org.joda.time.TestDateMidnight_Basics.testGet_DateTimeFieldType(TestDateMidnight_Basics.java:193)

testGet_DateTimeField(org.joda.time.TestDateMidnight_Basics)  Time elapsed: 0.001 sec  <<< FAILURE!
junit.framework.AssertionFailedError: expected:<7> but was:<-3>
	at junit.framework.Assert.fail(Assert.java:47)
	at junit.framework.Assert.failNotEquals(Assert.java:280)
	at junit.framework.Assert.assertEquals(Assert.java:64)
	at junit.framework.Assert.assertEquals(Assert.java:198)
	at junit.framework.Assert.assertEquals(Assert.java:204)
	at org.joda.time.TestDateMidnight_Basics.testGet_DateTimeField(TestDateMidnight_Basics.java:163)

testEqualsHashCode(org.joda.time.TestDateMidnight_Basics)  Time elapsed: 0.001 sec  <<< FAILURE!
junit.framework.AssertionFailedError: expected:<true> but was:<false>
	at junit.framework.Assert.fail(Assert.java:47)
	at junit.framework.Assert.failNotEquals(Assert.java:280)
	at junit.framework.Assert.assertEquals(Assert.java:64)
	at junit.framework.Assert.assertEquals(Assert.java:146)
	at junit.framework.Assert.assertEquals(Assert.java:152)
	at org.joda.time.TestDateMidnight_Basics.testEqualsHashCode(TestDateMidnight_Basics.java:285)

testCompareTo(org.joda.time.TestDateMidnight_Basics)  Time elapsed: 0.001 sec  <<< FAILURE!
junit.framework.AssertionFailedError: expected:<0> but was:<1>
	at junit.framework.Assert.fail(Assert.java:47)
	at junit.framework.Assert.failNotEquals(Assert.java:280)
	at junit.framework.Assert.assertEquals(Assert.java:64)
	at junit.framework.Assert.assertEquals(Assert.java:198)
	at junit.framework.Assert.assertEquals(Assert.java:204)
	at org.joda.time.TestDateMidnight_Basics.testCompareTo(TestDateMidnight_Basics.java:319)

testWithChronology_Chronology(org.joda.time.TestDateMidnight_Basics)  Time elapsed: 0 sec  <<< FAILURE!
junit.framework.AssertionFailedError: expected:<1017961200000> but was:<1017964800000>
	at junit.framework.Assert.fail(Assert.java:47)
	at junit.framework.Assert.failNotEquals(Assert.java:280)
	at junit.framework.Assert.assertEquals(Assert.java:64)
	at junit.framework.Assert.assertEquals(Assert.java:133)
	at junit.framework.Assert.assertEquals(Assert.java:139)
	at org.joda.time.TestDateMidnight_Basics.testWithChronology_Chronology(TestDateMidnight_Basics.java:680)

testWithZoneRetainFields_DateTimeZone(org.joda.time.TestDateMidnight_Basics)  Time elapsed: 0.001 sec  <<< FAILURE!
junit.framework.AssertionFailedError: expected:<1017961200000> but was:<1017964800000>
	at junit.framework.Assert.fail(Assert.java:47)
	at junit.framework.Assert.failNotEquals(Assert.java:280)
	at junit.framework.Assert.assertEquals(Assert.java:64)
	at junit.framework.Assert.assertEquals(Assert.java:133)
	at junit.framework.Assert.assertEquals(Assert.java:139)
	at org.joda.time.TestDateMidnight_Basics.testWithZoneRetainFields_DateTimeZone(TestDateMidnight_Basics.java:704)

testGetters(org.joda.time.TestDateMidnight_Basics)  Time elapsed: 0 sec  <<< FAILURE!
junit.framework.AssertionFailedError: expected:<7> but was:<-3>
	at junit.framework.Assert.fail(Assert.java:47)
	at junit.framework.Assert.failNotEquals(Assert.java:280)
	at junit.framework.Assert.assertEquals(Assert.java:64)
	at junit.framework.Assert.assertEquals(Assert.java:198)
	at junit.framework.Assert.assertEquals(Assert.java:204)
	at org.joda.time.TestDateMidnight_Basics.testGetters(TestDateMidnight_Basics.java:229)

testIsAfter(org.joda.time.TestDateMidnight_Basics)  Time elapsed: 0.001 sec  <<< FAILURE!
junit.framework.AssertionFailedError: expected:<false> but was:<true>
	at junit.framework.Assert.fail(Assert.java:47)
	at junit.framework.Assert.failNotEquals(Assert.java:280)
	at junit.framework.Assert.assertEquals(Assert.java:64)
	at junit.framework.Assert.assertEquals(Assert.java:146)
	at junit.framework.Assert.assertEquals(Assert.java:152)
	at org.joda.time.TestDateMidnight_Basics.testIsAfter(TestDateMidnight_Basics.java:407)

testToString_String_String(org.joda.time.TestDateMidnight_Basics)  Time elapsed: 0.001 sec  <<< FAILURE!
junit.framework.ComparisonFailure: expected:<[Sun] 9/6> but was:<[�] 9/6>
	at junit.framework.Assert.assertEquals(Assert.java:81)
	at junit.framework.Assert.assertEquals(Assert.java:87)
	at org.joda.time.TestDateMidnight_Basics.testToString_String_String(TestDateMidnight_Basics.java:456)

testToInstant(org.joda.time.TestDateMidnight_Basics)  Time elapsed: 0.003 sec  <<< FAILURE!
junit.framework.AssertionFailedError: expected:<1017961200000> but was:<1017964800000>
	at junit.framework.Assert.fail(Assert.java:47)
	at junit.framework.Assert.failNotEquals(Assert.java:280)
	at junit.framework.Assert.assertEquals(Assert.java:64)
	at junit.framework.Assert.assertEquals(Assert.java:133)
	at junit.framework.Assert.assertEquals(Assert.java:139)
	at org.joda.time.TestDateMidnight_Basics.testToInstant(TestDateMidnight_Basics.java:473)

testToDateTime(org.joda.time.TestDateMidnight_Basics)  Time elapsed: 0 sec  <<< FAILURE!
junit.framework.AssertionFailedError: expected:<1017957600000> but was:<1017961200000>
	at junit.framework.Assert.fail(Assert.java:47)
	at junit.framework.Assert.failNotEquals(Assert.java:280)
	at junit.framework.Assert.assertEquals(Assert.java:64)
	at junit.framework.Assert.assertEquals(Assert.java:133)
	at junit.framework.Assert.assertEquals(Assert.java:139)
	at org.joda.time.TestDateMidnight_Basics.testToDateTime(TestDateMidnight_Basics.java:480)

testToDateTime_DateTimeZone(org.joda.time.TestDateMidnight_Basics)  Time elapsed: 0 sec  <<< FAILURE!
junit.framework.AssertionFailedError: expected:<1017961200000> but was:<1017964800000>
	at junit.framework.Assert.fail(Assert.java:47)
	at junit.framework.Assert.failNotEquals(Assert.java:280)
	at junit.framework.Assert.assertEquals(Assert.java:64)
	at junit.framework.Assert.assertEquals(Assert.java:133)
	at junit.framework.Assert.assertEquals(Assert.java:139)
	at org.joda.time.TestDateMidnight_Basics.testToDateTime_DateTimeZone(TestDateMidnight_Basics.java:497)

testToDateTime_Chronology(org.joda.time.TestDateMidnight_Basics)  Time elapsed: 0 sec  <<< FAILURE!
junit.framework.AssertionFailedError: expected:<1017961200000> but was:<1017964800000>
	at junit.framework.Assert.fail(Assert.java:47)
	at junit.framework.Assert.failNotEquals(Assert.java:280)
	at junit.framework.Assert.assertEquals(Assert.java:64)
	at junit.framework.Assert.assertEquals(Assert.java:133)
	at junit.framework.Assert.assertEquals(Assert.java:139)
	at org.joda.time.TestDateMidnight_Basics.testToDateTime_Chronology(TestDateMidnight_Basics.java:523)

testIsEqual(org.joda.time.TestDateMidnight_Basics)  Time elapsed: 0 sec  <<< FAILURE!
junit.framework.AssertionFailedError: expected:<true> but was:<false>
	at junit.framework.Assert.fail(Assert.java:47)
	at junit.framework.Assert.failNotEquals(Assert.java:280)
	at junit.framework.Assert.assertEquals(Assert.java:64)
	at junit.framework.Assert.assertEquals(Assert.java:146)
	at junit.framework.Assert.assertEquals(Assert.java:152)
	at org.joda.time.TestDateMidnight_Basics.testIsEqual(TestDateMidnight_Basics.java:349)

testPropertyGetWeekOfWeekyear(org.joda.time.TestDateMidnight_Properties)  Time elapsed: 0 sec  <<< FAILURE!
junit.framework.AssertionFailedError: expected:<24> but was:<23>
	at junit.framework.Assert.fail(Assert.java:47)
	at junit.framework.Assert.failNotEquals(Assert.java:280)
	at junit.framework.Assert.assertEquals(Assert.java:64)
	at junit.framework.Assert.assertEquals(Assert.java:198)
	at junit.framework.Assert.assertEquals(Assert.java:204)
	at org.joda.time.TestDateMidnight_Properties.testPropertyGetWeekOfWeekyear(TestDateMidnight_Properties.java:438)

testPropertyGetDayOfWeek(org.joda.time.TestDateMidnight_Properties)  Time elapsed: 0 sec  <<< FAILURE!
junit.framework.AssertionFailedError: expected:<3> but was:<7>
	at junit.framework.Assert.fail(Assert.java:47)
	at junit.framework.Assert.failNotEquals(Assert.java:280)
	at junit.framework.Assert.assertEquals(Assert.java:64)
	at junit.framework.Assert.assertEquals(Assert.java:198)
	at junit.framework.Assert.assertEquals(Assert.java:204)
	at org.joda.time.TestDateMidnight_Properties.testPropertyGetDayOfWeek(TestDateMidnight_Properties.java:459)

testGet_DateTimeFieldType(org.joda.time.TestLocalDateTime_Basics)  Time elapsed: 0.001 sec  <<< FAILURE!
junit.framework.AssertionFailedError: expected:<2> but was:<3>
	at junit.framework.Assert.fail(Assert.java:47)
	at junit.framework.Assert.failNotEquals(Assert.java:280)
	at junit.framework.Assert.assertEquals(Assert.java:64)
	at junit.framework.Assert.assertEquals(Assert.java:198)
	at junit.framework.Assert.assertEquals(Assert.java:204)
	at org.joda.time.TestLocalDateTime_Basics.testGet_DateTimeFieldType(TestLocalDateTime_Basics.java:121)

testGetters(org.joda.time.TestLocalDateTime_Basics)  Time elapsed: 0 sec  <<< FAILURE!
junit.framework.AssertionFailedError: expected:<2> but was:<3>
	at junit.framework.Assert.fail(Assert.java:47)
	at junit.framework.Assert.failNotEquals(Assert.java:280)
	at junit.framework.Assert.assertEquals(Assert.java:64)
	at junit.framework.Assert.assertEquals(Assert.java:198)
	at junit.framework.Assert.assertEquals(Assert.java:204)
	at org.joda.time.TestLocalDateTime_Basics.testGetters(TestLocalDateTime_Basics.java:722)

testWithers(org.joda.time.TestLocalDateTime_Basics)  Time elapsed: 0.001 sec  <<< FAILURE!
junit.framework.AssertionFailedError: expected:<13> but was:<12>
	at junit.framework.Assert.fail(Assert.java:47)
	at junit.framework.Assert.failNotEquals(Assert.java:280)
	at junit.framework.Assert.assertEquals(Assert.java:64)
	at junit.framework.Assert.assertEquals(Assert.java:198)
	at junit.framework.Assert.assertEquals(Assert.java:204)
	at org.joda.time.TestLocalDateTime_Basics.check(TestLocalDateTime_Basics.java:1103)
	at org.joda.time.TestLocalDateTime_Basics.testWithers(TestLocalDateTime_Basics.java:743)

testToString_String_Locale(org.joda.time.TestLocalDateTime_Basics)  Time elapsed: 0.001 sec  <<< FAILURE!
junit.framework.ComparisonFailure: expected:<[Tue] 9/6> but was:<[Wed] 9/6>
	at junit.framework.Assert.assertEquals(Assert.java:81)
	at junit.framework.Assert.assertEquals(Assert.java:87)
	at org.joda.time.TestLocalDateTime_Basics.testToString_String_Locale(TestLocalDateTime_Basics.java:1085)

testToDateTime_Zone_dstGap(org.joda.time.TestLocalDateTime_Basics)  Time elapsed: 0 sec  <<< FAILURE!
junit.framework.AssertionFailedError
	at junit.framework.Assert.fail(Assert.java:47)
	at junit.framework.Assert.fail(Assert.java:53)
	at org.joda.time.TestLocalDateTime_Basics.testToDateTime_Zone_dstGap(TestLocalDateTime_Basics.java:798)

testToDateTime_LocalTime_Zone_dstGap(org.joda.time.TestLocalDate_Basics)  Time elapsed: 0.001 sec  <<< FAILURE!
junit.framework.AssertionFailedError
	at junit.framework.Assert.fail(Assert.java:47)
	at junit.framework.Assert.fail(Assert.java:53)
	at org.joda.time.TestLocalDate_Basics.testToDateTime_LocalTime_Zone_dstGap(TestLocalDate_Basics.java:871)

testIsMatch_Instant(org.joda.time.TestPartial_Match)  Time elapsed: 0.001 sec  <<< FAILURE!
junit.framework.AssertionFailedError: expected:<true> but was:<false>
	at junit.framework.Assert.fail(Assert.java:47)
	at junit.framework.Assert.failNotEquals(Assert.java:280)
	at junit.framework.Assert.assertEquals(Assert.java:64)
	at junit.framework.Assert.assertEquals(Assert.java:146)
	at junit.framework.Assert.assertEquals(Assert.java:152)
	at org.joda.time.TestPartial_Match.testIsMatch_Instant(TestPartial_Match.java:99)

testIsMatch_Partial(org.joda.time.TestPartial_Match)  Time elapsed: 0 sec  <<< FAILURE!
junit.framework.AssertionFailedError: expected:<true> but was:<false>
	at junit.framework.Assert.fail(Assert.java:47)
	at junit.framework.Assert.failNotEquals(Assert.java:280)
	at junit.framework.Assert.assertEquals(Assert.java:64)
	at junit.framework.Assert.assertEquals(Assert.java:146)
	at junit.framework.Assert.assertEquals(Assert.java:152)
	at org.joda.time.TestPartial_Match.testIsMatch_Partial(TestPartial_Match.java:131)

testWOW(org.joda.time.TestDateTimeComparator)  Time elapsed: 0.001 sec  <<< FAILURE!
junit.framework.AssertionFailedError: WOWM1a expected:<-1> but was:<1>
	at junit.framework.Assert.fail(Assert.java:47)
	at junit.framework.Assert.failNotEquals(Assert.java:280)
	at junit.framework.Assert.assertEquals(Assert.java:64)
	at junit.framework.Assert.assertEquals(Assert.java:198)
	at org.joda.time.TestDateTimeComparator.testWOW(TestDateTimeComparator.java:525)

testListWOW(org.joda.time.TestDateTimeComparator)  Time elapsed: 0.002 sec  <<< FAILURE!
junit.framework.AssertionFailedError: ListWOW expected:<true> but was:<false>
	at junit.framework.Assert.fail(Assert.java:47)
	at junit.framework.Assert.failNotEquals(Assert.java:280)
	at junit.framework.Assert.assertEquals(Assert.java:64)
	at junit.framework.Assert.assertEquals(Assert.java:146)
	at org.joda.time.TestDateTimeComparator.testListWOW(TestDateTimeComparator.java:771)

testIsLocalDateTimeGap_Berlin(org.joda.time.TestDateTimeZone)  Time elapsed: 0.001 sec  <<< FAILURE!
junit.framework.AssertionFailedError: expected:<true> but was:<false>
	at junit.framework.Assert.fail(Assert.java:47)
	at junit.framework.Assert.failNotEquals(Assert.java:280)
	at junit.framework.Assert.assertEquals(Assert.java:64)
	at junit.framework.Assert.assertEquals(Assert.java:146)
	at junit.framework.Assert.assertEquals(Assert.java:152)
	at org.joda.time.TestDateTimeZone.testIsLocalDateTimeGap_Berlin(TestDateTimeZone.java:934)

test_NewYorkIsCorrect_Autumn(org.joda.time.TestDateTimeZoneCutover)  Time elapsed: 0.002 sec  <<< FAILURE!
junit.framework.ComparisonFailure: expected:<2007-11-04T0[1:00:00.000-05]:00> but was:<2007-11-04T0[2:00:00.000-04]:00>
	at junit.framework.Assert.assertEquals(Assert.java:81)
	at junit.framework.Assert.assertEquals(Assert.java:87)
	at org.joda.time.TestDateTimeZoneCutover.test_NewYorkIsCorrect_Autumn(TestDateTimeZoneCutover.java:640)

testWithMillisOfSecondInDstChange_NewYork_winter(org.joda.time.TestDateTimeZoneCutover)  Time elapsed: 0.001 sec  <<< FAILURE!
junit.framework.ComparisonFailure: expected:<2007-11-04T0[1:30:00.123-05]:00> but was:<2007-11-04T0[2:30:00.123-04]:00>
	at junit.framework.Assert.assertEquals(Assert.java:81)
	at junit.framework.Assert.assertEquals(Assert.java:87)
	at org.joda.time.TestDateTimeZoneCutover.testWithMillisOfSecondInDstChange_NewYork_winter(TestDateTimeZoneCutover.java:1182)

testBug2182444_usCentral(org.joda.time.TestDateTimeZoneCutover)  Time elapsed: 0.001 sec  <<< FAILURE!
junit.framework.AssertionFailedError: Should be standard time
	at junit.framework.Assert.fail(Assert.java:47)
	at junit.framework.Assert.assertTrue(Assert.java:20)
	at org.joda.time.TestDateTimeZoneCutover.testBug2182444_usCentral(TestDateTimeZoneCutover.java:1213)

testBug2182444_ausNSW(org.joda.time.TestDateTimeZoneCutover)  Time elapsed: 0.001 sec  <<< FAILURE!
junit.framework.AssertionFailedError: Should be standard time
	at junit.framework.Assert.fail(Assert.java:47)
	at junit.framework.Assert.assertTrue(Assert.java:20)
	at org.joda.time.TestDateTimeZoneCutover.testBug2182444_ausNSW(TestDateTimeZoneCutover.java:1232)

testBug3192457_adjustOffset(org.joda.time.TestDateTimeZoneCutover)  Time elapsed: 0.001 sec  <<< FAILURE!
junit.framework.AssertionFailedError: expected:<2007-10-28T02:15:00.000+02:00> but was:<2007-10-28T01:15:00.000+02:00>
	at junit.framework.Assert.fail(Assert.java:47)
	at junit.framework.Assert.failNotEquals(Assert.java:280)
	at junit.framework.Assert.assertEquals(Assert.java:64)
	at junit.framework.Assert.assertEquals(Assert.java:71)
	at org.joda.time.TestDateTimeZoneCutover.testBug3192457_adjustOffset(TestDateTimeZoneCutover.java:1276)

testBug3476684_adjustOffset(org.joda.time.TestDateTimeZoneCutover)  Time elapsed: 0.001 sec  <<< FAILURE!
junit.framework.AssertionFailedError: expected:<2012-02-26T00:15:00.000-03:00> but was:<2012-02-25T23:15:00.000-03:00>
	at junit.framework.Assert.fail(Assert.java:47)
	at junit.framework.Assert.failNotEquals(Assert.java:280)
	at junit.framework.Assert.assertEquals(Assert.java:64)
	at junit.framework.Assert.assertEquals(Assert.java:71)
	at org.joda.time.TestDateTimeZoneCutover.testBug3476684_adjustOffset(TestDateTimeZoneCutover.java:1292)

testDateTimeCreation_newYork(org.joda.time.TestDateTimeZoneCutover)  Time elapsed: 0.001 sec  <<< FAILURE!
junit.framework.ComparisonFailure: expected:<...11-07T01:15:00.000-0[4]:00> but was:<...11-07T01:15:00.000-0[5]:00>
	at junit.framework.Assert.assertEquals(Assert.java:81)
	at junit.framework.Assert.assertEquals(Assert.java:87)
	at org.joda.time.TestDateTimeZoneCutover.testDateTimeCreation_newYork(TestDateTimeZoneCutover.java:1340)

testDateTimeCreation_losAngeles(org.joda.time.TestDateTimeZoneCutover)  Time elapsed: 0.001 sec  <<< FAILURE!
junit.framework.ComparisonFailure: expected:<...11-07T01:15:00.000-0[7]:00> but was:<...11-07T01:15:00.000-0[8]:00>
	at junit.framework.Assert.assertEquals(Assert.java:81)
	at junit.framework.Assert.assertEquals(Assert.java:87)
	at org.joda.time.TestDateTimeZoneCutover.testDateTimeCreation_losAngeles(TestDateTimeZoneCutover.java:1347)

test_getOffsetFromLocal_NewYork_Autumn(org.joda.time.TestDateTimeZoneCutover)  Time elapsed: 0.001 sec  <<< FAILURE!
junit.framework.AssertionFailedError: expected:<-18000000> but was:<-14400000>
	at junit.framework.Assert.fail(Assert.java:47)
	at junit.framework.Assert.failNotEquals(Assert.java:280)
	at junit.framework.Assert.assertEquals(Assert.java:64)
	at junit.framework.Assert.assertEquals(Assert.java:133)
	at junit.framework.Assert.assertEquals(Assert.java:139)
	at org.joda.time.TestDateTimeZoneCutover.doTest_getOffsetFromLocal(TestDateTimeZoneCutover.java:1369)
	at org.joda.time.TestDateTimeZoneCutover.doTest_getOffsetFromLocal(TestDateTimeZoneCutover.java:1355)
	at org.joda.time.TestDateTimeZoneCutover.test_getOffsetFromLocal_NewYork_Autumn(TestDateTimeZoneCutover.java:652)

test_DateTime_plusHour_NewYork_Autumn(org.joda.time.TestDateTimeZoneCutover)  Time elapsed: 0.001 sec  <<< FAILURE!
junit.framework.ComparisonFailure: expected:<2007-11-04T0[1:00:00.000-05]:00> but was:<2007-11-04T0[2:00:00.000-04]:00>
	at junit.framework.Assert.assertEquals(Assert.java:81)
	at junit.framework.Assert.assertEquals(Assert.java:87)
	at org.joda.time.TestDateTimeZoneCutover.test_DateTime_plusHour_NewYork_Autumn(TestDateTimeZoneCutover.java:677)

test_DateTime_minusHour_NewYork_Autumn(org.joda.time.TestDateTimeZoneCutover)  Time elapsed: 0 sec  <<< FAILURE!
junit.framework.ComparisonFailure: expected:<...11-04T08:00:00.000-0[5]:00> but was:<...11-04T08:00:00.000-0[4]:00>
	at junit.framework.Assert.assertEquals(Assert.java:81)
	at junit.framework.Assert.assertEquals(Assert.java:87)
	at org.joda.time.TestDateTimeZoneCutover.test_DateTime_minusHour_NewYork_Autumn(TestDateTimeZoneCutover.java:684)

test_DateTime_roundFloor_day_NewYork_Autumn_postCutover(org.joda.time.TestDateTimeZoneCutover)  Time elapsed: 0.001 sec  <<< FAILURE!
junit.framework.ComparisonFailure: expected:<2007-11-04T0[1:30:00.000-05]:00> but was:<2007-11-04T0[2:30:00.000-04]:00>
	at junit.framework.Assert.assertEquals(Assert.java:81)
	at junit.framework.Assert.assertEquals(Assert.java:87)
	at org.joda.time.TestDateTimeZoneCutover.test_DateTime_roundFloor_day_NewYork_Autumn_postCutover(TestDateTimeZoneCutover.java:706)

test_DateTime_roundFloor_hourOfDay_NewYork_Autumn_postCutover(org.joda.time.TestDateTimeZoneCutover)  Time elapsed: 0 sec  <<< FAILURE!
junit.framework.ComparisonFailure: expected:<2007-11-04T0[1:30:00.000-05]:00> but was:<2007-11-04T0[2:30:00.000-04]:00>
	at junit.framework.Assert.assertEquals(Assert.java:81)
	at junit.framework.Assert.assertEquals(Assert.java:87)
	at org.joda.time.TestDateTimeZoneCutover.test_DateTime_roundFloor_hourOfDay_NewYork_Autumn_postCutover(TestDateTimeZoneCutover.java:720)

test_DateTime_roundFloor_minuteOfHour_NewYork_Autumn_postCutover(org.joda.time.TestDateTimeZoneCutover)  Time elapsed: 0.001 sec  <<< FAILURE!
junit.framework.ComparisonFailure: expected:<2007-11-04T0[1:30:40.000-05]:00> but was:<2007-11-04T0[2:30:40.000-04]:00>
	at junit.framework.Assert.assertEquals(Assert.java:81)
	at junit.framework.Assert.assertEquals(Assert.java:87)
	at org.joda.time.TestDateTimeZoneCutover.test_DateTime_roundFloor_minuteOfHour_NewYork_Autumn_postCutover(TestDateTimeZoneCutover.java:734)

test_DateTime_roundFloor_secondOfMinute_NewYork_Autumn_postCutover(org.joda.time.TestDateTimeZoneCutover)  Time elapsed: 0.001 sec  <<< FAILURE!
junit.framework.ComparisonFailure: expected:<2007-11-04T0[1:30:40.500-05]:00> but was:<2007-11-04T0[2:30:40.500-04]:00>
	at junit.framework.Assert.assertEquals(Assert.java:81)
	at junit.framework.Assert.assertEquals(Assert.java:87)
	at org.joda.time.TestDateTimeZoneCutover.test_DateTime_roundFloor_secondOfMinute_NewYork_Autumn_postCutover(TestDateTimeZoneCutover.java:748)

test_DateTime_roundCeiling_day_NewYork_Autumn_preCutover(org.joda.time.TestDateTimeZoneCutover)  Time elapsed: 0 sec  <<< FAILURE!
junit.framework.ComparisonFailure: expected:<...11-05T00:00:00.000-0[5]:00> but was:<...11-05T00:00:00.000-0[4]:00>
	at junit.framework.Assert.assertEquals(Assert.java:81)
	at junit.framework.Assert.assertEquals(Assert.java:87)
	at org.joda.time.TestDateTimeZoneCutover.test_DateTime_roundCeiling_day_NewYork_Autumn_preCutover(TestDateTimeZoneCutover.java:758)

test_DateTime_roundCeiling_day_NewYork_Autumn_postCutover(org.joda.time.TestDateTimeZoneCutover)  Time elapsed: 0 sec  <<< FAILURE!
junit.framework.ComparisonFailure: expected:<2007-11-04T0[1:30:00.000-05]:00> but was:<2007-11-04T0[2:30:00.000-04]:00>
	at junit.framework.Assert.assertEquals(Assert.java:81)
	at junit.framework.Assert.assertEquals(Assert.java:87)
	at org.joda.time.TestDateTimeZoneCutover.test_DateTime_roundCeiling_day_NewYork_Autumn_postCutover(TestDateTimeZoneCutover.java:763)

test_DateTime_roundCeiling_hourOfDay_NewYork_Autumn_preCutover(org.joda.time.TestDateTimeZoneCutover)  Time elapsed: 0.001 sec  <<< FAILURE!
junit.framework.ComparisonFailure: expected:<2007-11-04T0[1:00:00.000-05]:00> but was:<2007-11-04T0[2:00:00.000-04]:00>
	at junit.framework.Assert.assertEquals(Assert.java:81)
	at junit.framework.Assert.assertEquals(Assert.java:87)
	at org.joda.time.TestDateTimeZoneCutover.test_DateTime_roundCeiling_hourOfDay_NewYork_Autumn_preCutover(TestDateTimeZoneCutover.java:772)

test_DateTime_roundCeiling_hourOfDay_NewYork_Autumn_postCutover(org.joda.time.TestDateTimeZoneCutover)  Time elapsed: 0 sec  <<< FAILURE!
junit.framework.ComparisonFailure: expected:<2007-11-04T0[1:30:00.000-05]:00> but was:<2007-11-04T0[2:30:00.000-04]:00>
	at junit.framework.Assert.assertEquals(Assert.java:81)
	at junit.framework.Assert.assertEquals(Assert.java:87)
	at org.joda.time.TestDateTimeZoneCutover.test_DateTime_roundCeiling_hourOfDay_NewYork_Autumn_postCutover(TestDateTimeZoneCutover.java:777)

test_DateTime_roundCeiling_minuteOfHour_NewYork_Autumn_postCutover(org.joda.time.TestDateTimeZoneCutover)  Time elapsed: 0.001 sec  <<< FAILURE!
junit.framework.ComparisonFailure: expected:<2007-11-04T0[1:30:40.000-05]:00> but was:<2007-11-04T0[2:30:40.000-04]:00>
	at junit.framework.Assert.assertEquals(Assert.java:81)
	at junit.framework.Assert.assertEquals(Assert.java:87)
	at org.joda.time.TestDateTimeZoneCutover.test_DateTime_roundCeiling_minuteOfHour_NewYork_Autumn_postCutover(TestDateTimeZoneCutover.java:791)

test_DateTime_roundCeiling_secondOfMinute_NewYork_Autumn_postCutover(org.joda.time.TestDateTimeZoneCutover)  Time elapsed: 0 sec  <<< FAILURE!
junit.framework.ComparisonFailure: expected:<2007-11-04T0[1:30:40.500-05]:00> but was:<2007-11-04T0[2:30:40.500-04]:00>
	at junit.framework.Assert.assertEquals(Assert.java:81)
	at junit.framework.Assert.assertEquals(Assert.java:87)
	at org.joda.time.TestDateTimeZoneCutover.test_DateTime_roundCeiling_secondOfMinute_NewYork_Autumn_postCutover(TestDateTimeZoneCutover.java:805)

test_MoscowIsCorrect_Spring(org.joda.time.TestDateTimeZoneCutover)  Time elapsed: 0 sec  <<< FAILURE!
junit.framework.ComparisonFailure: expected:<2007-03-25T0[3:00:00.000+04]:00> but was:<2007-03-25T0[2:00:00.000+03]:00>
	at junit.framework.Assert.assertEquals(Assert.java:81)
	at junit.framework.Assert.assertEquals(Assert.java:87)
	at org.joda.time.TestDateTimeZoneCutover.test_MoscowIsCorrect_Spring(TestDateTimeZoneCutover.java:824)

test_getOffsetFromLocal_Moscow_Spring(org.joda.time.TestDateTimeZoneCutover)  Time elapsed: 0.001 sec  <<< FAILURE!
junit.framework.ComparisonFailure: 2007-03-25T02:00:00.000+03:00 expected:<2007-03-25T0[3:00:00.000+04]:00> but was:<2007-03-25T0[2:00:00.000+03]:00>
	at junit.framework.Assert.assertEquals(Assert.java:81)
	at org.joda.time.TestDateTimeZoneCutover.doTest_getOffsetFromLocal(TestDateTimeZoneCutover.java:1371)
	at org.joda.time.TestDateTimeZoneCutover.doTest_getOffsetFromLocal(TestDateTimeZoneCutover.java:1355)
	at org.joda.time.TestDateTimeZoneCutover.test_getOffsetFromLocal_Moscow_Spring(TestDateTimeZoneCutover.java:833)

test_DateTime_setHourAcross_Moscow_Spring(org.joda.time.TestDateTimeZoneCutover)  Time elapsed: 0 sec  <<< FAILURE!
junit.framework.ComparisonFailure: expected:<...03-25T04:00:00.000+0[4]:00> but was:<...03-25T04:00:00.000+0[3]:00>
	at junit.framework.Assert.assertEquals(Assert.java:81)
	at junit.framework.Assert.assertEquals(Assert.java:87)
	at org.joda.time.TestDateTimeZoneCutover.test_DateTime_setHourAcross_Moscow_Spring(TestDateTimeZoneCutover.java:849)

test_DateTime_setHourForward_Moscow_Spring(org.joda.time.TestDateTimeZoneCutover)  Time elapsed: 0 sec  <<< FAILURE!
junit.framework.AssertionFailedError
	at junit.framework.Assert.fail(Assert.java:47)
	at junit.framework.Assert.fail(Assert.java:53)
	at org.joda.time.TestDateTimeZoneCutover.test_DateTime_setHourForward_Moscow_Spring(TestDateTimeZoneCutover.java:858)

test_DateTime_setHourBack_Moscow_Spring(org.joda.time.TestDateTimeZoneCutover)  Time elapsed: 0.001 sec  <<< FAILURE!
junit.framework.ComparisonFailure: expected:<...03-25T08:00:00.000+0[4]:00> but was:<...03-25T08:00:00.000+0[3]:00>
	at junit.framework.Assert.assertEquals(Assert.java:81)
	at junit.framework.Assert.assertEquals(Assert.java:87)
	at org.joda.time.TestDateTimeZoneCutover.test_DateTime_setHourBack_Moscow_Spring(TestDateTimeZoneCutover.java:866)

test_MoscowIsCorrect_Autumn(org.joda.time.TestDateTimeZoneCutover)  Time elapsed: 0 sec  <<< FAILURE!
junit.framework.ComparisonFailure: expected:<2007-10-28T0[2:00:00.000+03]:00> but was:<2007-10-28T0[3:00:00.000+04]:00>
	at junit.framework.Assert.assertEquals(Assert.java:81)
	at junit.framework.Assert.assertEquals(Assert.java:87)
	at org.joda.time.TestDateTimeZoneCutover.test_MoscowIsCorrect_Autumn(TestDateTimeZoneCutover.java:885)

test_getOffsetFromLocal_Moscow_Autumn(org.joda.time.TestDateTimeZoneCutover)  Time elapsed: 0.002 sec  <<< FAILURE!
junit.framework.AssertionFailedError: expected:<10800000> but was:<14400000>
	at junit.framework.Assert.fail(Assert.java:47)
	at junit.framework.Assert.failNotEquals(Assert.java:280)
	at junit.framework.Assert.assertEquals(Assert.java:64)
	at junit.framework.Assert.assertEquals(Assert.java:133)
	at junit.framework.Assert.assertEquals(Assert.java:139)
	at org.joda.time.TestDateTimeZoneCutover.doTest_getOffsetFromLocal(TestDateTimeZoneCutover.java:1369)
	at org.joda.time.TestDateTimeZoneCutover.doTest_getOffsetFromLocal(TestDateTimeZoneCutover.java:1355)
	at org.joda.time.TestDateTimeZoneCutover.test_getOffsetFromLocal_Moscow_Autumn(TestDateTimeZoneCutover.java:902)

test_DateTime_plusHour_Moscow_Autumn(org.joda.time.TestDateTimeZoneCutover)  Time elapsed: 0 sec  <<< FAILURE!
junit.framework.ComparisonFailure: expected:<2007-10-28T0[2:00:00.000+03]:00> but was:<2007-10-28T0[3:00:00.000+04]:00>
	at junit.framework.Assert.assertEquals(Assert.java:81)
	at junit.framework.Assert.assertEquals(Assert.java:87)
	at org.joda.time.TestDateTimeZoneCutover.test_DateTime_plusHour_Moscow_Autumn(TestDateTimeZoneCutover.java:935)

test_DateTime_minusHour_Moscow_Autumn(org.joda.time.TestDateTimeZoneCutover)  Time elapsed: 0.001 sec  <<< FAILURE!
junit.framework.ComparisonFailure: expected:<...10-28T09:00:00.000+0[3]:00> but was:<...10-28T09:00:00.000+0[4]:00>
	at junit.framework.Assert.assertEquals(Assert.java:81)
	at junit.framework.Assert.assertEquals(Assert.java:87)
	at org.joda.time.TestDateTimeZoneCutover.test_DateTime_minusHour_Moscow_Autumn(TestDateTimeZoneCutover.java:942)

testCalendar(org.joda.time.chrono.TestCopticChronology)  Time elapsed: 0.375 sec  <<< FAILURE!
junit.framework.AssertionFailedError: expected:<1> but was:<-1>
	at junit.framework.Assert.fail(Assert.java:47)
	at junit.framework.Assert.failNotEquals(Assert.java:280)
	at junit.framework.Assert.assertEquals(Assert.java:64)
	at junit.framework.Assert.assertEquals(Assert.java:198)
	at junit.framework.Assert.assertEquals(Assert.java:204)
	at org.joda.time.chrono.TestCopticChronology.testCalendar(TestCopticChronology.java:358)

testSampleDate(org.joda.time.chrono.TestCopticChronology)  Time elapsed: 0.001 sec  <<< FAILURE!
junit.framework.AssertionFailedError: expected:<3> but was:<7>
	at junit.framework.Assert.fail(Assert.java:47)
	at junit.framework.Assert.failNotEquals(Assert.java:280)
	at junit.framework.Assert.assertEquals(Assert.java:64)
	at junit.framework.Assert.assertEquals(Assert.java:198)
	at junit.framework.Assert.assertEquals(Assert.java:204)
	at org.joda.time.chrono.TestCopticChronology.testSampleDate(TestCopticChronology.java:437)

testCalendar(org.joda.time.chrono.TestEthiopicChronology)  Time elapsed: 0.32 sec  <<< FAILURE!
junit.framework.AssertionFailedError: expected:<1> but was:<-1>
	at junit.framework.Assert.fail(Assert.java:47)
	at junit.framework.Assert.failNotEquals(Assert.java:280)
	at junit.framework.Assert.assertEquals(Assert.java:64)
	at junit.framework.Assert.assertEquals(Assert.java:198)
	at junit.framework.Assert.assertEquals(Assert.java:204)
	at org.joda.time.chrono.TestEthiopicChronology.testCalendar(TestEthiopicChronology.java:358)

testSampleDate(org.joda.time.chrono.TestEthiopicChronology)  Time elapsed: 0.001 sec  <<< FAILURE!
junit.framework.AssertionFailedError: expected:<3> but was:<7>
	at junit.framework.Assert.fail(Assert.java:47)
	at junit.framework.Assert.failNotEquals(Assert.java:280)
	at junit.framework.Assert.assertEquals(Assert.java:64)
	at junit.framework.Assert.assertEquals(Assert.java:198)
	at junit.framework.Assert.assertEquals(Assert.java:204)
	at org.joda.time.chrono.TestEthiopicChronology.testSampleDate(TestEthiopicChronology.java:437)

testSampleDate3(org.joda.time.chrono.TestIslamicChronology)  Time elapsed: 0.001 sec  <<< FAILURE!
junit.framework.AssertionFailedError: expected:<2> but was:<6>
	at junit.framework.Assert.fail(Assert.java:47)
	at junit.framework.Assert.failNotEquals(Assert.java:280)
	at junit.framework.Assert.assertEquals(Assert.java:64)
	at junit.framework.Assert.assertEquals(Assert.java:198)
	at junit.framework.Assert.assertEquals(Assert.java:204)
	at org.joda.time.chrono.TestIslamicChronology.testSampleDate3(TestIslamicChronology.java:569)

testCalendar(org.joda.time.chrono.TestIslamicChronology)  Time elapsed: 0.734 sec  <<< FAILURE!
junit.framework.AssertionFailedError: expected:<1> but was:<-1>
	at junit.framework.Assert.fail(Assert.java:47)
	at junit.framework.Assert.failNotEquals(Assert.java:280)
	at junit.framework.Assert.assertEquals(Assert.java:64)
	at junit.framework.Assert.assertEquals(Assert.java:198)
	at junit.framework.Assert.assertEquals(Assert.java:204)
	at org.joda.time.chrono.TestIslamicChronology.testCalendar(TestIslamicChronology.java:363)

testSampleDate2(org.joda.time.chrono.TestIslamicChronology)  Time elapsed: 0 sec  <<< FAILURE!
junit.framework.AssertionFailedError: expected:<6> but was:<3>
	at junit.framework.Assert.fail(Assert.java:47)
	at junit.framework.Assert.failNotEquals(Assert.java:280)
	at junit.framework.Assert.assertEquals(Assert.java:64)
	at junit.framework.Assert.assertEquals(Assert.java:198)
	at junit.framework.Assert.assertEquals(Assert.java:204)
	at org.joda.time.chrono.TestIslamicChronology.testSampleDate2(TestIslamicChronology.java:513)

test_plusWeekyears_positiveToZero_crossCutover(org.joda.time.chrono.TestGJDate)  Time elapsed: 0 sec  <<< ERROR!
org.joda.time.IllegalFieldValueException: Value -2 for dayOfWeek must be in the range [1,7]
	at org.joda.time.field.FieldUtils.verifyValueBounds(FieldUtils.java:234)
	at org.joda.time.field.PreciseDurationDateTimeField.set(PreciseDurationDateTimeField.java:79)
	at org.joda.time.LocalDate.withDayOfWeek(LocalDate.java:1721)
	at org.joda.time.chrono.TestGJDate.test_plusWeekyears_positiveToZero_crossCutover(TestGJDate.java:117)

test_plusWeekyears_positiveToNegative_crossCutover(org.joda.time.chrono.TestGJDate)  Time elapsed: 0.001 sec  <<< ERROR!
org.joda.time.IllegalFieldValueException: Value -2 for dayOfWeek must be in the range [1,7]
	at org.joda.time.field.FieldUtils.verifyValueBounds(FieldUtils.java:234)
	at org.joda.time.field.PreciseDurationDateTimeField.set(PreciseDurationDateTimeField.java:79)
	at org.joda.time.LocalDate.withDayOfWeek(LocalDate.java:1721)
	at org.joda.time.chrono.TestGJDate.test_plusWeekyears_positiveToNegative_crossCutover(TestGJDate.java:123)

testChronology(org.joda.time.chrono.gj.MainTest)  Time elapsed: 0.005 sec  <<< FAILURE!
junit.framework.AssertionFailedError
	at junit.framework.Assert.fail(Assert.java:47)
	at org.joda.time.chrono.gj.MainTest.testChronology(MainTest.java:158)

testChronology(org.joda.time.chrono.gj.MainTest)  Time elapsed: 0.004 sec  <<< FAILURE!
junit.framework.AssertionFailedError
	at junit.framework.Assert.fail(Assert.java:47)
	at org.joda.time.chrono.gj.MainTest.testChronology(MainTest.java:158)

testGetInstantMillis_Object(org.joda.time.convert.TestStringConverter)  Time elapsed: 0.001 sec  <<< ERROR!
org.joda.time.IllegalFieldValueException: Cannot parse "2004-W24-3T+08:00": Value -4 for dayOfWeek must be in the range [1,7]
	at org.joda.time.field.FieldUtils.verifyValueBounds(FieldUtils.java:234)
	at org.joda.time.field.PreciseDurationDateTimeField.set(PreciseDurationDateTimeField.java:79)
	at org.joda.time.chrono.BasicWeekyearDateTimeField.set(BasicWeekyearDateTimeField.java:201)
	at org.joda.time.format.DateTimeParserBucket$SavedField.set(DateTimeParserBucket.java:568)
	at org.joda.time.format.DateTimeParserBucket.computeMillis(DateTimeParserBucket.java:451)
	at org.joda.time.format.DateTimeParserBucket.doParseMillis(DateTimeParserBucket.java:182)
	at org.joda.time.format.DateTimeFormatter.parseMillis(DateTimeFormatter.java:780)
	at org.joda.time.convert.StringConverter.getInstantMillis(StringConverter.java:65)
	at org.joda.time.convert.TestStringConverter.testGetInstantMillis_Object(TestStringConverter.java:129)

testParseLocalDate_weekyear_month_week_2010(org.joda.time.format.TestDateTimeFormatter)  Time elapsed: 0.001 sec  <<< ERROR!
org.joda.time.IllegalFieldValueException: Cannot parse "2010-01-01": Value -4 for dayOfWeek must be in the range [1,7]
	at org.joda.time.field.FieldUtils.verifyValueBounds(FieldUtils.java:234)
	at org.joda.time.field.PreciseDurationDateTimeField.set(PreciseDurationDateTimeField.java:79)
	at org.joda.time.chrono.BasicWeekyearDateTimeField.set(BasicWeekyearDateTimeField.java:201)
	at org.joda.time.chrono.GJChronology$CutoverField.set(GJChronology.java:727)
	at org.joda.time.format.DateTimeParserBucket$SavedField.set(DateTimeParserBucket.java:568)
	at org.joda.time.format.DateTimeParserBucket.computeMillis(DateTimeParserBucket.java:451)
	at org.joda.time.format.DateTimeParserBucket.computeMillis(DateTimeParserBucket.java:411)
	at org.joda.time.format.DateTimeFormatter.parseLocalDateTime(DateTimeFormatter.java:841)
	at org.joda.time.format.DateTimeFormatter.parseLocalDate(DateTimeFormatter.java:798)
	at org.joda.time.format.TestDateTimeFormatter.testParseLocalDate_weekyear_month_week_2010(TestDateTimeFormatter.java:428)

testParseLocalDate_year_month_week_2014(org.joda.time.format.TestDateTimeFormatter)  Time elapsed: 0 sec  <<< FAILURE!
junit.framework.AssertionFailedError: expected:<2013-12-30> but was:<2014-01-06>
	at junit.framework.Assert.fail(Assert.java:47)
	at junit.framework.Assert.failNotEquals(Assert.java:280)
	at junit.framework.Assert.assertEquals(Assert.java:64)
	at junit.framework.Assert.assertEquals(Assert.java:71)
	at org.joda.time.format.TestDateTimeFormatter.testParseLocalDate_year_month_week_2014(TestDateTimeFormatter.java:478)

testParseLocalDate_year_month_week_2015(org.joda.time.format.TestDateTimeFormatter)  Time elapsed: 0.001 sec  <<< FAILURE!
junit.framework.AssertionFailedError: expected:<2014-12-29> but was:<2015-01-05>
	at junit.framework.Assert.fail(Assert.java:47)
	at junit.framework.Assert.failNotEquals(Assert.java:280)
	at junit.framework.Assert.assertEquals(Assert.java:64)
	at junit.framework.Assert.assertEquals(Assert.java:71)
	at org.joda.time.format.TestDateTimeFormatter.testParseLocalDate_year_month_week_2015(TestDateTimeFormatter.java:484)

testParseInto_simple_precedence(org.joda.time.format.TestDateTimeFormatter)  Time elapsed: 0.001 sec  <<< FAILURE!
junit.framework.AssertionFailedError: expected:<2004-06-07T11:20:30.000+01:00> but was:<2004-06-05T11:20:30.000+01:00>
	at junit.framework.Assert.fail(Assert.java:47)
	at junit.framework.Assert.failNotEquals(Assert.java:280)
	at junit.framework.Assert.assertEquals(Assert.java:64)
	at junit.framework.Assert.assertEquals(Assert.java:71)
	at org.joda.time.format.TestDateTimeFormatter.testParseInto_simple_precedence(TestDateTimeFormatter.java:816)

testPrint_simple(org.joda.time.format.TestDateTimeFormatter)  Time elapsed: 0 sec  <<< FAILURE!
junit.framework.ComparisonFailure: expected:<[Wed] 2004-06-09T10:20:30...> but was:<[Mon] 2004-06-09T10:20:30...>
	at junit.framework.Assert.assertEquals(Assert.java:81)
	at junit.framework.Assert.assertEquals(Assert.java:87)
	at org.joda.time.format.TestDateTimeFormatter.testPrint_simple(TestDateTimeFormatter.java:112)

testPrint_locale(org.joda.time.format.TestDateTimeFormatter)  Time elapsed: 0.001 sec  <<< FAILURE!
junit.framework.ComparisonFailure: expected:<[mer]. 2004-06-09T10:20:3...> but was:<[lun]. 2004-06-09T10:20:3...>
	at junit.framework.Assert.assertEquals(Assert.java:81)
	at junit.framework.Assert.assertEquals(Assert.java:87)
	at org.joda.time.format.TestDateTimeFormatter.testPrint_locale(TestDateTimeFormatter.java:127)

testPrint_zone(org.joda.time.format.TestDateTimeFormatter)  Time elapsed: 0 sec  <<< FAILURE!
junit.framework.ComparisonFailure: expected:<[Wed] 2004-06-09T06:20:30...> but was:<[Tue] 2004-06-09T06:20:30...>
	at junit.framework.Assert.assertEquals(Assert.java:81)
	at junit.framework.Assert.assertEquals(Assert.java:87)
	at org.joda.time.format.TestDateTimeFormatter.testPrint_zone(TestDateTimeFormatter.java:134)

testPrint_chrono(org.joda.time.format.TestDateTimeFormatter)  Time elapsed: 0.001 sec  <<< FAILURE!
junit.framework.ComparisonFailure: expected:<[Wed] 2004-06-09T12:20:30...> but was:<[Thu] 2004-06-09T12:20:30...>
	at junit.framework.Assert.assertEquals(Assert.java:81)
	at junit.framework.Assert.assertEquals(Assert.java:87)
	at org.joda.time.format.TestDateTimeFormatter.testPrint_chrono(TestDateTimeFormatter.java:148)

testPrint_bufferMethods(org.joda.time.format.TestDateTimeFormatter)  Time elapsed: 0.001 sec  <<< FAILURE!
junit.framework.ComparisonFailure: expected:<[Wed] 2004-06-09T10:20:30...> but was:<[Mon] 2004-06-09T10:20:30...>
	at junit.framework.Assert.assertEquals(Assert.java:81)
	at junit.framework.Assert.assertEquals(Assert.java:87)
	at org.joda.time.format.TestDateTimeFormatter.testPrint_bufferMethods(TestDateTimeFormatter.java:164)

testPrint_writerMethods(org.joda.time.format.TestDateTimeFormatter)  Time elapsed: 0 sec  <<< FAILURE!
junit.framework.ComparisonFailure: expected:<[Wed] 2004-06-09T10:20:30...> but was:<[Mon] 2004-06-09T10:20:30...>
	at junit.framework.Assert.assertEquals(Assert.java:81)
	at junit.framework.Assert.assertEquals(Assert.java:87)
	at org.joda.time.format.TestDateTimeFormatter.testPrint_writerMethods(TestDateTimeFormatter.java:186)

testPrint_appendableMethods(org.joda.time.format.TestDateTimeFormatter)  Time elapsed: 0.001 sec  <<< FAILURE!
junit.framework.ComparisonFailure: expected:<[Wed] 2004-06-09T10:20:30...> but was:<[Mon] 2004-06-09T10:20:30...>
	at junit.framework.Assert.assertEquals(Assert.java:81)
	at junit.framework.Assert.assertEquals(Assert.java:87)
	at org.joda.time.format.TestDateTimeFormatter.testPrint_appendableMethods(TestDateTimeFormatter.java:208)

testPrint_chrono_and_zone(org.joda.time.format.TestDateTimeFormatter)  Time elapsed: 0 sec  <<< FAILURE!
junit.framework.ComparisonFailure: expected:<[Wed] 2004-06-09T10:20:30...> but was:<[Mon] 2004-06-09T10:20:30...>
	at junit.framework.Assert.assertEquals(Assert.java:81)
	at junit.framework.Assert.assertEquals(Assert.java:87)
	at org.joda.time.format.TestDateTimeFormatter.testPrint_chrono_and_zone(TestDateTimeFormatter.java:228)

testFormat_weekyearOfEra_twoDigit(org.joda.time.format.TestDateTimeFormat)  Time elapsed: 0.001 sec  <<< ERROR!
org.joda.time.IllegalFieldValueException: Cannot parse "04": Value -2 for dayOfWeek must be in the range [1,7]
	at org.joda.time.field.FieldUtils.verifyValueBounds(FieldUtils.java:234)
	at org.joda.time.field.PreciseDurationDateTimeField.set(PreciseDurationDateTimeField.java:79)
	at org.joda.time.chrono.BasicWeekyearDateTimeField.set(BasicWeekyearDateTimeField.java:201)
	at org.joda.time.format.DateTimeParserBucket$SavedField.set(DateTimeParserBucket.java:568)
	at org.joda.time.format.DateTimeParserBucket.computeMillis(DateTimeParserBucket.java:451)
	at org.joda.time.format.DateTimeParserBucket.computeMillis(DateTimeParserBucket.java:411)
	at org.joda.time.format.DateTimeFormatter.parseDateTime(DateTimeFormatter.java:882)
	at org.joda.time.format.TestDateTimeFormat.testFormat_weekyearOfEra_twoDigit(TestDateTimeFormat.java:392)

testFormat_weekOfWeekyear(org.joda.time.format.TestDateTimeFormat)  Time elapsed: 0 sec  <<< FAILURE!
junit.framework.ComparisonFailure: 2004-06-09T10:20:30.040Z expected:<2[4]> but was:<2[3]>
	at junit.framework.Assert.assertEquals(Assert.java:81)
	at org.joda.time.format.TestDateTimeFormat.testFormat_weekOfWeekyear(TestDateTimeFormat.java:499)

testFormat_dayOfWeek(org.joda.time.format.TestDateTimeFormat)  Time elapsed: 0.001 sec  <<< FAILURE!
junit.framework.ComparisonFailure: 2004-06-09T10:20:30.040Z expected:<[3]> but was:<[1]>
	at junit.framework.Assert.assertEquals(Assert.java:81)
	at org.joda.time.format.TestDateTimeFormat.testFormat_dayOfWeek(TestDateTimeFormat.java:512)

testFormat_dayOfWeekShortText(org.joda.time.format.TestDateTimeFormat)  Time elapsed: 0 sec  <<< FAILURE!
junit.framework.ComparisonFailure: 2004-06-09T10:20:30.040Z expected:<[Wed]> but was:<[Mon]>
	at junit.framework.Assert.assertEquals(Assert.java:81)
	at org.joda.time.format.TestDateTimeFormat.testFormat_dayOfWeekShortText(TestDateTimeFormat.java:525)

testFormat_dayOfWeekText(org.joda.time.format.TestDateTimeFormat)  Time elapsed: 0.001 sec  <<< FAILURE!
junit.framework.ComparisonFailure: 2004-06-09T10:20:30.040Z expected:<[Wednes]day> but was:<[Mon]day>
	at junit.framework.Assert.assertEquals(Assert.java:81)
	at org.joda.time.format.TestDateTimeFormat.testFormat_dayOfWeekText(TestDateTimeFormat.java:541)

testFormatParse_textAdjoiningMonthDOW_UK(org.joda.time.format.TestDateTimeFormat)  Time elapsed: 0.001 sec  <<< FAILURE!
junit.framework.ComparisonFailure: expected:<$23Jun[Sat]> but was:<$23Jun[Mon]>
	at junit.framework.Assert.assertEquals(Assert.java:81)
	at junit.framework.Assert.assertEquals(Assert.java:87)
	at org.joda.time.format.TestDateTimeFormat.testFormatParse_textAdjoiningMonthDOW_UK(TestDateTimeFormat.java:1134)

testFormat_weekDate(org.joda.time.format.TestISODateTimeFormat)  Time elapsed: 0 sec  <<< FAILURE!
junit.framework.ComparisonFailure: expected:<2004-W2[4-3]> but was:<2004-W2[3-1]>
	at junit.framework.Assert.assertEquals(Assert.java:81)
	at junit.framework.Assert.assertEquals(Assert.java:87)
	at org.joda.time.format.TestISODateTimeFormat.testFormat_weekDate(TestISODateTimeFormat.java:243)

testFormat_weekDateTime(org.joda.time.format.TestISODateTimeFormat)  Time elapsed: 0 sec  <<< FAILURE!
junit.framework.ComparisonFailure: expected:<2004-W2[4-3]T10:20:30.040Z> but was:<2004-W2[3-1]T10:20:30.040Z>
	at junit.framework.Assert.assertEquals(Assert.java:81)
	at junit.framework.Assert.assertEquals(Assert.java:87)
	at org.joda.time.format.TestISODateTimeFormat.testFormat_weekDateTime(TestISODateTimeFormat.java:254)

testFormat_weekDateTimeNoMillis(org.joda.time.format.TestISODateTimeFormat)  Time elapsed: 0.001 sec  <<< FAILURE!
junit.framework.ComparisonFailure: expected:<2004-W2[4-3]T10:20:30Z> but was:<2004-W2[3-1]T10:20:30Z>
	at junit.framework.Assert.assertEquals(Assert.java:81)
	at junit.framework.Assert.assertEquals(Assert.java:87)
	at org.joda.time.format.TestISODateTimeFormat.testFormat_weekDateTimeNoMillis(TestISODateTimeFormat.java:265)

testFormat_basicWeekDate(org.joda.time.format.TestISODateTimeFormat)  Time elapsed: 0.001 sec  <<< FAILURE!
junit.framework.ComparisonFailure: expected:<2004W2[43]> but was:<2004W2[31]>
	at junit.framework.Assert.assertEquals(Assert.java:81)
	at junit.framework.Assert.assertEquals(Assert.java:87)
	at org.joda.time.format.TestISODateTimeFormat.testFormat_basicWeekDate(TestISODateTimeFormat.java:387)

testFormat_basicWeekDateTime(org.joda.time.format.TestISODateTimeFormat)  Time elapsed: 0 sec  <<< FAILURE!
junit.framework.ComparisonFailure: expected:<2004W2[43]T102030.040Z> but was:<2004W2[31]T102030.040Z>
	at junit.framework.Assert.assertEquals(Assert.java:81)
	at junit.framework.Assert.assertEquals(Assert.java:87)
	at org.joda.time.format.TestISODateTimeFormat.testFormat_basicWeekDateTime(TestISODateTimeFormat.java:398)

testFormat_basicWeekDateTimeNoMillis(org.joda.time.format.TestISODateTimeFormat)  Time elapsed: 0.001 sec  <<< FAILURE!
junit.framework.ComparisonFailure: expected:<2004W2[43]T102030Z> but was:<2004W2[31]T102030Z>
	at junit.framework.Assert.assertEquals(Assert.java:81)
	at junit.framework.Assert.assertEquals(Assert.java:87)
	at org.joda.time.format.TestISODateTimeFormat.testFormat_basicWeekDateTimeNoMillis(TestISODateTimeFormat.java:409)

testFormat_weekyearWeek(org.joda.time.format.TestISODateTimeFormat)  Time elapsed: 0.003 sec  <<< FAILURE!
junit.framework.ComparisonFailure: expected:<2004-W2[4]> but was:<2004-W2[3]>
	at junit.framework.Assert.assertEquals(Assert.java:81)
	at junit.framework.Assert.assertEquals(Assert.java:87)
	at org.joda.time.format.TestISODateTimeFormat.testFormat_weekyearWeek(TestISODateTimeFormat.java:465)

testFormat_weekyearWeekDay(org.joda.time.format.TestISODateTimeFormat)  Time elapsed: 0 sec  <<< FAILURE!
junit.framework.ComparisonFailure: expected:<2004-W2[4-3]> but was:<2004-W2[3-1]>
	at junit.framework.Assert.assertEquals(Assert.java:81)
	at junit.framework.Assert.assertEquals(Assert.java:87)
	at org.joda.time.format.TestISODateTimeFormat.testFormat_weekyearWeekDay(TestISODateTimeFormat.java:476)

testSerialization(org.joda.time.tz.TestBuilder)  Time elapsed: 0.022 sec  <<< FAILURE!
junit.framework.AssertionFailedError: expected:<9972000000> but was:<10317600000>
	at junit.framework.Assert.fail(Assert.java:47)
	at junit.framework.Assert.failNotEquals(Assert.java:280)
	at junit.framework.Assert.assertEquals(Assert.java:64)
	at junit.framework.Assert.assertEquals(Assert.java:133)
	at junit.framework.Assert.assertEquals(Assert.java:139)
	at org.joda.time.tz.TestBuilder.testForwardTransitions(TestBuilder.java:234)
	at org.joda.time.tz.TestBuilder.testSerialization(TestBuilder.java:282)

testReverseTransitions(org.joda.time.tz.TestBuilder)  Time elapsed: 0.009 sec  <<< FAILURE!
junit.framework.AssertionFailedError: expected:<972809999999> but was:<955101599999>
	at junit.framework.Assert.fail(Assert.java:47)
	at junit.framework.Assert.failNotEquals(Assert.java:280)
	at junit.framework.Assert.assertEquals(Assert.java:64)
	at junit.framework.Assert.assertEquals(Assert.java:133)
	at junit.framework.Assert.assertEquals(Assert.java:139)
	at org.joda.time.tz.TestBuilder.testReverseTransitions(TestBuilder.java:270)
	at org.joda.time.tz.TestBuilder.testReverseTransitions(TestBuilder.java:255)

testForwardTransitions(org.joda.time.tz.TestBuilder)  Time elapsed: 0.026 sec  <<< FAILURE!
junit.framework.AssertionFailedError: expected:<9972000000> but was:<10317600000>
	at junit.framework.Assert.fail(Assert.java:47)
	at junit.framework.Assert.failNotEquals(Assert.java:280)
	at junit.framework.Assert.assertEquals(Assert.java:64)
	at junit.framework.Assert.assertEquals(Assert.java:133)
	at junit.framework.Assert.assertEquals(Assert.java:139)
	at org.joda.time.tz.TestBuilder.testForwardTransitions(TestBuilder.java:234)
	at org.joda.time.tz.TestBuilder.testForwardTransitions(TestBuilder.java:217)

testCompile(org.joda.time.tz.TestCompiler)  Time elapsed: 0.051 sec  <<< FAILURE!
junit.framework.AssertionFailedError: expected:<9972000000> but was:<10317600000>
	at junit.framework.Assert.fail(Assert.java:47)
	at junit.framework.Assert.failNotEquals(Assert.java:280)
	at junit.framework.Assert.assertEquals(Assert.java:64)
	at junit.framework.Assert.assertEquals(Assert.java:133)
	at junit.framework.Assert.assertEquals(Assert.java:139)
	at org.joda.time.tz.TestBuilder.testForwardTransitions(TestBuilder.java:234)
	at org.joda.time.tz.TestCompiler.testCompile(TestCompiler.java:117)

test_Amman_2003(org.joda.time.tz.TestCompiler)  Time elapsed: 0.001 sec  <<< FAILURE!
junit.framework.AssertionFailedError: expected:<1049061600000> but was:<1048802400000>
	at junit.framework.Assert.fail(Assert.java:47)
	at junit.framework.Assert.failNotEquals(Assert.java:280)
	at junit.framework.Assert.assertEquals(Assert.java:64)
	at junit.framework.Assert.assertEquals(Assert.java:133)
	at junit.framework.Assert.assertEquals(Assert.java:139)
	at org.joda.time.tz.TestCompiler.test_Amman_2003(TestCompiler.java:210)

test_Amman_2004(org.joda.time.tz.TestCompiler)  Time elapsed: 0.001 sec  <<< FAILURE!
junit.framework.AssertionFailedError: expected:<1080511200000> but was:<1080252000000>
	at junit.framework.Assert.fail(Assert.java:47)
	at junit.framework.Assert.failNotEquals(Assert.java:280)
	at junit.framework.Assert.assertEquals(Assert.java:64)
	at junit.framework.Assert.assertEquals(Assert.java:133)
	at junit.framework.Assert.assertEquals(Assert.java:139)
	at org.joda.time.tz.TestCompiler.test_Amman_2004(TestCompiler.java:217)

test_Amman_2005(org.joda.time.tz.TestCompiler)  Time elapsed: 0 sec  <<< FAILURE!
junit.framework.AssertionFailedError: expected:<1111960800000> but was:<1112306400000>
	at junit.framework.Assert.fail(Assert.java:47)
	at junit.framework.Assert.failNotEquals(Assert.java:280)
	at junit.framework.Assert.assertEquals(Assert.java:64)
	at junit.framework.Assert.assertEquals(Assert.java:133)
	at junit.framework.Assert.assertEquals(Assert.java:139)
	at org.joda.time.tz.TestCompiler.test_Amman_2005(TestCompiler.java:224)

test_Amman_2006(org.joda.time.tz.TestCompiler)  Time elapsed: 0 sec  <<< FAILURE!
junit.framework.AssertionFailedError: expected:<1143410400000> but was:<1143756000000>
	at junit.framework.Assert.fail(Assert.java:47)
	at junit.framework.Assert.failNotEquals(Assert.java:280)
	at junit.framework.Assert.assertEquals(Assert.java:64)
	at junit.framework.Assert.assertEquals(Assert.java:133)
	at junit.framework.Assert.assertEquals(Assert.java:139)
	at org.joda.time.tz.TestCompiler.test_Amman_2006(TestCompiler.java:231)


Results :

Failed tests: 
  org.joda.time.TestDateMidnight_Basics#testCompareTo AssertionFailedError expec...
  org.joda.time.TestDateMidnight_Basics#testEqualsHashCode AssertionFailedError ...
  org.joda.time.TestDateMidnight_Basics#testGet_DateTimeField AssertionFailedError
  org.joda.time.TestDateMidnight_Basics#testGet_DateTimeFieldType AssertionFailedError
  org.joda.time.TestDateMidnight_Basics#testGetters AssertionFailedError expecte...
  org.joda.time.TestDateMidnight_Basics#testIsAfter AssertionFailedError expecte...
  org.joda.time.TestDateMidnight_Basics#testIsEqual AssertionFailedError expecte...
  org.joda.time.TestDateMidnight_Basics#testToDateTime AssertionFailedError expe...
  org.joda.time.TestDateMidnight_Basics#testToDateTime_Chronology AssertionFailedError
  org.joda.time.TestDateMidnight_Basics#testToDateTime_DateTimeZone AssertionFailedError
  org.joda.time.TestDateMidnight_Basics#testToInstant AssertionFailedError expec...
  org.joda.time.TestDateMidnight_Basics#testToString_String_String ComparisonFailure
  org.joda.time.TestDateMidnight_Basics#testWithChronology_Chronology AssertionFailedError
  org.joda.time.TestDateMidnight_Basics#testWithZoneRetainFields_DateTimeZone AssertionFailedError
  org.joda.time.TestDateMidnight_Constructors#testConstructor_Object AssertionFailedError
  org.joda.time.TestDateMidnight_Constructors#testConstructor_Object_Chronology AssertionFailedError
  org.joda.time.TestDateMidnight_Constructors#testConstructor_Object_DateTimeZone AssertionFailedError
  org.joda.time.TestDateMidnight_Constructors#testConstructor_Object_nullChronology AssertionFailedError
  org.joda.time.TestDateMidnight_Constructors#testConstructor_Object_nullDateTimeZone AssertionFailedError
  org.joda.time.TestDateMidnight_Constructors#testConstructor_long1 AssertionFailedError
  org.joda.time.TestDateMidnight_Constructors#testConstructor_long1_Chronology AssertionFailedError
  org.joda.time.TestDateMidnight_Constructors#testConstructor_long1_DateTimeZone AssertionFailedError
  org.joda.time.TestDateMidnight_Constructors#testConstructor_long_nullChronology AssertionFailedError
  org.joda.time.TestDateMidnight_Constructors#testConstructor_long_nullDateTimeZone AssertionFailedError
  org.joda.time.TestDateMidnight_Properties#testPropertyGetDayOfWeek AssertionFailedError
  org.joda.time.TestDateMidnight_Properties#testPropertyGetWeekOfWeekyear AssertionFailedError
  org.joda.time.TestDateTimeComparator#testListWOW AssertionFailedError ListWOW ...
  org.joda.time.TestDateTimeComparator#testWOW AssertionFailedError WOWM1a expec...
  org.joda.time.TestDateTimeZone#testIsLocalDateTimeGap_Berlin AssertionFailedError
  org.joda.time.TestDateTimeZoneCutover#testBug2182444_ausNSW AssertionFailedError
  org.joda.time.TestDateTimeZoneCutover#testBug2182444_usCentral AssertionFailedError
  org.joda.time.TestDateTimeZoneCutover#testBug3192457_adjustOffset AssertionFailedError
  org.joda.time.TestDateTimeZoneCutover#testBug3476684_adjustOffset AssertionFailedError
  org.joda.time.TestDateTimeZoneCutover#testDateTimeCreation_losAngeles ComparisonFailure
  org.joda.time.TestDateTimeZoneCutover#testDateTimeCreation_newYork ComparisonFailure
  org.joda.time.TestDateTimeZoneCutover#testWithMillisOfSecondInDstChange_NewYork_winter ComparisonFailure
  org.joda.time.TestDateTimeZoneCutover#test_DateTime_minusHour_Moscow_Autumn ComparisonFailure
  org.joda.time.TestDateTimeZoneCutover#test_DateTime_minusHour_NewYork_Autumn ComparisonFailure
  org.joda.time.TestDateTimeZoneCutover#test_DateTime_plusHour_Moscow_Autumn ComparisonFailure
  org.joda.time.TestDateTimeZoneCutover#test_DateTime_plusHour_NewYork_Autumn ComparisonFailure
  org.joda.time.TestDateTimeZoneCutover#test_DateTime_roundCeiling_day_NewYork_Autumn_postCutover ComparisonFailure
  org.joda.time.TestDateTimeZoneCutover#test_DateTime_roundCeiling_day_NewYork_Autumn_preCutover ComparisonFailure
  org.joda.time.TestDateTimeZoneCutover#test_DateTime_roundCeiling_hourOfDay_NewYork_Autumn_postCutover ComparisonFailure
  org.joda.time.TestDateTimeZoneCutover#test_DateTime_roundCeiling_hourOfDay_NewYork_Autumn_preCutover ComparisonFailure
  org.joda.time.TestDateTimeZoneCutover#test_DateTime_roundCeiling_minuteOfHour_NewYork_Autumn_postCutover ComparisonFailure
  org.joda.time.TestDateTimeZoneCutover#test_DateTime_roundCeiling_secondOfMinute_NewYork_Autumn_postCutover ComparisonFailure
  org.joda.time.TestDateTimeZoneCutover#test_DateTime_roundFloor_day_NewYork_Autumn_postCutover ComparisonFailure
  org.joda.time.TestDateTimeZoneCutover#test_DateTime_roundFloor_hourOfDay_NewYork_Autumn_postCutover ComparisonFailure
  org.joda.time.TestDateTimeZoneCutover#test_DateTime_roundFloor_minuteOfHour_NewYork_Autumn_postCutover ComparisonFailure
  org.joda.time.TestDateTimeZoneCutover#test_DateTime_roundFloor_secondOfMinute_NewYork_Autumn_postCutover ComparisonFailure
  org.joda.time.TestDateTimeZoneCutover#test_DateTime_setHourAcross_Moscow_Spring ComparisonFailure
  org.joda.time.TestDateTimeZoneCutover#test_DateTime_setHourBack_Moscow_Spring ComparisonFailure
  org.joda.time.TestDateTimeZoneCutover#test_DateTime_setHourForward_Moscow_Spring AssertionFailedError
  org.joda.time.TestDateTimeZoneCutover#test_MoscowIsCorrect_Autumn ComparisonFailure
  org.joda.time.TestDateTimeZoneCutover#test_MoscowIsCorrect_Spring ComparisonFailure
  org.joda.time.TestDateTimeZoneCutover#test_NewYorkIsCorrect_Autumn ComparisonFailure
  org.joda.time.TestDateTimeZoneCutover#test_getOffsetFromLocal_Moscow_Autumn AssertionFailedError
  org.joda.time.TestDateTimeZoneCutover#test_getOffsetFromLocal_Moscow_Spring ComparisonFailure
  org.joda.time.TestDateTimeZoneCutover#test_getOffsetFromLocal_NewYork_Autumn AssertionFailedError
  org.joda.time.TestDateTime_Basics#testGet_DateTimeField AssertionFailedError e...
  org.joda.time.TestDateTime_Basics#testGet_DateTimeFieldType AssertionFailedError
  org.joda.time.TestDateTime_Basics#testGetters AssertionFailedError expected:<7...
  org.joda.time.TestDateTime_Basics#testToString_String_Locale ComparisonFailure
  org.joda.time.TestDateTime_Basics#testWithDate_int_int_int_toDST1 AssertionFailedError
  org.joda.time.TestDateTime_Basics#testWithDate_int_int_int_toDST2 AssertionFailedError
  org.joda.time.TestDateTime_Basics#testWithTime_int_int_int_int_toDST AssertionFailedError
  org.joda.time.TestDateTime_Basics#testWithers AssertionFailedError expected:<1...
  org.joda.time.TestDateTime_Properties#testPropertyAddWrapFieldDayOfWeek ComparisonFailure
  org.joda.time.TestDateTime_Properties#testPropertyAddWrapFieldWeekOfWeekyear ComparisonFailure
  org.joda.time.TestDateTime_Properties#testPropertyGetDayOfWeek AssertionFailedError
  org.joda.time.TestDateTime_Properties#testPropertyGetMaxMinValuesWeekOfWeekyear AssertionFailedError
  org.joda.time.TestDateTime_Properties#testPropertyGetWeekOfWeekyear AssertionFailedError
  org.joda.time.TestDateTime_Properties#testPropertySetDayOfWeek ComparisonFailure
  org.joda.time.TestDateTime_Properties#testPropertySetTextDayOfWeek ComparisonFailure
  org.joda.time.TestDateTime_Properties#testPropertySetTextWeekOfWeekyear ComparisonFailure
  org.joda.time.TestDateTime_Properties#testPropertySetWeekOfWeekyear ComparisonFailure
  org.joda.time.TestDateTime_Properties#testPropertyWithMinimumValueMillisOfDayDSTGap ComparisonFailure
  org.joda.time.TestInstant_Basics#testGet_DateTimeField AssertionFailedError ex...
  org.joda.time.TestInstant_Basics#testGet_DateTimeFieldType AssertionFailedError
  org.joda.time.TestLocalDateTime_Basics#testGet_DateTimeFieldType AssertionFailedError
  org.joda.time.TestLocalDateTime_Basics#testGetters AssertionFailedError expect...
  org.joda.time.TestLocalDateTime_Basics#testToDateTime_Zone_dstGap AssertionFailedError
  org.joda.time.TestLocalDateTime_Basics#testToString_String_Locale ComparisonFailure
  org.joda.time.TestLocalDateTime_Basics#testWithers AssertionFailedError expect...
  org.joda.time.TestLocalDate_Basics#testToDateTime_LocalTime_Zone_dstGap AssertionFailedError
  org.joda.time.TestMutableDateTime_Basics#testGetMethods AssertionFailedError e...
  org.joda.time.TestMutableDateTime_Basics#testGet_DateTimeField AssertionFailedError
  org.joda.time.TestMutableDateTime_Basics#testGet_DateTimeFieldType AssertionFailedError
  org.joda.time.TestMutableDateTime_Basics#testToString_String_String ComparisonFailure
  org.joda.time.TestMutableDateTime_Properties#testPropertyAddWrapFieldWeekOfWeekyear ComparisonFailure
  org.joda.time.TestMutableDateTime_Properties#testPropertyGetDayOfWeek AssertionFailedError
  org.joda.time.TestMutableDateTime_Properties#testPropertyGetWeekOfWeekyear AssertionFailedError
  org.joda.time.TestMutableDateTime_Properties#testPropertySetDayOfWeek ComparisonFailure
  org.joda.time.TestMutableDateTime_Properties#testPropertySetTextDayOfWeek ComparisonFailure
  org.joda.time.TestMutableDateTime_Properties#testPropertySetTextWeekOfWeekyear ComparisonFailure
  org.joda.time.TestMutableDateTime_Properties#testPropertySetWeekOfWeekyear ComparisonFailure
  org.joda.time.TestPartial_Match#testIsMatch_Instant AssertionFailedError expec...
  org.joda.time.TestPartial_Match#testIsMatch_Partial AssertionFailedError expec...
  org.joda.time.chrono.TestCopticChronology#testCalendar AssertionFailedError ex...
  org.joda.time.chrono.TestCopticChronology#testSampleDate AssertionFailedError ...
  org.joda.time.chrono.TestEthiopicChronology#testCalendar AssertionFailedError ...
  org.joda.time.chrono.TestEthiopicChronology#testSampleDate AssertionFailedError
  org.joda.time.chrono.TestIslamicChronology#testCalendar AssertionFailedError e...
  org.joda.time.chrono.TestIslamicChronology#testSampleDate2 AssertionFailedError
  org.joda.time.chrono.TestIslamicChronology#testSampleDate3 AssertionFailedError
org.joda.time.chrono.gj.MainTest.testChronology(org.joda.time.chrono.gj.MainTest)
  Run 1: org.joda.time.chrono.gj.MainTest#testChronology AssertionFailedError
  Run 2: org.joda.time.chrono.gj.MainTest#testChronology AssertionFailedError

  org.joda.time.format.TestDateTimeFormat#testFormatParse_textAdjoiningMonthDOW_UK ComparisonFailure
  org.joda.time.format.TestDateTimeFormat#testFormat_dayOfWeek ComparisonFailure
  org.joda.time.format.TestDateTimeFormat#testFormat_dayOfWeekShortText ComparisonFailure
  org.joda.time.format.TestDateTimeFormat#testFormat_dayOfWeekText ComparisonFailure
  org.joda.time.format.TestDateTimeFormat#testFormat_weekOfWeekyear ComparisonFailure
  org.joda.time.format.TestDateTimeFormatter#testParseInto_simple_precedence AssertionFailedError
  org.joda.time.format.TestDateTimeFormatter#testParseLocalDate_year_month_week_2014 AssertionFailedError
  org.joda.time.format.TestDateTimeFormatter#testParseLocalDate_year_month_week_2015 AssertionFailedError
  org.joda.time.format.TestDateTimeFormatter#testPrint_appendableMethods ComparisonFailure
  org.joda.time.format.TestDateTimeFormatter#testPrint_bufferMethods ComparisonFailure
  org.joda.time.format.TestDateTimeFormatter#testPrint_chrono ComparisonFailure ...
  org.joda.time.format.TestDateTimeFormatter#testPrint_chrono_and_zone ComparisonFailure
  org.joda.time.format.TestDateTimeFormatter#testPrint_locale ComparisonFailure ...
  org.joda.time.format.TestDateTimeFormatter#testPrint_simple ComparisonFailure ...
  org.joda.time.format.TestDateTimeFormatter#testPrint_writerMethods ComparisonFailure
  org.joda.time.format.TestDateTimeFormatter#testPrint_zone ComparisonFailure ex...
  org.joda.time.format.TestISODateTimeFormat#testFormat_basicWeekDate ComparisonFailure
  org.joda.time.format.TestISODateTimeFormat#testFormat_basicWeekDateTime ComparisonFailure
  org.joda.time.format.TestISODateTimeFormat#testFormat_basicWeekDateTimeNoMillis ComparisonFailure
  org.joda.time.format.TestISODateTimeFormat#testFormat_weekDate ComparisonFailure
  org.joda.time.format.TestISODateTimeFormat#testFormat_weekDateTime ComparisonFailure
  org.joda.time.format.TestISODateTimeFormat#testFormat_weekDateTimeNoMillis ComparisonFailure
  org.joda.time.format.TestISODateTimeFormat#testFormat_weekyearWeek ComparisonFailure
  org.joda.time.format.TestISODateTimeFormat#testFormat_weekyearWeekDay ComparisonFailure
  org.joda.time.tz.TestBuilder#testForwardTransitions AssertionFailedError expec...
  org.joda.time.tz.TestBuilder#testReverseTransitions AssertionFailedError expec...
  org.joda.time.tz.TestBuilder#testSerialization AssertionFailedError expected:<...
  org.joda.time.tz.TestCompiler#testCompile AssertionFailedError expected:<99720...
  org.joda.time.tz.TestCompiler#test_Amman_2003 AssertionFailedError expected:<1...
  org.joda.time.tz.TestCompiler#test_Amman_2004 AssertionFailedError expected:<1...
  org.joda.time.tz.TestCompiler#test_Amman_2005 AssertionFailedError expected:<1...
  org.joda.time.tz.TestCompiler#test_Amman_2006 AssertionFailedError expected:<1...
Tests in error: 
  org.joda.time.TestMutableDateTime_Adds#testAddWeekyears_int1 IllegalFieldValueException
  org.joda.time.TestMutableDateTime_Sets#testSetDayOfWeek_int1 IllegalFieldValueException
  org.joda.time.TestMutableDateTime_Sets#testSetWeekyear_int1 IllegalFieldValueException
  org.joda.time.chrono.TestGJDate#test_plusWeekyears_positiveToNegative_crossCutover IllegalFieldValueException
  org.joda.time.chrono.TestGJDate#test_plusWeekyears_positiveToZero_crossCutover IllegalFieldValueException
  org.joda.time.convert.TestStringConverter#testGetInstantMillis_Object IllegalFieldValueException
  org.joda.time.format.TestDateTimeFormat#testFormat_weekyearOfEra_twoDigit IllegalFieldValueException
  org.joda.time.format.TestDateTimeFormatter#testParseLocalDate_weekyear_month_week_2010 IllegalFieldValueException

Tests run: 4156, Failures: 138, Errors: 8, Skipped: 0

[INFO] ------------------------------------------------------------------------
[INFO] BUILD FAILURE
[INFO] ------------------------------------------------------------------------
[INFO] Total time: 15.333s
[INFO] Finished at: Wed Aug 05 22:02:48 BST 2015
[INFO] Final Memory: 9M/214M
[INFO] ------------------------------------------------------------------------
[ERROR] Failed to execute goal org.apache.maven.plugins:maven-surefire-plugin:2.18.1:test (default-test) on project joda-time: There are test failures.
[ERROR] 
[ERROR] Please refer to /home/perham/Study/LittleDarwin/Cases/joda-time-2.8.1/target/surefire-reports for the individual test results.
[ERROR] -> [Help 1]
[ERROR] 
[ERROR] To see the full stack trace of the errors, re-run Maven with the -e switch.
[ERROR] Re-run Maven using the -X switch to enable full debug logging.
[ERROR] 
[ERROR] For more information about the errors and possible solutions, please read the following articles:
[ERROR] [Help 1] http://cwiki.apache.org/confluence/display/MAVEN/MojoFailureException
