[INFO] Scanning for projects...
[INFO]                                                                         
[INFO] ------------------------------------------------------------------------
[INFO] Building Joda-Time 2.8.1
[INFO] ------------------------------------------------------------------------
[INFO] 
[INFO] --- maven-resources-plugin:2.7:resources (default-resources) @ joda-time ---
[INFO] Using 'UTF-8' encoding to copy filtered resources.
[INFO] Copying 2 resources to META-INF
[INFO] Copying 10 resources
[INFO] 
[INFO] --- maven-compiler-plugin:3.3:compile (default-compile) @ joda-time ---
[INFO] Changes detected - recompiling the module!
[INFO] Compiling 166 source files to /home/perham/Study/LittleDarwin/Cases/joda-time-2.8.1/target/classes
[INFO] 
[INFO] --- exec-maven-plugin:1.4.0:java (compile-tzdb) @ joda-time ---
Writing zoneinfo files
Writing ZoneInfoMap
[INFO] 
[INFO] --- maven-resources-plugin:2.7:testResources (default-testResources) @ joda-time ---
[INFO] Using 'UTF-8' encoding to copy filtered resources.
[INFO] Copying 34 resources
[INFO] 
[INFO] --- maven-compiler-plugin:3.3:testCompile (default-testCompile) @ joda-time ---
[INFO] Nothing to compile - all classes are up to date
[INFO] 
[INFO] --- maven-surefire-plugin:2.18.1:test (default-test) @ joda-time ---
[INFO] Surefire report directory: /home/perham/Study/LittleDarwin/Cases/joda-time-2.8.1/target/surefire-reports

-------------------------------------------------------
 T E S T S
-------------------------------------------------------
Running org.joda.time.TestAllPackages

TestBuddhistChronology.testCalendar

TestCopticChronology.testCalendar

TestEthiopicChronology.testCalendar

TestIslamicChronology.testCalendar

Testing Gregorian chronology over 1000 iterations
100% complete (i=1000)

Testing Julian chronology over 1000 iterations
100% complete (i=1000)
Writing zoneinfo files
Writing ZoneInfoMap
Tests run: 4157, Failures: 0, Errors: 7, Skipped: 0, Time elapsed: 5.385 sec <<< FAILURE! - in org.joda.time.TestAllPackages
testSerializedLocalDateBuddhist(org.joda.time.TestSerialization)  Time elapsed: 0.004 sec  <<< ERROR!
java.io.InvalidClassException: org.joda.time.chrono.BaseChronology; local class incompatible: stream classdesc serialVersionUID = -7310865996721419676, local class serialVersionUID = 7310865996721419676
	at java.io.ObjectStreamClass.initNonProxy(ObjectStreamClass.java:617)
	at java.io.ObjectInputStream.readNonProxyDesc(ObjectInputStream.java:1622)
	at java.io.ObjectInputStream.readClassDesc(ObjectInputStream.java:1517)
	at java.io.ObjectInputStream.readNonProxyDesc(ObjectInputStream.java:1622)
	at java.io.ObjectInputStream.readClassDesc(ObjectInputStream.java:1517)
	at java.io.ObjectInputStream.readNonProxyDesc(ObjectInputStream.java:1622)
	at java.io.ObjectInputStream.readClassDesc(ObjectInputStream.java:1517)
	at java.io.ObjectInputStream.readOrdinaryObject(ObjectInputStream.java:1771)
	at java.io.ObjectInputStream.readObject0(ObjectInputStream.java:1350)
	at java.io.ObjectInputStream.defaultReadFields(ObjectInputStream.java:1997)
	at java.io.ObjectInputStream.readSerialData(ObjectInputStream.java:1921)
	at java.io.ObjectInputStream.readOrdinaryObject(ObjectInputStream.java:1798)
	at java.io.ObjectInputStream.readObject0(ObjectInputStream.java:1350)
	at java.io.ObjectInputStream.readObject(ObjectInputStream.java:370)
	at org.joda.time.TestSerialization.loadAndCompare(TestSerialization.java:295)
	at org.joda.time.TestSerialization.testSerializedLocalDateBuddhist(TestSerialization.java:180)

testSerializedCopticChronology(org.joda.time.TestSerialization)  Time elapsed: 0.002 sec  <<< ERROR!
java.io.InvalidClassException: org.joda.time.chrono.BaseChronology; local class incompatible: stream classdesc serialVersionUID = -7310865996721419676, local class serialVersionUID = 7310865996721419676
	at java.io.ObjectStreamClass.initNonProxy(ObjectStreamClass.java:617)
	at java.io.ObjectInputStream.readNonProxyDesc(ObjectInputStream.java:1622)
	at java.io.ObjectInputStream.readClassDesc(ObjectInputStream.java:1517)
	at java.io.ObjectInputStream.readNonProxyDesc(ObjectInputStream.java:1622)
	at java.io.ObjectInputStream.readClassDesc(ObjectInputStream.java:1517)
	at java.io.ObjectInputStream.readNonProxyDesc(ObjectInputStream.java:1622)
	at java.io.ObjectInputStream.readClassDesc(ObjectInputStream.java:1517)
	at java.io.ObjectInputStream.readNonProxyDesc(ObjectInputStream.java:1622)
	at java.io.ObjectInputStream.readClassDesc(ObjectInputStream.java:1517)
	at java.io.ObjectInputStream.readOrdinaryObject(ObjectInputStream.java:1771)
	at java.io.ObjectInputStream.readObject0(ObjectInputStream.java:1350)
	at java.io.ObjectInputStream.readObject(ObjectInputStream.java:370)
	at org.joda.time.TestSerialization.loadAndCompare(TestSerialization.java:295)
	at org.joda.time.TestSerialization.testSerializedCopticChronology(TestSerialization.java:232)

testSerializedGJChronology(org.joda.time.TestSerialization)  Time elapsed: 0.002 sec  <<< ERROR!
java.io.InvalidClassException: org.joda.time.chrono.BaseChronology; local class incompatible: stream classdesc serialVersionUID = -7310865996721419676, local class serialVersionUID = 7310865996721419676
	at java.io.ObjectStreamClass.initNonProxy(ObjectStreamClass.java:617)
	at java.io.ObjectInputStream.readNonProxyDesc(ObjectInputStream.java:1622)
	at java.io.ObjectInputStream.readClassDesc(ObjectInputStream.java:1517)
	at java.io.ObjectInputStream.readNonProxyDesc(ObjectInputStream.java:1622)
	at java.io.ObjectInputStream.readClassDesc(ObjectInputStream.java:1517)
	at java.io.ObjectInputStream.readNonProxyDesc(ObjectInputStream.java:1622)
	at java.io.ObjectInputStream.readClassDesc(ObjectInputStream.java:1517)
	at java.io.ObjectInputStream.readOrdinaryObject(ObjectInputStream.java:1771)
	at java.io.ObjectInputStream.readObject0(ObjectInputStream.java:1350)
	at java.io.ObjectInputStream.readObject(ObjectInputStream.java:370)
	at org.joda.time.TestSerialization.loadAndCompare(TestSerialization.java:295)
	at org.joda.time.TestSerialization.testSerializedGJChronology(TestSerialization.java:244)

testSerializedGJChronologyChangedInternals(org.joda.time.TestSerialization)  Time elapsed: 0.001 sec  <<< ERROR!
java.io.InvalidClassException: org.joda.time.chrono.BaseChronology; local class incompatible: stream classdesc serialVersionUID = -7310865996721419676, local class serialVersionUID = 7310865996721419676
	at java.io.ObjectStreamClass.initNonProxy(ObjectStreamClass.java:617)
	at java.io.ObjectInputStream.readNonProxyDesc(ObjectInputStream.java:1622)
	at java.io.ObjectInputStream.readClassDesc(ObjectInputStream.java:1517)
	at java.io.ObjectInputStream.readNonProxyDesc(ObjectInputStream.java:1622)
	at java.io.ObjectInputStream.readClassDesc(ObjectInputStream.java:1517)
	at java.io.ObjectInputStream.readNonProxyDesc(ObjectInputStream.java:1622)
	at java.io.ObjectInputStream.readClassDesc(ObjectInputStream.java:1517)
	at java.io.ObjectInputStream.readOrdinaryObject(ObjectInputStream.java:1771)
	at java.io.ObjectInputStream.readObject0(ObjectInputStream.java:1350)
	at java.io.ObjectInputStream.readObject(ObjectInputStream.java:370)
	at org.joda.time.TestSerialization.loadAndCompare(TestSerialization.java:295)
	at org.joda.time.TestSerialization.testSerializedGJChronologyChangedInternals(TestSerialization.java:250)

testSerializedGregorianChronology(org.joda.time.TestSerialization)  Time elapsed: 0.002 sec  <<< ERROR!
java.io.InvalidClassException: org.joda.time.chrono.BaseChronology; local class incompatible: stream classdesc serialVersionUID = -7310865996721419676, local class serialVersionUID = 7310865996721419676
	at java.io.ObjectStreamClass.initNonProxy(ObjectStreamClass.java:617)
	at java.io.ObjectInputStream.readNonProxyDesc(ObjectInputStream.java:1622)
	at java.io.ObjectInputStream.readClassDesc(ObjectInputStream.java:1517)
	at java.io.ObjectInputStream.readNonProxyDesc(ObjectInputStream.java:1622)
	at java.io.ObjectInputStream.readClassDesc(ObjectInputStream.java:1517)
	at java.io.ObjectInputStream.readNonProxyDesc(ObjectInputStream.java:1622)
	at java.io.ObjectInputStream.readClassDesc(ObjectInputStream.java:1517)
	at java.io.ObjectInputStream.readNonProxyDesc(ObjectInputStream.java:1622)
	at java.io.ObjectInputStream.readClassDesc(ObjectInputStream.java:1517)
	at java.io.ObjectInputStream.readOrdinaryObject(ObjectInputStream.java:1771)
	at java.io.ObjectInputStream.readObject0(ObjectInputStream.java:1350)
	at java.io.ObjectInputStream.readObject(ObjectInputStream.java:370)
	at org.joda.time.TestSerialization.loadAndCompare(TestSerialization.java:295)
	at org.joda.time.TestSerialization.testSerializedGregorianChronology(TestSerialization.java:256)

testSerializedJulianChronology(org.joda.time.TestSerialization)  Time elapsed: 0.001 sec  <<< ERROR!
java.io.InvalidClassException: org.joda.time.chrono.BaseChronology; local class incompatible: stream classdesc serialVersionUID = -7310865996721419676, local class serialVersionUID = 7310865996721419676
	at java.io.ObjectStreamClass.initNonProxy(ObjectStreamClass.java:617)
	at java.io.ObjectInputStream.readNonProxyDesc(ObjectInputStream.java:1622)
	at java.io.ObjectInputStream.readClassDesc(ObjectInputStream.java:1517)
	at java.io.ObjectInputStream.readNonProxyDesc(ObjectInputStream.java:1622)
	at java.io.ObjectInputStream.readClassDesc(ObjectInputStream.java:1517)
	at java.io.ObjectInputStream.readNonProxyDesc(ObjectInputStream.java:1622)
	at java.io.ObjectInputStream.readClassDesc(ObjectInputStream.java:1517)
	at java.io.ObjectInputStream.readNonProxyDesc(ObjectInputStream.java:1622)
	at java.io.ObjectInputStream.readClassDesc(ObjectInputStream.java:1517)
	at java.io.ObjectInputStream.readOrdinaryObject(ObjectInputStream.java:1771)
	at java.io.ObjectInputStream.readObject0(ObjectInputStream.java:1350)
	at java.io.ObjectInputStream.readObject(ObjectInputStream.java:370)
	at org.joda.time.TestSerialization.loadAndCompare(TestSerialization.java:295)
	at org.joda.time.TestSerialization.testSerializedJulianChronology(TestSerialization.java:262)

testSerializedBuddhistChronology(org.joda.time.TestSerialization)  Time elapsed: 0.001 sec  <<< ERROR!
java.io.InvalidClassException: org.joda.time.chrono.BaseChronology; local class incompatible: stream classdesc serialVersionUID = -7310865996721419676, local class serialVersionUID = 7310865996721419676
	at java.io.ObjectStreamClass.initNonProxy(ObjectStreamClass.java:617)
	at java.io.ObjectInputStream.readNonProxyDesc(ObjectInputStream.java:1622)
	at java.io.ObjectInputStream.readClassDesc(ObjectInputStream.java:1517)
	at java.io.ObjectInputStream.readNonProxyDesc(ObjectInputStream.java:1622)
	at java.io.ObjectInputStream.readClassDesc(ObjectInputStream.java:1517)
	at java.io.ObjectInputStream.readNonProxyDesc(ObjectInputStream.java:1622)
	at java.io.ObjectInputStream.readClassDesc(ObjectInputStream.java:1517)
	at java.io.ObjectInputStream.readOrdinaryObject(ObjectInputStream.java:1771)
	at java.io.ObjectInputStream.readObject0(ObjectInputStream.java:1350)
	at java.io.ObjectInputStream.readObject(ObjectInputStream.java:370)
	at org.joda.time.TestSerialization.loadAndCompare(TestSerialization.java:295)
	at org.joda.time.TestSerialization.testSerializedBuddhistChronology(TestSerialization.java:268)


Results :

Tests in error: 
  org.joda.time.TestSerialization#testSerializedBuddhistChronology InvalidClassException
  org.joda.time.TestSerialization#testSerializedCopticChronology InvalidClassException
  org.joda.time.TestSerialization#testSerializedGJChronology InvalidClassException
  org.joda.time.TestSerialization#testSerializedGJChronologyChangedInternals InvalidClassException
  org.joda.time.TestSerialization#testSerializedGregorianChronology InvalidClassException
  org.joda.time.TestSerialization#testSerializedJulianChronology InvalidClassException
  org.joda.time.TestSerialization#testSerializedLocalDateBuddhist InvalidClassException

Tests run: 4157, Failures: 0, Errors: 7, Skipped: 0

[INFO] ------------------------------------------------------------------------
[INFO] BUILD FAILURE
[INFO] ------------------------------------------------------------------------
[INFO] Total time: 16.036s
[INFO] Finished at: Wed Aug 05 21:48:56 BST 2015
[INFO] Final Memory: 10M/339M
[INFO] ------------------------------------------------------------------------
[ERROR] Failed to execute goal org.apache.maven.plugins:maven-surefire-plugin:2.18.1:test (default-test) on project joda-time: There are test failures.
[ERROR] 
[ERROR] Please refer to /home/perham/Study/LittleDarwin/Cases/joda-time-2.8.1/target/surefire-reports for the individual test results.
[ERROR] -> [Help 1]
[ERROR] 
[ERROR] To see the full stack trace of the errors, re-run Maven with the -e switch.
[ERROR] Re-run Maven using the -X switch to enable full debug logging.
[ERROR] 
[ERROR] For more information about the errors and possible solutions, please read the following articles:
[ERROR] [Help 1] http://cwiki.apache.org/confluence/display/MAVEN/MojoFailureException
