[INFO] Scanning for projects...
[INFO]                                                                         
[INFO] ------------------------------------------------------------------------
[INFO] Building Joda-Time 2.8.1
[INFO] ------------------------------------------------------------------------
[INFO] 
[INFO] --- maven-resources-plugin:2.7:resources (default-resources) @ joda-time ---
[INFO] Using 'UTF-8' encoding to copy filtered resources.
[INFO] Copying 2 resources to META-INF
[INFO] Copying 10 resources
[INFO] 
[INFO] --- maven-compiler-plugin:3.3:compile (default-compile) @ joda-time ---
[INFO] Changes detected - recompiling the module!
[INFO] Compiling 166 source files to /home/perham/Study/LittleDarwin/Cases/joda-time-2.8.1/target/classes
[INFO] 
[INFO] --- exec-maven-plugin:1.4.0:java (compile-tzdb) @ joda-time ---
Writing zoneinfo files
Writing ZoneInfoMap
[INFO] 
[INFO] --- maven-resources-plugin:2.7:testResources (default-testResources) @ joda-time ---
[INFO] Using 'UTF-8' encoding to copy filtered resources.
[INFO] Copying 34 resources
[INFO] 
[INFO] --- maven-compiler-plugin:3.3:testCompile (default-testCompile) @ joda-time ---
[INFO] Nothing to compile - all classes are up to date
[INFO] 
[INFO] --- maven-surefire-plugin:2.18.1:test (default-test) @ joda-time ---
[INFO] Surefire report directory: /home/perham/Study/LittleDarwin/Cases/joda-time-2.8.1/target/surefire-reports

-------------------------------------------------------
 T E S T S
-------------------------------------------------------
Running org.joda.time.TestAllPackages

TestBuddhistChronology.testCalendar

TestCopticChronology.testCalendar

TestEthiopicChronology.testCalendar

TestIslamicChronology.testCalendar

Testing Gregorian chronology over 1000 iterations
100% complete (i=1000)

Testing Julian chronology over 1000 iterations
100% complete (i=1000)
Writing zoneinfo files
Writing ZoneInfoMap
Tests run: 4157, Failures: 0, Errors: 247, Skipped: 0, Time elapsed: 5.115 sec <<< FAILURE! - in org.joda.time.TestAllPackages
testToYearMonthDay(org.joda.time.TestDateTime_Basics)  Time elapsed: 0.006 sec  <<< ERROR!
java.lang.ArrayIndexOutOfBoundsException: -1
	at org.joda.time.YearMonthDay.getFieldType(YearMonthDay.java:351)
	at org.joda.time.chrono.BaseChronology.get(BaseChronology.java:59)
	at org.joda.time.base.BasePartial.<init>(BasePartial.java:111)
	at org.joda.time.YearMonthDay.<init>(YearMonthDay.java:211)
	at org.joda.time.DateTime.toYearMonthDay(DateTime.java:1565)
	at org.joda.time.TestDateTime_Basics.testToYearMonthDay(TestDateTime_Basics.java:721)

testToTimeOfDay(org.joda.time.TestDateTime_Basics)  Time elapsed: 0.001 sec  <<< ERROR!
java.lang.ArrayIndexOutOfBoundsException: -1
	at org.joda.time.TimeOfDay.getFieldType(TimeOfDay.java:464)
	at org.joda.time.chrono.BaseChronology.get(BaseChronology.java:59)
	at org.joda.time.base.BasePartial.<init>(BasePartial.java:111)
	at org.joda.time.TimeOfDay.<init>(TimeOfDay.java:257)
	at org.joda.time.DateTime.toTimeOfDay(DateTime.java:1577)
	at org.joda.time.TestDateTime_Basics.testToTimeOfDay(TestDateTime_Basics.java:728)

testToYearMonthDay(org.joda.time.TestDateMidnight_Basics)  Time elapsed: 0.001 sec  <<< ERROR!
java.lang.ArrayIndexOutOfBoundsException: -1
	at org.joda.time.YearMonthDay.getFieldType(YearMonthDay.java:351)
	at org.joda.time.chrono.BaseChronology.get(BaseChronology.java:59)
	at org.joda.time.base.BasePartial.<init>(BasePartial.java:111)
	at org.joda.time.YearMonthDay.<init>(YearMonthDay.java:211)
	at org.joda.time.DateMidnight.toYearMonthDay(DateMidnight.java:871)
	at org.joda.time.TestDateMidnight_Basics.testToYearMonthDay(TestDateMidnight_Basics.java:643)

testConstructor_ObjectString1(org.joda.time.TestLocalDateTime_Constructors)  Time elapsed: 0.001 sec  <<< ERROR!
java.lang.IndexOutOfBoundsException: Invalid index: -1
	at org.joda.time.LocalDateTime.getField(LocalDateTime.java:562)
	at org.joda.time.base.AbstractPartial.getFieldType(AbstractPartial.java:79)
	at org.joda.time.chrono.BaseChronology.get(BaseChronology.java:59)
	at org.joda.time.convert.StringConverter.getPartialValues(StringConverter.java:88)
	at org.joda.time.LocalDateTime.<init>(LocalDateTime.java:414)
	at org.joda.time.LocalDateTime.<init>(LocalDateTime.java:358)
	at org.joda.time.TestLocalDateTime_Constructors.testConstructor_ObjectString1(TestLocalDateTime_Constructors.java:380)

testConstructor_ObjectString2(org.joda.time.TestLocalDateTime_Constructors)  Time elapsed: 0 sec  <<< ERROR!
java.lang.IndexOutOfBoundsException: Invalid index: -1
	at org.joda.time.LocalDateTime.getField(LocalDateTime.java:562)
	at org.joda.time.base.AbstractPartial.getFieldType(AbstractPartial.java:79)
	at org.joda.time.chrono.BaseChronology.get(BaseChronology.java:59)
	at org.joda.time.convert.StringConverter.getPartialValues(StringConverter.java:88)
	at org.joda.time.LocalDateTime.<init>(LocalDateTime.java:414)
	at org.joda.time.LocalDateTime.<init>(LocalDateTime.java:358)
	at org.joda.time.TestLocalDateTime_Constructors.testConstructor_ObjectString2(TestLocalDateTime_Constructors.java:392)

testConstructor_ObjectString3(org.joda.time.TestLocalDateTime_Constructors)  Time elapsed: 0.001 sec  <<< ERROR!
java.lang.IndexOutOfBoundsException: Invalid index: -1
	at org.joda.time.LocalDateTime.getField(LocalDateTime.java:562)
	at org.joda.time.base.AbstractPartial.getFieldType(AbstractPartial.java:79)
	at org.joda.time.chrono.BaseChronology.get(BaseChronology.java:59)
	at org.joda.time.convert.StringConverter.getPartialValues(StringConverter.java:88)
	at org.joda.time.LocalDateTime.<init>(LocalDateTime.java:414)
	at org.joda.time.LocalDateTime.<init>(LocalDateTime.java:358)
	at org.joda.time.TestLocalDateTime_Constructors.testConstructor_ObjectString3(TestLocalDateTime_Constructors.java:404)

testConstructor_ObjectString4(org.joda.time.TestLocalDateTime_Constructors)  Time elapsed: 0 sec  <<< ERROR!
java.lang.IndexOutOfBoundsException: Invalid index: -1
	at org.joda.time.LocalDateTime.getField(LocalDateTime.java:562)
	at org.joda.time.base.AbstractPartial.getFieldType(AbstractPartial.java:79)
	at org.joda.time.chrono.BaseChronology.get(BaseChronology.java:59)
	at org.joda.time.convert.StringConverter.getPartialValues(StringConverter.java:88)
	at org.joda.time.LocalDateTime.<init>(LocalDateTime.java:414)
	at org.joda.time.LocalDateTime.<init>(LocalDateTime.java:358)
	at org.joda.time.TestLocalDateTime_Constructors.testConstructor_ObjectString4(TestLocalDateTime_Constructors.java:416)

testConstructor_Object_DateTimeZone(org.joda.time.TestLocalDateTime_Constructors)  Time elapsed: 0 sec  <<< ERROR!
java.lang.IndexOutOfBoundsException: Invalid index: -1
	at org.joda.time.LocalDateTime.getField(LocalDateTime.java:562)
	at org.joda.time.base.AbstractPartial.getFieldType(AbstractPartial.java:79)
	at org.joda.time.chrono.BaseChronology.get(BaseChronology.java:59)
	at org.joda.time.convert.AbstractConverter.getPartialValues(AbstractConverter.java:102)
	at org.joda.time.convert.AbstractConverter.getPartialValues(AbstractConverter.java:123)
	at org.joda.time.LocalDateTime.<init>(LocalDateTime.java:384)
	at org.joda.time.TestLocalDateTime_Constructors.testConstructor_Object_DateTimeZone(TestLocalDateTime_Constructors.java:501)

testConstructor_nullObject_DateTimeZone(org.joda.time.TestLocalDateTime_Constructors)  Time elapsed: 0.001 sec  <<< ERROR!
java.lang.IndexOutOfBoundsException: Invalid index: -1
	at org.joda.time.LocalDateTime.getField(LocalDateTime.java:562)
	at org.joda.time.base.AbstractPartial.getFieldType(AbstractPartial.java:79)
	at org.joda.time.chrono.BaseChronology.get(BaseChronology.java:59)
	at org.joda.time.convert.AbstractConverter.getPartialValues(AbstractConverter.java:102)
	at org.joda.time.convert.AbstractConverter.getPartialValues(AbstractConverter.java:123)
	at org.joda.time.LocalDateTime.<init>(LocalDateTime.java:384)
	at org.joda.time.TestLocalDateTime_Constructors.testConstructor_nullObject_DateTimeZone(TestLocalDateTime_Constructors.java:541)

testConstructor_Object_nullDateTimeZone(org.joda.time.TestLocalDateTime_Constructors)  Time elapsed: 0 sec  <<< ERROR!
java.lang.IndexOutOfBoundsException: Invalid index: -1
	at org.joda.time.LocalDateTime.getField(LocalDateTime.java:562)
	at org.joda.time.base.AbstractPartial.getFieldType(AbstractPartial.java:79)
	at org.joda.time.chrono.BaseChronology.get(BaseChronology.java:59)
	at org.joda.time.convert.AbstractConverter.getPartialValues(AbstractConverter.java:102)
	at org.joda.time.convert.AbstractConverter.getPartialValues(AbstractConverter.java:123)
	at org.joda.time.LocalDateTime.<init>(LocalDateTime.java:384)
	at org.joda.time.TestLocalDateTime_Constructors.testConstructor_Object_nullDateTimeZone(TestLocalDateTime_Constructors.java:554)

testConstructor_nullObject_nullDateTimeZone(org.joda.time.TestLocalDateTime_Constructors)  Time elapsed: 0.001 sec  <<< ERROR!
java.lang.IndexOutOfBoundsException: Invalid index: -1
	at org.joda.time.LocalDateTime.getField(LocalDateTime.java:562)
	at org.joda.time.base.AbstractPartial.getFieldType(AbstractPartial.java:79)
	at org.joda.time.chrono.BaseChronology.get(BaseChronology.java:59)
	at org.joda.time.convert.AbstractConverter.getPartialValues(AbstractConverter.java:102)
	at org.joda.time.convert.AbstractConverter.getPartialValues(AbstractConverter.java:123)
	at org.joda.time.LocalDateTime.<init>(LocalDateTime.java:384)
	at org.joda.time.TestLocalDateTime_Constructors.testConstructor_nullObject_nullDateTimeZone(TestLocalDateTime_Constructors.java:566)

testConstructor_Object_Chronology(org.joda.time.TestLocalDateTime_Constructors)  Time elapsed: 0.001 sec  <<< ERROR!
java.lang.IndexOutOfBoundsException: Invalid index: -1
	at org.joda.time.LocalDateTime.getField(LocalDateTime.java:562)
	at org.joda.time.base.AbstractPartial.getFieldType(AbstractPartial.java:79)
	at org.joda.time.chrono.BaseChronology.get(BaseChronology.java:59)
	at org.joda.time.convert.AbstractConverter.getPartialValues(AbstractConverter.java:102)
	at org.joda.time.convert.AbstractConverter.getPartialValues(AbstractConverter.java:123)
	at org.joda.time.LocalDateTime.<init>(LocalDateTime.java:414)
	at org.joda.time.TestLocalDateTime_Constructors.testConstructor_Object_Chronology(TestLocalDateTime_Constructors.java:580)

testConstructor_nullObject_Chronology(org.joda.time.TestLocalDateTime_Constructors)  Time elapsed: 0.001 sec  <<< ERROR!
java.lang.IndexOutOfBoundsException: Invalid index: -1
	at org.joda.time.LocalDateTime.getField(LocalDateTime.java:562)
	at org.joda.time.base.AbstractPartial.getFieldType(AbstractPartial.java:79)
	at org.joda.time.chrono.BaseChronology.get(BaseChronology.java:59)
	at org.joda.time.convert.AbstractConverter.getPartialValues(AbstractConverter.java:102)
	at org.joda.time.convert.AbstractConverter.getPartialValues(AbstractConverter.java:123)
	at org.joda.time.LocalDateTime.<init>(LocalDateTime.java:414)
	at org.joda.time.TestLocalDateTime_Constructors.testConstructor_nullObject_Chronology(TestLocalDateTime_Constructors.java:633)

testConstructor_Object_nullChronology(org.joda.time.TestLocalDateTime_Constructors)  Time elapsed: 0.001 sec  <<< ERROR!
java.lang.IndexOutOfBoundsException: Invalid index: -1
	at org.joda.time.LocalDateTime.getField(LocalDateTime.java:562)
	at org.joda.time.base.AbstractPartial.getFieldType(AbstractPartial.java:79)
	at org.joda.time.chrono.BaseChronology.get(BaseChronology.java:59)
	at org.joda.time.convert.AbstractConverter.getPartialValues(AbstractConverter.java:102)
	at org.joda.time.convert.AbstractConverter.getPartialValues(AbstractConverter.java:123)
	at org.joda.time.LocalDateTime.<init>(LocalDateTime.java:414)
	at org.joda.time.TestLocalDateTime_Constructors.testConstructor_Object_nullChronology(TestLocalDateTime_Constructors.java:646)

testConstructor_nullObject_nullChronology(org.joda.time.TestLocalDateTime_Constructors)  Time elapsed: 0 sec  <<< ERROR!
java.lang.IndexOutOfBoundsException: Invalid index: -1
	at org.joda.time.LocalDateTime.getField(LocalDateTime.java:562)
	at org.joda.time.base.AbstractPartial.getFieldType(AbstractPartial.java:79)
	at org.joda.time.chrono.BaseChronology.get(BaseChronology.java:59)
	at org.joda.time.convert.AbstractConverter.getPartialValues(AbstractConverter.java:102)
	at org.joda.time.convert.AbstractConverter.getPartialValues(AbstractConverter.java:123)
	at org.joda.time.LocalDateTime.<init>(LocalDateTime.java:414)
	at org.joda.time.TestLocalDateTime_Constructors.testConstructor_nullObject_nullChronology(TestLocalDateTime_Constructors.java:658)

testConstructor_nullObject(org.joda.time.TestLocalDateTime_Constructors)  Time elapsed: 0.001 sec  <<< ERROR!
java.lang.IndexOutOfBoundsException: Invalid index: -1
	at org.joda.time.LocalDateTime.getField(LocalDateTime.java:562)
	at org.joda.time.base.AbstractPartial.getFieldType(AbstractPartial.java:79)
	at org.joda.time.chrono.BaseChronology.get(BaseChronology.java:59)
	at org.joda.time.convert.AbstractConverter.getPartialValues(AbstractConverter.java:102)
	at org.joda.time.convert.AbstractConverter.getPartialValues(AbstractConverter.java:123)
	at org.joda.time.LocalDateTime.<init>(LocalDateTime.java:414)
	at org.joda.time.LocalDateTime.<init>(LocalDateTime.java:358)
	at org.joda.time.TestLocalDateTime_Constructors.testConstructor_nullObject(TestLocalDateTime_Constructors.java:368)

testConstructor_Object_DateTimeZoneMoscow(org.joda.time.TestLocalDateTime_Constructors)  Time elapsed: 0.001 sec  <<< ERROR!
java.lang.IndexOutOfBoundsException: Invalid index: -1
	at org.joda.time.LocalDateTime.getField(LocalDateTime.java:562)
	at org.joda.time.base.AbstractPartial.getFieldType(AbstractPartial.java:79)
	at org.joda.time.chrono.BaseChronology.get(BaseChronology.java:59)
	at org.joda.time.convert.StringConverter.getPartialValues(StringConverter.java:88)
	at org.joda.time.LocalDateTime.<init>(LocalDateTime.java:384)
	at org.joda.time.TestLocalDateTime_Constructors.testConstructor_Object_DateTimeZoneMoscow(TestLocalDateTime_Constructors.java:513)

testConstructor_Object_DateTimeZoneMoscowBadDateTime(org.joda.time.TestLocalDateTime_Constructors)  Time elapsed: 0 sec  <<< ERROR!
java.lang.IndexOutOfBoundsException: Invalid index: -1
	at org.joda.time.LocalDateTime.getField(LocalDateTime.java:562)
	at org.joda.time.base.AbstractPartial.getFieldType(AbstractPartial.java:79)
	at org.joda.time.chrono.BaseChronology.get(BaseChronology.java:59)
	at org.joda.time.convert.StringConverter.getPartialValues(StringConverter.java:88)
	at org.joda.time.LocalDateTime.<init>(LocalDateTime.java:384)
	at org.joda.time.TestLocalDateTime_Constructors.testConstructor_Object_DateTimeZoneMoscowBadDateTime(TestLocalDateTime_Constructors.java:529)

testConstructor_Object_ChronologyMoscow(org.joda.time.TestLocalDateTime_Constructors)  Time elapsed: 0.001 sec  <<< ERROR!
java.lang.IndexOutOfBoundsException: Invalid index: -1
	at org.joda.time.LocalDateTime.getField(LocalDateTime.java:562)
	at org.joda.time.base.AbstractPartial.getFieldType(AbstractPartial.java:79)
	at org.joda.time.chrono.BaseChronology.get(BaseChronology.java:59)
	at org.joda.time.convert.StringConverter.getPartialValues(StringConverter.java:88)
	at org.joda.time.LocalDateTime.<init>(LocalDateTime.java:414)
	at org.joda.time.TestLocalDateTime_Constructors.testConstructor_Object_ChronologyMoscow(TestLocalDateTime_Constructors.java:605)

testConstructor_Object_ChronologyMoscowBadDateTime(org.joda.time.TestLocalDateTime_Constructors)  Time elapsed: 0 sec  <<< ERROR!
java.lang.IndexOutOfBoundsException: Invalid index: -1
	at org.joda.time.LocalDateTime.getField(LocalDateTime.java:562)
	at org.joda.time.base.AbstractPartial.getFieldType(AbstractPartial.java:79)
	at org.joda.time.chrono.BaseChronology.get(BaseChronology.java:59)
	at org.joda.time.convert.StringConverter.getPartialValues(StringConverter.java:88)
	at org.joda.time.LocalDateTime.<init>(LocalDateTime.java:414)
	at org.joda.time.TestLocalDateTime_Constructors.testConstructor_Object_ChronologyMoscowBadDateTime(TestLocalDateTime_Constructors.java:621)

testConstructor_Object1(org.joda.time.TestLocalDateTime_Constructors)  Time elapsed: 0 sec  <<< ERROR!
java.lang.IndexOutOfBoundsException: Invalid index: -1
	at org.joda.time.LocalDateTime.getField(LocalDateTime.java:562)
	at org.joda.time.base.AbstractPartial.getFieldType(AbstractPartial.java:79)
	at org.joda.time.chrono.BaseChronology.get(BaseChronology.java:59)
	at org.joda.time.convert.AbstractConverter.getPartialValues(AbstractConverter.java:102)
	at org.joda.time.convert.AbstractConverter.getPartialValues(AbstractConverter.java:123)
	at org.joda.time.LocalDateTime.<init>(LocalDateTime.java:414)
	at org.joda.time.LocalDateTime.<init>(LocalDateTime.java:358)
	at org.joda.time.TestLocalDateTime_Constructors.testConstructor_Object1(TestLocalDateTime_Constructors.java:356)

testCompareTo(org.joda.time.TestLocalDateTime_Basics)  Time elapsed: 0.001 sec  <<< ERROR!
java.lang.ArrayIndexOutOfBoundsException: -1
	at org.joda.time.YearMonthDay.getFieldType(YearMonthDay.java:351)
	at org.joda.time.chrono.BaseChronology.get(BaseChronology.java:59)
	at org.joda.time.base.BasePartial.<init>(BasePartial.java:111)
	at org.joda.time.base.BasePartial.<init>(BasePartial.java:65)
	at org.joda.time.YearMonthDay.<init>(YearMonthDay.java:153)
	at org.joda.time.TestLocalDateTime_Basics.testCompareTo(TestLocalDateTime_Basics.java:367)

testConstructor_ObjectString1(org.joda.time.TestLocalDate_Constructors)  Time elapsed: 0.001 sec  <<< ERROR!
java.lang.IndexOutOfBoundsException: Invalid index: -1
	at org.joda.time.LocalDate.getField(LocalDate.java:507)
	at org.joda.time.base.AbstractPartial.getFieldType(AbstractPartial.java:79)
	at org.joda.time.chrono.BaseChronology.get(BaseChronology.java:59)
	at org.joda.time.convert.StringConverter.getPartialValues(StringConverter.java:88)
	at org.joda.time.LocalDate.<init>(LocalDate.java:419)
	at org.joda.time.LocalDate.<init>(LocalDate.java:363)
	at org.joda.time.TestLocalDate_Constructors.testConstructor_ObjectString1(TestLocalDate_Constructors.java:333)

testConstructor_ObjectString2(org.joda.time.TestLocalDate_Constructors)  Time elapsed: 0 sec  <<< ERROR!
java.lang.IndexOutOfBoundsException: Invalid index: -1
	at org.joda.time.LocalDate.getField(LocalDate.java:507)
	at org.joda.time.base.AbstractPartial.getFieldType(AbstractPartial.java:79)
	at org.joda.time.chrono.BaseChronology.get(BaseChronology.java:59)
	at org.joda.time.convert.StringConverter.getPartialValues(StringConverter.java:88)
	at org.joda.time.LocalDate.<init>(LocalDate.java:419)
	at org.joda.time.LocalDate.<init>(LocalDate.java:363)
	at org.joda.time.TestLocalDate_Constructors.testConstructor_ObjectString2(TestLocalDate_Constructors.java:341)

testConstructor_ObjectString3(org.joda.time.TestLocalDate_Constructors)  Time elapsed: 0.001 sec  <<< ERROR!
java.lang.IndexOutOfBoundsException: Invalid index: -1
	at org.joda.time.LocalDate.getField(LocalDate.java:507)
	at org.joda.time.base.AbstractPartial.getFieldType(AbstractPartial.java:79)
	at org.joda.time.chrono.BaseChronology.get(BaseChronology.java:59)
	at org.joda.time.convert.StringConverter.getPartialValues(StringConverter.java:88)
	at org.joda.time.LocalDate.<init>(LocalDate.java:419)
	at org.joda.time.LocalDate.<init>(LocalDate.java:363)
	at org.joda.time.TestLocalDate_Constructors.testConstructor_ObjectString3(TestLocalDate_Constructors.java:349)

testConstructor_Object_DateTimeZone(org.joda.time.TestLocalDate_Constructors)  Time elapsed: 0.001 sec  <<< ERROR!
java.lang.IndexOutOfBoundsException: Invalid index: -1
	at org.joda.time.LocalDate.getField(LocalDate.java:507)
	at org.joda.time.base.AbstractPartial.getFieldType(AbstractPartial.java:79)
	at org.joda.time.chrono.BaseChronology.get(BaseChronology.java:59)
	at org.joda.time.convert.AbstractConverter.getPartialValues(AbstractConverter.java:102)
	at org.joda.time.convert.AbstractConverter.getPartialValues(AbstractConverter.java:123)
	at org.joda.time.LocalDate.<init>(LocalDate.java:389)
	at org.joda.time.TestLocalDate_Constructors.testConstructor_Object_DateTimeZone(TestLocalDate_Constructors.java:444)

testConstructor_nullObject_DateTimeZone(org.joda.time.TestLocalDate_Constructors)  Time elapsed: 0 sec  <<< ERROR!
java.lang.IndexOutOfBoundsException: Invalid index: -1
	at org.joda.time.LocalDate.getField(LocalDate.java:507)
	at org.joda.time.base.AbstractPartial.getFieldType(AbstractPartial.java:79)
	at org.joda.time.chrono.BaseChronology.get(BaseChronology.java:59)
	at org.joda.time.convert.AbstractConverter.getPartialValues(AbstractConverter.java:102)
	at org.joda.time.convert.AbstractConverter.getPartialValues(AbstractConverter.java:123)
	at org.joda.time.LocalDate.<init>(LocalDate.java:389)
	at org.joda.time.TestLocalDate_Constructors.testConstructor_nullObject_DateTimeZone(TestLocalDate_Constructors.java:452)

testConstructor_Object_nullDateTimeZone(org.joda.time.TestLocalDate_Constructors)  Time elapsed: 0 sec  <<< ERROR!
java.lang.IndexOutOfBoundsException: Invalid index: -1
	at org.joda.time.LocalDate.getField(LocalDate.java:507)
	at org.joda.time.base.AbstractPartial.getFieldType(AbstractPartial.java:79)
	at org.joda.time.chrono.BaseChronology.get(BaseChronology.java:59)
	at org.joda.time.convert.AbstractConverter.getPartialValues(AbstractConverter.java:102)
	at org.joda.time.convert.AbstractConverter.getPartialValues(AbstractConverter.java:123)
	at org.joda.time.LocalDate.<init>(LocalDate.java:389)
	at org.joda.time.TestLocalDate_Constructors.testConstructor_Object_nullDateTimeZone(TestLocalDate_Constructors.java:461)

testConstructor_nullObject_nullDateTimeZone(org.joda.time.TestLocalDate_Constructors)  Time elapsed: 0 sec  <<< ERROR!
java.lang.IndexOutOfBoundsException: Invalid index: -1
	at org.joda.time.LocalDate.getField(LocalDate.java:507)
	at org.joda.time.base.AbstractPartial.getFieldType(AbstractPartial.java:79)
	at org.joda.time.chrono.BaseChronology.get(BaseChronology.java:59)
	at org.joda.time.convert.AbstractConverter.getPartialValues(AbstractConverter.java:102)
	at org.joda.time.convert.AbstractConverter.getPartialValues(AbstractConverter.java:123)
	at org.joda.time.LocalDate.<init>(LocalDate.java:389)
	at org.joda.time.TestLocalDate_Constructors.testConstructor_nullObject_nullDateTimeZone(TestLocalDate_Constructors.java:469)

testConstructor_Object_Chronology(org.joda.time.TestLocalDate_Constructors)  Time elapsed: 0 sec  <<< ERROR!
java.lang.IndexOutOfBoundsException: Invalid index: -1
	at org.joda.time.LocalDate.getField(LocalDate.java:507)
	at org.joda.time.base.AbstractPartial.getFieldType(AbstractPartial.java:79)
	at org.joda.time.chrono.BaseChronology.get(BaseChronology.java:59)
	at org.joda.time.convert.AbstractConverter.getPartialValues(AbstractConverter.java:102)
	at org.joda.time.convert.AbstractConverter.getPartialValues(AbstractConverter.java:123)
	at org.joda.time.LocalDate.<init>(LocalDate.java:419)
	at org.joda.time.TestLocalDate_Constructors.testConstructor_Object_Chronology(TestLocalDate_Constructors.java:478)

testConstructor_nullObject_Chronology(org.joda.time.TestLocalDate_Constructors)  Time elapsed: 0.001 sec  <<< ERROR!
java.lang.IndexOutOfBoundsException: Invalid index: -1
	at org.joda.time.LocalDate.getField(LocalDate.java:507)
	at org.joda.time.base.AbstractPartial.getFieldType(AbstractPartial.java:79)
	at org.joda.time.chrono.BaseChronology.get(BaseChronology.java:59)
	at org.joda.time.convert.AbstractConverter.getPartialValues(AbstractConverter.java:102)
	at org.joda.time.convert.AbstractConverter.getPartialValues(AbstractConverter.java:123)
	at org.joda.time.LocalDate.<init>(LocalDate.java:419)
	at org.joda.time.TestLocalDate_Constructors.testConstructor_nullObject_Chronology(TestLocalDate_Constructors.java:495)

testConstructor_Object_nullChronology(org.joda.time.TestLocalDate_Constructors)  Time elapsed: 0 sec  <<< ERROR!
java.lang.IndexOutOfBoundsException: Invalid index: -1
	at org.joda.time.LocalDate.getField(LocalDate.java:507)
	at org.joda.time.base.AbstractPartial.getFieldType(AbstractPartial.java:79)
	at org.joda.time.chrono.BaseChronology.get(BaseChronology.java:59)
	at org.joda.time.convert.AbstractConverter.getPartialValues(AbstractConverter.java:102)
	at org.joda.time.convert.AbstractConverter.getPartialValues(AbstractConverter.java:123)
	at org.joda.time.LocalDate.<init>(LocalDate.java:419)
	at org.joda.time.TestLocalDate_Constructors.testConstructor_Object_nullChronology(TestLocalDate_Constructors.java:504)

testConstructor_nullObject_nullChronology(org.joda.time.TestLocalDate_Constructors)  Time elapsed: 0.001 sec  <<< ERROR!
java.lang.IndexOutOfBoundsException: Invalid index: -1
	at org.joda.time.LocalDate.getField(LocalDate.java:507)
	at org.joda.time.base.AbstractPartial.getFieldType(AbstractPartial.java:79)
	at org.joda.time.chrono.BaseChronology.get(BaseChronology.java:59)
	at org.joda.time.convert.AbstractConverter.getPartialValues(AbstractConverter.java:102)
	at org.joda.time.convert.AbstractConverter.getPartialValues(AbstractConverter.java:123)
	at org.joda.time.LocalDate.<init>(LocalDate.java:419)
	at org.joda.time.TestLocalDate_Constructors.testConstructor_nullObject_nullChronology(TestLocalDate_Constructors.java:512)

testConstructor_nullObject(org.joda.time.TestLocalDate_Constructors)  Time elapsed: 0.001 sec  <<< ERROR!
java.lang.IndexOutOfBoundsException: Invalid index: -1
	at org.joda.time.LocalDate.getField(LocalDate.java:507)
	at org.joda.time.base.AbstractPartial.getFieldType(AbstractPartial.java:79)
	at org.joda.time.chrono.BaseChronology.get(BaseChronology.java:59)
	at org.joda.time.convert.AbstractConverter.getPartialValues(AbstractConverter.java:102)
	at org.joda.time.convert.AbstractConverter.getPartialValues(AbstractConverter.java:123)
	at org.joda.time.LocalDate.<init>(LocalDate.java:419)
	at org.joda.time.LocalDate.<init>(LocalDate.java:363)
	at org.joda.time.TestLocalDate_Constructors.testConstructor_nullObject(TestLocalDate_Constructors.java:325)

testConstructor_Object1(org.joda.time.TestLocalDate_Constructors)  Time elapsed: 0 sec  <<< ERROR!
java.lang.IndexOutOfBoundsException: Invalid index: -1
	at org.joda.time.LocalDate.getField(LocalDate.java:507)
	at org.joda.time.base.AbstractPartial.getFieldType(AbstractPartial.java:79)
	at org.joda.time.chrono.BaseChronology.get(BaseChronology.java:59)
	at org.joda.time.convert.AbstractConverter.getPartialValues(AbstractConverter.java:102)
	at org.joda.time.convert.AbstractConverter.getPartialValues(AbstractConverter.java:123)
	at org.joda.time.LocalDate.<init>(LocalDate.java:419)
	at org.joda.time.LocalDate.<init>(LocalDate.java:363)
	at org.joda.time.TestLocalDate_Constructors.testConstructor_Object1(TestLocalDate_Constructors.java:317)

testCompareTo(org.joda.time.TestLocalDate_Basics)  Time elapsed: 0.001 sec  <<< ERROR!
java.lang.ArrayIndexOutOfBoundsException: -1
	at org.joda.time.TimeOfDay.getFieldType(TimeOfDay.java:464)
	at org.joda.time.chrono.BaseChronology.get(BaseChronology.java:59)
	at org.joda.time.base.BasePartial.<init>(BasePartial.java:111)
	at org.joda.time.base.BasePartial.<init>(BasePartial.java:65)
	at org.joda.time.TimeOfDay.<init>(TimeOfDay.java:199)
	at org.joda.time.TestLocalDate_Basics.testCompareTo(TestLocalDate_Basics.java:360)

testConstructor_ObjectString1(org.joda.time.TestLocalTime_Constructors)  Time elapsed: 0.001 sec  <<< ERROR!
java.lang.IndexOutOfBoundsException: Invalid index: -1
	at org.joda.time.LocalTime.getField(LocalTime.java:558)
	at org.joda.time.base.AbstractPartial.getFieldType(AbstractPartial.java:79)
	at org.joda.time.chrono.BaseChronology.get(BaseChronology.java:59)
	at org.joda.time.convert.StringConverter.getPartialValues(StringConverter.java:88)
	at org.joda.time.LocalTime.<init>(LocalTime.java:435)
	at org.joda.time.LocalTime.<init>(LocalTime.java:383)
	at org.joda.time.TestLocalTime_Constructors.testConstructor_ObjectString1(TestLocalTime_Constructors.java:363)

testConstructor_ObjectString2(org.joda.time.TestLocalTime_Constructors)  Time elapsed: 0 sec  <<< ERROR!
java.lang.IndexOutOfBoundsException: Invalid index: -1
	at org.joda.time.LocalTime.getField(LocalTime.java:558)
	at org.joda.time.base.AbstractPartial.getFieldType(AbstractPartial.java:79)
	at org.joda.time.chrono.BaseChronology.get(BaseChronology.java:59)
	at org.joda.time.convert.StringConverter.getPartialValues(StringConverter.java:88)
	at org.joda.time.LocalTime.<init>(LocalTime.java:435)
	at org.joda.time.LocalTime.<init>(LocalTime.java:383)
	at org.joda.time.TestLocalTime_Constructors.testConstructor_ObjectString2(TestLocalTime_Constructors.java:392)

testConstructor_ObjectString3(org.joda.time.TestLocalTime_Constructors)  Time elapsed: 0.001 sec  <<< ERROR!
java.lang.IndexOutOfBoundsException: Invalid index: -1
	at org.joda.time.LocalTime.getField(LocalTime.java:558)
	at org.joda.time.base.AbstractPartial.getFieldType(AbstractPartial.java:79)
	at org.joda.time.chrono.BaseChronology.get(BaseChronology.java:59)
	at org.joda.time.convert.StringConverter.getPartialValues(StringConverter.java:88)
	at org.joda.time.LocalTime.<init>(LocalTime.java:435)
	at org.joda.time.LocalTime.<init>(LocalTime.java:383)
	at org.joda.time.TestLocalTime_Constructors.testConstructor_ObjectString3(TestLocalTime_Constructors.java:401)

testConstructor_ObjectString4(org.joda.time.TestLocalTime_Constructors)  Time elapsed: 0 sec  <<< ERROR!
java.lang.IndexOutOfBoundsException: Invalid index: -1
	at org.joda.time.LocalTime.getField(LocalTime.java:558)
	at org.joda.time.base.AbstractPartial.getFieldType(AbstractPartial.java:79)
	at org.joda.time.chrono.BaseChronology.get(BaseChronology.java:59)
	at org.joda.time.convert.StringConverter.getPartialValues(StringConverter.java:88)
	at org.joda.time.LocalTime.<init>(LocalTime.java:435)
	at org.joda.time.LocalTime.<init>(LocalTime.java:383)
	at org.joda.time.TestLocalTime_Constructors.testConstructor_ObjectString4(TestLocalTime_Constructors.java:410)

testConstructor_nullObject_DateTimeZone(org.joda.time.TestLocalTime_Constructors)  Time elapsed: 0 sec  <<< ERROR!
java.lang.IndexOutOfBoundsException: Invalid index: -1
	at org.joda.time.LocalTime.getField(LocalTime.java:558)
	at org.joda.time.base.AbstractPartial.getFieldType(AbstractPartial.java:79)
	at org.joda.time.chrono.BaseChronology.get(BaseChronology.java:59)
	at org.joda.time.convert.AbstractConverter.getPartialValues(AbstractConverter.java:102)
	at org.joda.time.convert.AbstractConverter.getPartialValues(AbstractConverter.java:123)
	at org.joda.time.LocalTime.<init>(LocalTime.java:409)
	at org.joda.time.TestLocalTime_Constructors.testConstructor_nullObject_DateTimeZone(TestLocalTime_Constructors.java:531)

testConstructor_Object_nullDateTimeZone(org.joda.time.TestLocalTime_Constructors)  Time elapsed: 0.001 sec  <<< ERROR!
java.lang.IndexOutOfBoundsException: Invalid index: -1
	at org.joda.time.LocalTime.getField(LocalTime.java:558)
	at org.joda.time.base.AbstractPartial.getFieldType(AbstractPartial.java:79)
	at org.joda.time.chrono.BaseChronology.get(BaseChronology.java:59)
	at org.joda.time.convert.AbstractConverter.getPartialValues(AbstractConverter.java:102)
	at org.joda.time.convert.AbstractConverter.getPartialValues(AbstractConverter.java:123)
	at org.joda.time.LocalTime.<init>(LocalTime.java:409)
	at org.joda.time.TestLocalTime_Constructors.testConstructor_Object_nullDateTimeZone(TestLocalTime_Constructors.java:541)

testConstructor_nullObject_nullDateTimeZone(org.joda.time.TestLocalTime_Constructors)  Time elapsed: 0 sec  <<< ERROR!
java.lang.IndexOutOfBoundsException: Invalid index: -1
	at org.joda.time.LocalTime.getField(LocalTime.java:558)
	at org.joda.time.base.AbstractPartial.getFieldType(AbstractPartial.java:79)
	at org.joda.time.chrono.BaseChronology.get(BaseChronology.java:59)
	at org.joda.time.convert.AbstractConverter.getPartialValues(AbstractConverter.java:102)
	at org.joda.time.convert.AbstractConverter.getPartialValues(AbstractConverter.java:123)
	at org.joda.time.LocalTime.<init>(LocalTime.java:409)
	at org.joda.time.TestLocalTime_Constructors.testConstructor_nullObject_nullDateTimeZone(TestLocalTime_Constructors.java:550)

testConstructor_nullObject_Chronology(org.joda.time.TestLocalTime_Constructors)  Time elapsed: 0 sec  <<< ERROR!
java.lang.IndexOutOfBoundsException: Invalid index: -1
	at org.joda.time.LocalTime.getField(LocalTime.java:558)
	at org.joda.time.base.AbstractPartial.getFieldType(AbstractPartial.java:79)
	at org.joda.time.chrono.BaseChronology.get(BaseChronology.java:59)
	at org.joda.time.convert.AbstractConverter.getPartialValues(AbstractConverter.java:102)
	at org.joda.time.convert.AbstractConverter.getPartialValues(AbstractConverter.java:123)
	at org.joda.time.LocalTime.<init>(LocalTime.java:435)
	at org.joda.time.TestLocalTime_Constructors.testConstructor_nullObject_Chronology(TestLocalTime_Constructors.java:583)

testConstructor_Object_nullChronology(org.joda.time.TestLocalTime_Constructors)  Time elapsed: 0.001 sec  <<< ERROR!
java.lang.IndexOutOfBoundsException: Invalid index: -1
	at org.joda.time.LocalTime.getField(LocalTime.java:558)
	at org.joda.time.base.AbstractPartial.getFieldType(AbstractPartial.java:79)
	at org.joda.time.chrono.BaseChronology.get(BaseChronology.java:59)
	at org.joda.time.convert.AbstractConverter.getPartialValues(AbstractConverter.java:102)
	at org.joda.time.convert.AbstractConverter.getPartialValues(AbstractConverter.java:123)
	at org.joda.time.LocalTime.<init>(LocalTime.java:435)
	at org.joda.time.TestLocalTime_Constructors.testConstructor_Object_nullChronology(TestLocalTime_Constructors.java:593)

testConstructor_nullObject_nullChronology(org.joda.time.TestLocalTime_Constructors)  Time elapsed: 0 sec  <<< ERROR!
java.lang.IndexOutOfBoundsException: Invalid index: -1
	at org.joda.time.LocalTime.getField(LocalTime.java:558)
	at org.joda.time.base.AbstractPartial.getFieldType(AbstractPartial.java:79)
	at org.joda.time.chrono.BaseChronology.get(BaseChronology.java:59)
	at org.joda.time.convert.AbstractConverter.getPartialValues(AbstractConverter.java:102)
	at org.joda.time.convert.AbstractConverter.getPartialValues(AbstractConverter.java:123)
	at org.joda.time.LocalTime.<init>(LocalTime.java:435)
	at org.joda.time.TestLocalTime_Constructors.testConstructor_nullObject_nullChronology(TestLocalTime_Constructors.java:602)

testConstructor_nullObject(org.joda.time.TestLocalTime_Constructors)  Time elapsed: 0 sec  <<< ERROR!
java.lang.IndexOutOfBoundsException: Invalid index: -1
	at org.joda.time.LocalTime.getField(LocalTime.java:558)
	at org.joda.time.base.AbstractPartial.getFieldType(AbstractPartial.java:79)
	at org.joda.time.chrono.BaseChronology.get(BaseChronology.java:59)
	at org.joda.time.convert.AbstractConverter.getPartialValues(AbstractConverter.java:102)
	at org.joda.time.convert.AbstractConverter.getPartialValues(AbstractConverter.java:123)
	at org.joda.time.LocalTime.<init>(LocalTime.java:435)
	at org.joda.time.LocalTime.<init>(LocalTime.java:383)
	at org.joda.time.TestLocalTime_Constructors.testConstructor_nullObject(TestLocalTime_Constructors.java:354)

testConstructor_Object1(org.joda.time.TestLocalTime_Constructors)  Time elapsed: 0 sec  <<< ERROR!
java.lang.IndexOutOfBoundsException: Invalid index: -1
	at org.joda.time.LocalTime.getField(LocalTime.java:558)
	at org.joda.time.base.AbstractPartial.getFieldType(AbstractPartial.java:79)
	at org.joda.time.chrono.BaseChronology.get(BaseChronology.java:59)
	at org.joda.time.convert.AbstractConverter.getPartialValues(AbstractConverter.java:102)
	at org.joda.time.convert.AbstractConverter.getPartialValues(AbstractConverter.java:123)
	at org.joda.time.LocalTime.<init>(LocalTime.java:435)
	at org.joda.time.LocalTime.<init>(LocalTime.java:383)
	at org.joda.time.TestLocalTime_Constructors.testConstructor_Object1(TestLocalTime_Constructors.java:334)

testConstructor_Object2(org.joda.time.TestLocalTime_Constructors)  Time elapsed: 0.002 sec  <<< ERROR!
java.lang.IndexOutOfBoundsException: Invalid index: -1
	at org.joda.time.LocalTime.getField(LocalTime.java:558)
	at org.joda.time.base.AbstractPartial.getFieldType(AbstractPartial.java:79)
	at org.joda.time.chrono.BaseChronology.get(BaseChronology.java:59)
	at org.joda.time.convert.AbstractConverter.getPartialValues(AbstractConverter.java:102)
	at org.joda.time.convert.AbstractConverter.getPartialValues(AbstractConverter.java:123)
	at org.joda.time.LocalTime.<init>(LocalTime.java:435)
	at org.joda.time.LocalTime.<init>(LocalTime.java:383)
	at org.joda.time.TestLocalTime_Constructors.testConstructor_Object2(TestLocalTime_Constructors.java:345)

testConstructor_ObjectString1Tokyo(org.joda.time.TestLocalTime_Constructors)  Time elapsed: 0.001 sec  <<< ERROR!
java.lang.IndexOutOfBoundsException: Invalid index: -1
	at org.joda.time.LocalTime.getField(LocalTime.java:558)
	at org.joda.time.base.AbstractPartial.getFieldType(AbstractPartial.java:79)
	at org.joda.time.chrono.BaseChronology.get(BaseChronology.java:59)
	at org.joda.time.convert.StringConverter.getPartialValues(StringConverter.java:88)
	at org.joda.time.LocalTime.<init>(LocalTime.java:435)
	at org.joda.time.LocalTime.<init>(LocalTime.java:383)
	at org.joda.time.TestLocalTime_Constructors.testConstructor_ObjectString1Tokyo(TestLocalTime_Constructors.java:373)

testConstructor_ObjectString1NewYork(org.joda.time.TestLocalTime_Constructors)  Time elapsed: 0.001 sec  <<< ERROR!
java.lang.IndexOutOfBoundsException: Invalid index: -1
	at org.joda.time.LocalTime.getField(LocalTime.java:558)
	at org.joda.time.base.AbstractPartial.getFieldType(AbstractPartial.java:79)
	at org.joda.time.chrono.BaseChronology.get(BaseChronology.java:59)
	at org.joda.time.convert.StringConverter.getPartialValues(StringConverter.java:88)
	at org.joda.time.LocalTime.<init>(LocalTime.java:435)
	at org.joda.time.LocalTime.<init>(LocalTime.java:383)
	at org.joda.time.TestLocalTime_Constructors.testConstructor_ObjectString1NewYork(TestLocalTime_Constructors.java:383)

testConstructor_Object1_DateTimeZone(org.joda.time.TestLocalTime_Constructors)  Time elapsed: 0 sec  <<< ERROR!
java.lang.IndexOutOfBoundsException: Invalid index: -1
	at org.joda.time.LocalTime.getField(LocalTime.java:558)
	at org.joda.time.base.AbstractPartial.getFieldType(AbstractPartial.java:79)
	at org.joda.time.chrono.BaseChronology.get(BaseChronology.java:59)
	at org.joda.time.convert.AbstractConverter.getPartialValues(AbstractConverter.java:102)
	at org.joda.time.convert.AbstractConverter.getPartialValues(AbstractConverter.java:123)
	at org.joda.time.LocalTime.<init>(LocalTime.java:409)
	at org.joda.time.TestLocalTime_Constructors.testConstructor_Object1_DateTimeZone(TestLocalTime_Constructors.java:502)

testConstructor_ObjectString_DateTimeZoneLondon(org.joda.time.TestLocalTime_Constructors)  Time elapsed: 0.001 sec  <<< ERROR!
java.lang.IndexOutOfBoundsException: Invalid index: -1
	at org.joda.time.LocalTime.getField(LocalTime.java:558)
	at org.joda.time.base.AbstractPartial.getFieldType(AbstractPartial.java:79)
	at org.joda.time.chrono.BaseChronology.get(BaseChronology.java:59)
	at org.joda.time.convert.StringConverter.getPartialValues(StringConverter.java:88)
	at org.joda.time.LocalTime.<init>(LocalTime.java:409)
	at org.joda.time.TestLocalTime_Constructors.testConstructor_ObjectString_DateTimeZoneLondon(TestLocalTime_Constructors.java:511)

testConstructor_ObjectString_DateTimeZoneTokyo(org.joda.time.TestLocalTime_Constructors)  Time elapsed: 0.001 sec  <<< ERROR!
java.lang.IndexOutOfBoundsException: Invalid index: -1
	at org.joda.time.LocalTime.getField(LocalTime.java:558)
	at org.joda.time.base.AbstractPartial.getFieldType(AbstractPartial.java:79)
	at org.joda.time.chrono.BaseChronology.get(BaseChronology.java:59)
	at org.joda.time.convert.StringConverter.getPartialValues(StringConverter.java:88)
	at org.joda.time.LocalTime.<init>(LocalTime.java:409)
	at org.joda.time.TestLocalTime_Constructors.testConstructor_ObjectString_DateTimeZoneTokyo(TestLocalTime_Constructors.java:517)

testConstructor_ObjectString_DateTimeZoneNewYork(org.joda.time.TestLocalTime_Constructors)  Time elapsed: 0 sec  <<< ERROR!
java.lang.IndexOutOfBoundsException: Invalid index: -1
	at org.joda.time.LocalTime.getField(LocalTime.java:558)
	at org.joda.time.base.AbstractPartial.getFieldType(AbstractPartial.java:79)
	at org.joda.time.chrono.BaseChronology.get(BaseChronology.java:59)
	at org.joda.time.convert.StringConverter.getPartialValues(StringConverter.java:88)
	at org.joda.time.LocalTime.<init>(LocalTime.java:409)
	at org.joda.time.TestLocalTime_Constructors.testConstructor_ObjectString_DateTimeZoneNewYork(TestLocalTime_Constructors.java:524)

testConstructor_Object1_Chronology(org.joda.time.TestLocalTime_Constructors)  Time elapsed: 0.001 sec  <<< ERROR!
java.lang.IndexOutOfBoundsException: Invalid index: -1
	at org.joda.time.LocalTime.getField(LocalTime.java:558)
	at org.joda.time.base.AbstractPartial.getFieldType(AbstractPartial.java:79)
	at org.joda.time.chrono.BaseChronology.get(BaseChronology.java:59)
	at org.joda.time.convert.AbstractConverter.getPartialValues(AbstractConverter.java:102)
	at org.joda.time.convert.AbstractConverter.getPartialValues(AbstractConverter.java:123)
	at org.joda.time.LocalTime.<init>(LocalTime.java:435)
	at org.joda.time.TestLocalTime_Constructors.testConstructor_Object1_Chronology(TestLocalTime_Constructors.java:561)

testConstructor_Object2_Chronology(org.joda.time.TestLocalTime_Constructors)  Time elapsed: 0.001 sec  <<< ERROR!
java.lang.IndexOutOfBoundsException: Invalid index: -1
	at org.joda.time.LocalTime.getField(LocalTime.java:558)
	at org.joda.time.base.AbstractPartial.getFieldType(AbstractPartial.java:79)
	at org.joda.time.chrono.BaseChronology.get(BaseChronology.java:59)
	at org.joda.time.convert.StringConverter.getPartialValues(StringConverter.java:88)
	at org.joda.time.LocalTime.<init>(LocalTime.java:435)
	at org.joda.time.LocalTime.<init>(LocalTime.java:383)
	at org.joda.time.TestLocalTime_Constructors.testConstructor_Object2_Chronology(TestLocalTime_Constructors.java:570)

testGet(org.joda.time.TestTimeOfDay_Basics)  Time elapsed: 0.001 sec  <<< ERROR!
java.lang.ArrayIndexOutOfBoundsException: -1
	at org.joda.time.TimeOfDay.getFieldType(TimeOfDay.java:464)
	at org.joda.time.chrono.BaseChronology.get(BaseChronology.java:59)
	at org.joda.time.base.BasePartial.<init>(BasePartial.java:111)
	at org.joda.time.base.BasePartial.<init>(BasePartial.java:65)
	at org.joda.time.TimeOfDay.<init>(TimeOfDay.java:199)
	at org.joda.time.TestTimeOfDay_Basics.testGet(TestTimeOfDay_Basics.java:96)

testIsSupported(org.joda.time.TestTimeOfDay_Basics)  Time elapsed: 0 sec  <<< ERROR!
java.lang.ArrayIndexOutOfBoundsException: -1
	at org.joda.time.TimeOfDay.getFieldType(TimeOfDay.java:464)
	at org.joda.time.chrono.BaseChronology.get(BaseChronology.java:59)
	at org.joda.time.base.BasePartial.<init>(BasePartial.java:111)
	at org.joda.time.base.BasePartial.<init>(BasePartial.java:79)
	at org.joda.time.TimeOfDay.<init>(TimeOfDay.java:228)
	at org.joda.time.TestTimeOfDay_Basics.testIsSupported(TestTimeOfDay_Basics.java:189)

testSize(org.joda.time.TestTimeOfDay_Basics)  Time elapsed: 0.001 sec  <<< ERROR!
java.lang.ArrayIndexOutOfBoundsException: -1
	at org.joda.time.TimeOfDay.getFieldType(TimeOfDay.java:464)
	at org.joda.time.chrono.BaseChronology.get(BaseChronology.java:59)
	at org.joda.time.base.BasePartial.<init>(BasePartial.java:111)
	at org.joda.time.base.BasePartial.<init>(BasePartial.java:65)
	at org.joda.time.TimeOfDay.<init>(TimeOfDay.java:199)
	at org.joda.time.TestTimeOfDay_Basics.testSize(TestTimeOfDay_Basics.java:112)

testGetFieldTypes(org.joda.time.TestTimeOfDay_Basics)  Time elapsed: 0.001 sec  <<< ERROR!
java.lang.ArrayIndexOutOfBoundsException: -1
	at org.joda.time.TimeOfDay.getFieldType(TimeOfDay.java:464)
	at org.joda.time.chrono.BaseChronology.get(BaseChronology.java:59)
	at org.joda.time.base.BasePartial.<init>(BasePartial.java:111)
	at org.joda.time.base.BasePartial.<init>(BasePartial.java:79)
	at org.joda.time.TimeOfDay.<init>(TimeOfDay.java:228)
	at org.joda.time.TestTimeOfDay_Basics.testGetFieldTypes(TestTimeOfDay_Basics.java:131)

testGetFields(org.joda.time.TestTimeOfDay_Basics)  Time elapsed: 0 sec  <<< ERROR!
java.lang.ArrayIndexOutOfBoundsException: -1
	at org.joda.time.TimeOfDay.getFieldType(TimeOfDay.java:464)
	at org.joda.time.chrono.BaseChronology.get(BaseChronology.java:59)
	at org.joda.time.base.BasePartial.<init>(BasePartial.java:111)
	at org.joda.time.base.BasePartial.<init>(BasePartial.java:79)
	at org.joda.time.TimeOfDay.<init>(TimeOfDay.java:228)
	at org.joda.time.TestTimeOfDay_Basics.testGetFields(TestTimeOfDay_Basics.java:155)

testGetField(org.joda.time.TestTimeOfDay_Basics)  Time elapsed: 0.001 sec  <<< ERROR!
java.lang.ArrayIndexOutOfBoundsException: -1
	at org.joda.time.TimeOfDay.getFieldType(TimeOfDay.java:464)
	at org.joda.time.chrono.BaseChronology.get(BaseChronology.java:59)
	at org.joda.time.base.BasePartial.<init>(BasePartial.java:111)
	at org.joda.time.base.BasePartial.<init>(BasePartial.java:79)
	at org.joda.time.TimeOfDay.<init>(TimeOfDay.java:228)
	at org.joda.time.TestTimeOfDay_Basics.testGetField(TestTimeOfDay_Basics.java:141)

testGetFieldType(org.joda.time.TestTimeOfDay_Basics)  Time elapsed: 0.001 sec  <<< ERROR!
java.lang.ArrayIndexOutOfBoundsException: -1
	at org.joda.time.TimeOfDay.getFieldType(TimeOfDay.java:464)
	at org.joda.time.chrono.BaseChronology.get(BaseChronology.java:59)
	at org.joda.time.base.BasePartial.<init>(BasePartial.java:111)
	at org.joda.time.base.BasePartial.<init>(BasePartial.java:79)
	at org.joda.time.TimeOfDay.<init>(TimeOfDay.java:228)
	at org.joda.time.TestTimeOfDay_Basics.testGetFieldType(TestTimeOfDay_Basics.java:117)

testConstructor(org.joda.time.TestTimeOfDay_Constructors)  Time elapsed: 0 sec  <<< ERROR!
java.lang.ArrayIndexOutOfBoundsException: -1
	at org.joda.time.TimeOfDay.getFieldType(TimeOfDay.java:464)
	at org.joda.time.chrono.BaseChronology.get(BaseChronology.java:59)
	at org.joda.time.base.BasePartial.<init>(BasePartial.java:111)
	at org.joda.time.base.BasePartial.<init>(BasePartial.java:65)
	at org.joda.time.TimeOfDay.<init>(TimeOfDay.java:199)
	at org.joda.time.TestTimeOfDay_Constructors.testConstructor(TestTimeOfDay_Constructors.java:179)

testConstructor_long1_Chronology(org.joda.time.TestTimeOfDay_Constructors)  Time elapsed: 0.001 sec  <<< ERROR!
java.lang.ArrayIndexOutOfBoundsException: -1
	at org.joda.time.TimeOfDay.getFieldType(TimeOfDay.java:464)
	at org.joda.time.chrono.BaseChronology.get(BaseChronology.java:59)
	at org.joda.time.base.BasePartial.<init>(BasePartial.java:111)
	at org.joda.time.TimeOfDay.<init>(TimeOfDay.java:257)
	at org.joda.time.TestTimeOfDay_Constructors.testConstructor_long1_Chronology(TestTimeOfDay_Constructors.java:279)

testConstructor_long2_Chronology(org.joda.time.TestTimeOfDay_Constructors)  Time elapsed: 0 sec  <<< ERROR!
java.lang.ArrayIndexOutOfBoundsException: -1
	at org.joda.time.TimeOfDay.getFieldType(TimeOfDay.java:464)
	at org.joda.time.chrono.BaseChronology.get(BaseChronology.java:59)
	at org.joda.time.base.BasePartial.<init>(BasePartial.java:111)
	at org.joda.time.TimeOfDay.<init>(TimeOfDay.java:257)
	at org.joda.time.TestTimeOfDay_Constructors.testConstructor_long2_Chronology(TestTimeOfDay_Constructors.java:291)

testConstructor_long_nullChronology(org.joda.time.TestTimeOfDay_Constructors)  Time elapsed: 0 sec  <<< ERROR!
java.lang.ArrayIndexOutOfBoundsException: -1
	at org.joda.time.TimeOfDay.getFieldType(TimeOfDay.java:464)
	at org.joda.time.chrono.BaseChronology.get(BaseChronology.java:59)
	at org.joda.time.base.BasePartial.<init>(BasePartial.java:111)
	at org.joda.time.TimeOfDay.<init>(TimeOfDay.java:257)
	at org.joda.time.TestTimeOfDay_Constructors.testConstructor_long_nullChronology(TestTimeOfDay_Constructors.java:303)

testConstructor_ObjectString1(org.joda.time.TestTimeOfDay_Constructors)  Time elapsed: 0.001 sec  <<< ERROR!
java.lang.ArrayIndexOutOfBoundsException: -1
	at org.joda.time.TimeOfDay.getFieldType(TimeOfDay.java:464)
	at org.joda.time.chrono.BaseChronology.get(BaseChronology.java:59)
	at org.joda.time.convert.StringConverter.getPartialValues(StringConverter.java:88)
	at org.joda.time.base.BasePartial.<init>(BasePartial.java:163)
	at org.joda.time.TimeOfDay.<init>(TimeOfDay.java:277)
	at org.joda.time.TestTimeOfDay_Constructors.testConstructor_ObjectString1(TestTimeOfDay_Constructors.java:365)

testConstructor_ObjectString2(org.joda.time.TestTimeOfDay_Constructors)  Time elapsed: 0 sec  <<< ERROR!
java.lang.ArrayIndexOutOfBoundsException: -1
	at org.joda.time.TimeOfDay.getFieldType(TimeOfDay.java:464)
	at org.joda.time.chrono.BaseChronology.get(BaseChronology.java:59)
	at org.joda.time.convert.StringConverter.getPartialValues(StringConverter.java:88)
	at org.joda.time.base.BasePartial.<init>(BasePartial.java:163)
	at org.joda.time.TimeOfDay.<init>(TimeOfDay.java:277)
	at org.joda.time.TestTimeOfDay_Constructors.testConstructor_ObjectString2(TestTimeOfDay_Constructors.java:374)

testConstructor_ObjectString3(org.joda.time.TestTimeOfDay_Constructors)  Time elapsed: 0.001 sec  <<< ERROR!
java.lang.ArrayIndexOutOfBoundsException: -1
	at org.joda.time.TimeOfDay.getFieldType(TimeOfDay.java:464)
	at org.joda.time.chrono.BaseChronology.get(BaseChronology.java:59)
	at org.joda.time.convert.StringConverter.getPartialValues(StringConverter.java:88)
	at org.joda.time.base.BasePartial.<init>(BasePartial.java:163)
	at org.joda.time.TimeOfDay.<init>(TimeOfDay.java:277)
	at org.joda.time.TestTimeOfDay_Constructors.testConstructor_ObjectString3(TestTimeOfDay_Constructors.java:383)

testConstructor_ObjectString4(org.joda.time.TestTimeOfDay_Constructors)  Time elapsed: 0 sec  <<< ERROR!
java.lang.ArrayIndexOutOfBoundsException: -1
	at org.joda.time.TimeOfDay.getFieldType(TimeOfDay.java:464)
	at org.joda.time.chrono.BaseChronology.get(BaseChronology.java:59)
	at org.joda.time.convert.StringConverter.getPartialValues(StringConverter.java:88)
	at org.joda.time.base.BasePartial.<init>(BasePartial.java:163)
	at org.joda.time.TimeOfDay.<init>(TimeOfDay.java:277)
	at org.joda.time.TestTimeOfDay_Constructors.testConstructor_ObjectString4(TestTimeOfDay_Constructors.java:392)

testConstructor_ObjectString5(org.joda.time.TestTimeOfDay_Constructors)  Time elapsed: 0 sec  <<< ERROR!
java.lang.ArrayIndexOutOfBoundsException: -1
	at org.joda.time.TimeOfDay.getFieldType(TimeOfDay.java:464)
	at org.joda.time.chrono.BaseChronology.get(BaseChronology.java:59)
	at org.joda.time.convert.StringConverter.getPartialValues(StringConverter.java:88)
	at org.joda.time.base.BasePartial.<init>(BasePartial.java:163)
	at org.joda.time.TimeOfDay.<init>(TimeOfDay.java:277)
	at org.joda.time.TestTimeOfDay_Constructors.testConstructor_ObjectString5(TestTimeOfDay_Constructors.java:401)

testConstructor_ObjectString6(org.joda.time.TestTimeOfDay_Constructors)  Time elapsed: 0.001 sec  <<< ERROR!
java.lang.ArrayIndexOutOfBoundsException: -1
	at org.joda.time.TimeOfDay.getFieldType(TimeOfDay.java:464)
	at org.joda.time.chrono.BaseChronology.get(BaseChronology.java:59)
	at org.joda.time.convert.StringConverter.getPartialValues(StringConverter.java:88)
	at org.joda.time.base.BasePartial.<init>(BasePartial.java:163)
	at org.joda.time.TimeOfDay.<init>(TimeOfDay.java:277)
	at org.joda.time.TestTimeOfDay_Constructors.testConstructor_ObjectString6(TestTimeOfDay_Constructors.java:410)

testConstructor_Object_Chronology(org.joda.time.TestTimeOfDay_Constructors)  Time elapsed: 0.001 sec  <<< ERROR!
java.lang.ArrayIndexOutOfBoundsException: -1
	at org.joda.time.TimeOfDay.getFieldType(TimeOfDay.java:464)
	at org.joda.time.chrono.BaseChronology.get(BaseChronology.java:59)
	at org.joda.time.convert.AbstractConverter.getPartialValues(AbstractConverter.java:102)
	at org.joda.time.convert.AbstractConverter.getPartialValues(AbstractConverter.java:123)
	at org.joda.time.base.BasePartial.<init>(BasePartial.java:163)
	at org.joda.time.TimeOfDay.<init>(TimeOfDay.java:302)
	at org.joda.time.TestTimeOfDay_Constructors.testConstructor_Object_Chronology(TestTimeOfDay_Constructors.java:452)

testConstructor_nullObject_Chronology(org.joda.time.TestTimeOfDay_Constructors)  Time elapsed: 0 sec  <<< ERROR!
java.lang.ArrayIndexOutOfBoundsException: -1
	at org.joda.time.TimeOfDay.getFieldType(TimeOfDay.java:464)
	at org.joda.time.chrono.BaseChronology.get(BaseChronology.java:59)
	at org.joda.time.convert.AbstractConverter.getPartialValues(AbstractConverter.java:102)
	at org.joda.time.convert.AbstractConverter.getPartialValues(AbstractConverter.java:123)
	at org.joda.time.base.BasePartial.<init>(BasePartial.java:163)
	at org.joda.time.TimeOfDay.<init>(TimeOfDay.java:302)
	at org.joda.time.TestTimeOfDay_Constructors.testConstructor_nullObject_Chronology(TestTimeOfDay_Constructors.java:480)

testConstructor_Object_nullChronology(org.joda.time.TestTimeOfDay_Constructors)  Time elapsed: 0.001 sec  <<< ERROR!
java.lang.ArrayIndexOutOfBoundsException: -1
	at org.joda.time.TimeOfDay.getFieldType(TimeOfDay.java:464)
	at org.joda.time.chrono.BaseChronology.get(BaseChronology.java:59)
	at org.joda.time.convert.AbstractConverter.getPartialValues(AbstractConverter.java:102)
	at org.joda.time.convert.AbstractConverter.getPartialValues(AbstractConverter.java:123)
	at org.joda.time.base.BasePartial.<init>(BasePartial.java:163)
	at org.joda.time.TimeOfDay.<init>(TimeOfDay.java:302)
	at org.joda.time.TestTimeOfDay_Constructors.testConstructor_Object_nullChronology(TestTimeOfDay_Constructors.java:493)

testConstructor_nullObject_nullChronology(org.joda.time.TestTimeOfDay_Constructors)  Time elapsed: 0 sec  <<< ERROR!
java.lang.ArrayIndexOutOfBoundsException: -1
	at org.joda.time.TimeOfDay.getFieldType(TimeOfDay.java:464)
	at org.joda.time.chrono.BaseChronology.get(BaseChronology.java:59)
	at org.joda.time.convert.AbstractConverter.getPartialValues(AbstractConverter.java:102)
	at org.joda.time.convert.AbstractConverter.getPartialValues(AbstractConverter.java:123)
	at org.joda.time.base.BasePartial.<init>(BasePartial.java:163)
	at org.joda.time.TimeOfDay.<init>(TimeOfDay.java:302)
	at org.joda.time.TestTimeOfDay_Constructors.testConstructor_nullObject_nullChronology(TestTimeOfDay_Constructors.java:505)

testConstructor_long1(org.joda.time.TestTimeOfDay_Constructors)  Time elapsed: 0.001 sec  <<< ERROR!
java.lang.ArrayIndexOutOfBoundsException: -1
	at org.joda.time.TimeOfDay.getFieldType(TimeOfDay.java:464)
	at org.joda.time.chrono.BaseChronology.get(BaseChronology.java:59)
	at org.joda.time.base.BasePartial.<init>(BasePartial.java:111)
	at org.joda.time.base.BasePartial.<init>(BasePartial.java:93)
	at org.joda.time.TimeOfDay.<init>(TimeOfDay.java:242)
	at org.joda.time.TestTimeOfDay_Constructors.testConstructor_long1(TestTimeOfDay_Constructors.java:255)

testConstructor_long2(org.joda.time.TestTimeOfDay_Constructors)  Time elapsed: 0 sec  <<< ERROR!
java.lang.ArrayIndexOutOfBoundsException: -1
	at org.joda.time.TimeOfDay.getFieldType(TimeOfDay.java:464)
	at org.joda.time.chrono.BaseChronology.get(BaseChronology.java:59)
	at org.joda.time.base.BasePartial.<init>(BasePartial.java:111)
	at org.joda.time.base.BasePartial.<init>(BasePartial.java:93)
	at org.joda.time.TimeOfDay.<init>(TimeOfDay.java:242)
	at org.joda.time.TestTimeOfDay_Constructors.testConstructor_long2(TestTimeOfDay_Constructors.java:267)

testConstructor_nullObject(org.joda.time.TestTimeOfDay_Constructors)  Time elapsed: 0.001 sec  <<< ERROR!
java.lang.ArrayIndexOutOfBoundsException: -1
	at org.joda.time.TimeOfDay.getFieldType(TimeOfDay.java:464)
	at org.joda.time.chrono.BaseChronology.get(BaseChronology.java:59)
	at org.joda.time.convert.AbstractConverter.getPartialValues(AbstractConverter.java:102)
	at org.joda.time.convert.AbstractConverter.getPartialValues(AbstractConverter.java:123)
	at org.joda.time.base.BasePartial.<init>(BasePartial.java:163)
	at org.joda.time.TimeOfDay.<init>(TimeOfDay.java:277)
	at org.joda.time.TestTimeOfDay_Constructors.testConstructor_nullObject(TestTimeOfDay_Constructors.java:343)

testConstructor_DateTimeZone(org.joda.time.TestTimeOfDay_Constructors)  Time elapsed: 0 sec  <<< ERROR!
java.lang.ArrayIndexOutOfBoundsException: -1
	at org.joda.time.TimeOfDay.getFieldType(TimeOfDay.java:464)
	at org.joda.time.chrono.BaseChronology.get(BaseChronology.java:59)
	at org.joda.time.base.BasePartial.<init>(BasePartial.java:111)
	at org.joda.time.base.BasePartial.<init>(BasePartial.java:79)
	at org.joda.time.TimeOfDay.<init>(TimeOfDay.java:214)
	at org.joda.time.TestTimeOfDay_Constructors.testConstructor_DateTimeZone(TestTimeOfDay_Constructors.java:195)

testConstructor_nullDateTimeZone(org.joda.time.TestTimeOfDay_Constructors)  Time elapsed: 0.001 sec  <<< ERROR!
java.lang.ArrayIndexOutOfBoundsException: -1
	at org.joda.time.TimeOfDay.getFieldType(TimeOfDay.java:464)
	at org.joda.time.chrono.BaseChronology.get(BaseChronology.java:59)
	at org.joda.time.base.BasePartial.<init>(BasePartial.java:111)
	at org.joda.time.base.BasePartial.<init>(BasePartial.java:79)
	at org.joda.time.TimeOfDay.<init>(TimeOfDay.java:214)
	at org.joda.time.TestTimeOfDay_Constructors.testConstructor_nullDateTimeZone(TestTimeOfDay_Constructors.java:218)

testConstructor_Chronology(org.joda.time.TestTimeOfDay_Constructors)  Time elapsed: 0 sec  <<< ERROR!
java.lang.ArrayIndexOutOfBoundsException: -1
	at org.joda.time.TimeOfDay.getFieldType(TimeOfDay.java:464)
	at org.joda.time.chrono.BaseChronology.get(BaseChronology.java:59)
	at org.joda.time.base.BasePartial.<init>(BasePartial.java:111)
	at org.joda.time.base.BasePartial.<init>(BasePartial.java:79)
	at org.joda.time.TimeOfDay.<init>(TimeOfDay.java:228)
	at org.joda.time.TestTimeOfDay_Constructors.testConstructor_Chronology(TestTimeOfDay_Constructors.java:230)

testConstructor_nullChronology(org.joda.time.TestTimeOfDay_Constructors)  Time elapsed: 0.001 sec  <<< ERROR!
java.lang.ArrayIndexOutOfBoundsException: -1
	at org.joda.time.TimeOfDay.getFieldType(TimeOfDay.java:464)
	at org.joda.time.chrono.BaseChronology.get(BaseChronology.java:59)
	at org.joda.time.base.BasePartial.<init>(BasePartial.java:111)
	at org.joda.time.base.BasePartial.<init>(BasePartial.java:79)
	at org.joda.time.TimeOfDay.<init>(TimeOfDay.java:228)
	at org.joda.time.TestTimeOfDay_Constructors.testConstructor_nullChronology(TestTimeOfDay_Constructors.java:242)

testConstructor_Object1(org.joda.time.TestTimeOfDay_Constructors)  Time elapsed: 0 sec  <<< ERROR!
java.lang.ArrayIndexOutOfBoundsException: -1
	at org.joda.time.TimeOfDay.getFieldType(TimeOfDay.java:464)
	at org.joda.time.chrono.BaseChronology.get(BaseChronology.java:59)
	at org.joda.time.convert.AbstractConverter.getPartialValues(AbstractConverter.java:102)
	at org.joda.time.convert.AbstractConverter.getPartialValues(AbstractConverter.java:123)
	at org.joda.time.base.BasePartial.<init>(BasePartial.java:163)
	at org.joda.time.TimeOfDay.<init>(TimeOfDay.java:277)
	at org.joda.time.TestTimeOfDay_Constructors.testConstructor_Object1(TestTimeOfDay_Constructors.java:317)

testConstructor_Object2(org.joda.time.TestTimeOfDay_Constructors)  Time elapsed: 0.001 sec  <<< ERROR!
java.lang.ArrayIndexOutOfBoundsException: -1
	at org.joda.time.TimeOfDay.getFieldType(TimeOfDay.java:464)
	at org.joda.time.chrono.BaseChronology.get(BaseChronology.java:59)
	at org.joda.time.convert.AbstractConverter.getPartialValues(AbstractConverter.java:102)
	at org.joda.time.convert.AbstractConverter.getPartialValues(AbstractConverter.java:123)
	at org.joda.time.base.BasePartial.<init>(BasePartial.java:163)
	at org.joda.time.TimeOfDay.<init>(TimeOfDay.java:277)
	at org.joda.time.TestTimeOfDay_Constructors.testConstructor_Object2(TestTimeOfDay_Constructors.java:331)

testFactoryMillisOfDay_long_nullChronology(org.joda.time.TestTimeOfDay_Constructors)  Time elapsed: 0 sec  <<< ERROR!
java.lang.ArrayIndexOutOfBoundsException: -1
	at org.joda.time.TimeOfDay.getFieldType(TimeOfDay.java:464)
	at org.joda.time.chrono.BaseChronology.get(BaseChronology.java:59)
	at org.joda.time.base.BasePartial.<init>(BasePartial.java:111)
	at org.joda.time.TimeOfDay.<init>(TimeOfDay.java:257)
	at org.joda.time.TimeOfDay.fromMillisOfDay(TimeOfDay.java:185)
	at org.joda.time.TestTimeOfDay_Constructors.testFactoryMillisOfDay_long_nullChronology(TestTimeOfDay_Constructors.java:166)

testConstructor2_Object_Chronology(org.joda.time.TestTimeOfDay_Constructors)  Time elapsed: 0.001 sec  <<< ERROR!
java.lang.ArrayIndexOutOfBoundsException: -1
	at org.joda.time.TimeOfDay.getFieldType(TimeOfDay.java:464)
	at org.joda.time.chrono.BaseChronology.get(BaseChronology.java:59)
	at org.joda.time.convert.StringConverter.getPartialValues(StringConverter.java:88)
	at org.joda.time.base.BasePartial.<init>(BasePartial.java:163)
	at org.joda.time.TimeOfDay.<init>(TimeOfDay.java:277)
	at org.joda.time.TestTimeOfDay_Constructors.testConstructor2_Object_Chronology(TestTimeOfDay_Constructors.java:464)

testFactoryMillisOfDay_long1(org.joda.time.TestTimeOfDay_Constructors)  Time elapsed: 0 sec  <<< ERROR!
java.lang.ArrayIndexOutOfBoundsException: -1
	at org.joda.time.TimeOfDay.getFieldType(TimeOfDay.java:464)
	at org.joda.time.chrono.BaseChronology.get(BaseChronology.java:59)
	at org.joda.time.base.BasePartial.<init>(BasePartial.java:111)
	at org.joda.time.TimeOfDay.<init>(TimeOfDay.java:257)
	at org.joda.time.TimeOfDay.fromMillisOfDay(TimeOfDay.java:185)
	at org.joda.time.TimeOfDay.fromMillisOfDay(TimeOfDay.java:168)
	at org.joda.time.TestTimeOfDay_Constructors.testFactoryMillisOfDay_long1(TestTimeOfDay_Constructors.java:142)

testFactoryMillisOfDay_long1_Chronology(org.joda.time.TestTimeOfDay_Constructors)  Time elapsed: 0 sec  <<< ERROR!
java.lang.ArrayIndexOutOfBoundsException: -1
	at org.joda.time.TimeOfDay.getFieldType(TimeOfDay.java:464)
	at org.joda.time.chrono.BaseChronology.get(BaseChronology.java:59)
	at org.joda.time.base.BasePartial.<init>(BasePartial.java:111)
	at org.joda.time.TimeOfDay.<init>(TimeOfDay.java:257)
	at org.joda.time.TimeOfDay.fromMillisOfDay(TimeOfDay.java:185)
	at org.joda.time.TestTimeOfDay_Constructors.testFactoryMillisOfDay_long1_Chronology(TestTimeOfDay_Constructors.java:154)

testPropertyCompareToHour(org.joda.time.TestTimeOfDay_Properties)  Time elapsed: 0 sec  <<< ERROR!
java.lang.ArrayIndexOutOfBoundsException: -1
	at org.joda.time.TimeOfDay.getFieldType(TimeOfDay.java:464)
	at org.joda.time.chrono.BaseChronology.get(BaseChronology.java:59)
	at org.joda.time.base.BasePartial.<init>(BasePartial.java:111)
	at org.joda.time.base.BasePartial.<init>(BasePartial.java:93)
	at org.joda.time.TimeOfDay.<init>(TimeOfDay.java:242)
	at org.joda.time.TestTimeOfDay_Properties.testPropertyCompareToHour(TestTimeOfDay_Properties.java:210)

testPropertyCompareToMinute(org.joda.time.TestTimeOfDay_Properties)  Time elapsed: 0 sec  <<< ERROR!
java.lang.ArrayIndexOutOfBoundsException: -1
	at org.joda.time.TimeOfDay.getFieldType(TimeOfDay.java:464)
	at org.joda.time.chrono.BaseChronology.get(BaseChronology.java:59)
	at org.joda.time.base.BasePartial.<init>(BasePartial.java:111)
	at org.joda.time.base.BasePartial.<init>(BasePartial.java:93)
	at org.joda.time.TimeOfDay.<init>(TimeOfDay.java:242)
	at org.joda.time.TestTimeOfDay_Properties.testPropertyCompareToMinute(TestTimeOfDay_Properties.java:382)

testPropertyCompareToSecond(org.joda.time.TestTimeOfDay_Properties)  Time elapsed: 0 sec  <<< ERROR!
java.lang.ArrayIndexOutOfBoundsException: -1
	at org.joda.time.TimeOfDay.getFieldType(TimeOfDay.java:464)
	at org.joda.time.chrono.BaseChronology.get(BaseChronology.java:59)
	at org.joda.time.base.BasePartial.<init>(BasePartial.java:111)
	at org.joda.time.base.BasePartial.<init>(BasePartial.java:93)
	at org.joda.time.TimeOfDay.<init>(TimeOfDay.java:242)
	at org.joda.time.TestTimeOfDay_Properties.testPropertyCompareToSecond(TestTimeOfDay_Properties.java:548)

testPropertyCompareToMilli(org.joda.time.TestTimeOfDay_Properties)  Time elapsed: 0 sec  <<< ERROR!
java.lang.ArrayIndexOutOfBoundsException: -1
	at org.joda.time.TimeOfDay.getFieldType(TimeOfDay.java:464)
	at org.joda.time.chrono.BaseChronology.get(BaseChronology.java:59)
	at org.joda.time.base.BasePartial.<init>(BasePartial.java:111)
	at org.joda.time.base.BasePartial.<init>(BasePartial.java:93)
	at org.joda.time.TimeOfDay.<init>(TimeOfDay.java:242)
	at org.joda.time.TestTimeOfDay_Properties.testPropertyCompareToMilli(TestTimeOfDay_Properties.java:708)

testCompareTo(org.joda.time.TestYearMonthDay_Basics)  Time elapsed: 0 sec  <<< ERROR!
java.lang.ArrayIndexOutOfBoundsException: -1
	at org.joda.time.TimeOfDay.getFieldType(TimeOfDay.java:464)
	at org.joda.time.chrono.BaseChronology.get(BaseChronology.java:59)
	at org.joda.time.base.BasePartial.<init>(BasePartial.java:111)
	at org.joda.time.base.BasePartial.<init>(BasePartial.java:65)
	at org.joda.time.TimeOfDay.<init>(TimeOfDay.java:199)
	at org.joda.time.TestYearMonthDay_Basics.testCompareTo(TestYearMonthDay_Basics.java:253)

testGet(org.joda.time.TestYearMonthDay_Basics)  Time elapsed: 0 sec  <<< ERROR!
java.lang.ArrayIndexOutOfBoundsException: -1
	at org.joda.time.YearMonthDay.getFieldType(YearMonthDay.java:351)
	at org.joda.time.chrono.BaseChronology.get(BaseChronology.java:59)
	at org.joda.time.base.BasePartial.<init>(BasePartial.java:111)
	at org.joda.time.base.BasePartial.<init>(BasePartial.java:65)
	at org.joda.time.YearMonthDay.<init>(YearMonthDay.java:153)
	at org.joda.time.TestYearMonthDay_Basics.testGet(TestYearMonthDay_Basics.java:85)

testIsSupported(org.joda.time.TestYearMonthDay_Basics)  Time elapsed: 0.001 sec  <<< ERROR!
java.lang.ArrayIndexOutOfBoundsException: -1
	at org.joda.time.YearMonthDay.getFieldType(YearMonthDay.java:351)
	at org.joda.time.chrono.BaseChronology.get(BaseChronology.java:59)
	at org.joda.time.base.BasePartial.<init>(BasePartial.java:111)
	at org.joda.time.base.BasePartial.<init>(BasePartial.java:79)
	at org.joda.time.YearMonthDay.<init>(YearMonthDay.java:182)
	at org.joda.time.TestYearMonthDay_Basics.testIsSupported(TestYearMonthDay_Basics.java:171)

testSize(org.joda.time.TestYearMonthDay_Basics)  Time elapsed: 0 sec  <<< ERROR!
java.lang.ArrayIndexOutOfBoundsException: -1
	at org.joda.time.YearMonthDay.getFieldType(YearMonthDay.java:351)
	at org.joda.time.chrono.BaseChronology.get(BaseChronology.java:59)
	at org.joda.time.base.BasePartial.<init>(BasePartial.java:111)
	at org.joda.time.base.BasePartial.<init>(BasePartial.java:65)
	at org.joda.time.YearMonthDay.<init>(YearMonthDay.java:153)
	at org.joda.time.TestYearMonthDay_Basics.testSize(TestYearMonthDay_Basics.java:100)

testGetFieldTypes(org.joda.time.TestYearMonthDay_Basics)  Time elapsed: 0 sec  <<< ERROR!
java.lang.ArrayIndexOutOfBoundsException: -1
	at org.joda.time.YearMonthDay.getFieldType(YearMonthDay.java:351)
	at org.joda.time.chrono.BaseChronology.get(BaseChronology.java:59)
	at org.joda.time.base.BasePartial.<init>(BasePartial.java:111)
	at org.joda.time.base.BasePartial.<init>(BasePartial.java:79)
	at org.joda.time.YearMonthDay.<init>(YearMonthDay.java:182)
	at org.joda.time.TestYearMonthDay_Basics.testGetFieldTypes(TestYearMonthDay_Basics.java:118)

testGetFields(org.joda.time.TestYearMonthDay_Basics)  Time elapsed: 0.001 sec  <<< ERROR!
java.lang.ArrayIndexOutOfBoundsException: -1
	at org.joda.time.YearMonthDay.getFieldType(YearMonthDay.java:351)
	at org.joda.time.chrono.BaseChronology.get(BaseChronology.java:59)
	at org.joda.time.base.BasePartial.<init>(BasePartial.java:111)
	at org.joda.time.base.BasePartial.<init>(BasePartial.java:79)
	at org.joda.time.YearMonthDay.<init>(YearMonthDay.java:182)
	at org.joda.time.TestYearMonthDay_Basics.testGetFields(TestYearMonthDay_Basics.java:140)

testGetValues(org.joda.time.TestYearMonthDay_Basics)  Time elapsed: 0 sec  <<< ERROR!
java.lang.ArrayIndexOutOfBoundsException: -1
	at org.joda.time.YearMonthDay.getFieldType(YearMonthDay.java:351)
	at org.joda.time.chrono.BaseChronology.get(BaseChronology.java:59)
	at org.joda.time.base.BasePartial.<init>(BasePartial.java:111)
	at org.joda.time.base.BasePartial.<init>(BasePartial.java:65)
	at org.joda.time.YearMonthDay.<init>(YearMonthDay.java:153)
	at org.joda.time.TestYearMonthDay_Basics.testGetValues(TestYearMonthDay_Basics.java:162)

testGetField(org.joda.time.TestYearMonthDay_Basics)  Time elapsed: 0.001 sec  <<< ERROR!
java.lang.ArrayIndexOutOfBoundsException: -1
	at org.joda.time.YearMonthDay.getFieldType(YearMonthDay.java:351)
	at org.joda.time.chrono.BaseChronology.get(BaseChronology.java:59)
	at org.joda.time.base.BasePartial.<init>(BasePartial.java:111)
	at org.joda.time.base.BasePartial.<init>(BasePartial.java:79)
	at org.joda.time.YearMonthDay.<init>(YearMonthDay.java:182)
	at org.joda.time.TestYearMonthDay_Basics.testGetField(TestYearMonthDay_Basics.java:127)

testGetValue(org.joda.time.TestYearMonthDay_Basics)  Time elapsed: 0 sec  <<< ERROR!
java.lang.ArrayIndexOutOfBoundsException: -1
	at org.joda.time.YearMonthDay.getFieldType(YearMonthDay.java:351)
	at org.joda.time.chrono.BaseChronology.get(BaseChronology.java:59)
	at org.joda.time.base.BasePartial.<init>(BasePartial.java:111)
	at org.joda.time.base.BasePartial.<init>(BasePartial.java:65)
	at org.joda.time.YearMonthDay.<init>(YearMonthDay.java:153)
	at org.joda.time.TestYearMonthDay_Basics.testGetValue(TestYearMonthDay_Basics.java:149)

testGetFieldType(org.joda.time.TestYearMonthDay_Basics)  Time elapsed: 0.001 sec  <<< ERROR!
java.lang.ArrayIndexOutOfBoundsException: -1
	at org.joda.time.YearMonthDay.getFieldType(YearMonthDay.java:351)
	at org.joda.time.chrono.BaseChronology.get(BaseChronology.java:59)
	at org.joda.time.base.BasePartial.<init>(BasePartial.java:111)
	at org.joda.time.base.BasePartial.<init>(BasePartial.java:79)
	at org.joda.time.YearMonthDay.<init>(YearMonthDay.java:182)
	at org.joda.time.TestYearMonthDay_Basics.testGetFieldType(TestYearMonthDay_Basics.java:105)

testConstructor(org.joda.time.TestYearMonthDay_Constructors)  Time elapsed: 0.001 sec  <<< ERROR!
java.lang.ArrayIndexOutOfBoundsException: -1
	at org.joda.time.YearMonthDay.getFieldType(YearMonthDay.java:351)
	at org.joda.time.chrono.BaseChronology.get(BaseChronology.java:59)
	at org.joda.time.base.BasePartial.<init>(BasePartial.java:111)
	at org.joda.time.base.BasePartial.<init>(BasePartial.java:65)
	at org.joda.time.YearMonthDay.<init>(YearMonthDay.java:153)
	at org.joda.time.TestYearMonthDay_Constructors.testConstructor(TestYearMonthDay_Constructors.java:110)

testConstructor_long1_Chronology(org.joda.time.TestYearMonthDay_Constructors)  Time elapsed: 0.001 sec  <<< ERROR!
java.lang.ArrayIndexOutOfBoundsException: -1
	at org.joda.time.YearMonthDay.getFieldType(YearMonthDay.java:351)
	at org.joda.time.chrono.BaseChronology.get(BaseChronology.java:59)
	at org.joda.time.base.BasePartial.<init>(BasePartial.java:111)
	at org.joda.time.YearMonthDay.<init>(YearMonthDay.java:211)
	at org.joda.time.TestYearMonthDay_Constructors.testConstructor_long1_Chronology(TestYearMonthDay_Constructors.java:202)

testConstructor_long2_Chronology(org.joda.time.TestYearMonthDay_Constructors)  Time elapsed: 0 sec  <<< ERROR!
java.lang.ArrayIndexOutOfBoundsException: -1
	at org.joda.time.YearMonthDay.getFieldType(YearMonthDay.java:351)
	at org.joda.time.chrono.BaseChronology.get(BaseChronology.java:59)
	at org.joda.time.base.BasePartial.<init>(BasePartial.java:111)
	at org.joda.time.YearMonthDay.<init>(YearMonthDay.java:211)
	at org.joda.time.TestYearMonthDay_Constructors.testConstructor_long2_Chronology(TestYearMonthDay_Constructors.java:213)

testConstructor_long_nullChronology(org.joda.time.TestYearMonthDay_Constructors)  Time elapsed: 0.001 sec  <<< ERROR!
java.lang.ArrayIndexOutOfBoundsException: -1
	at org.joda.time.YearMonthDay.getFieldType(YearMonthDay.java:351)
	at org.joda.time.chrono.BaseChronology.get(BaseChronology.java:59)
	at org.joda.time.base.BasePartial.<init>(BasePartial.java:111)
	at org.joda.time.YearMonthDay.<init>(YearMonthDay.java:211)
	at org.joda.time.TestYearMonthDay_Constructors.testConstructor_long_nullChronology(TestYearMonthDay_Constructors.java:224)

testConstructor_ObjectString1(org.joda.time.TestYearMonthDay_Constructors)  Time elapsed: 0 sec  <<< ERROR!
java.lang.ArrayIndexOutOfBoundsException: -1
	at org.joda.time.YearMonthDay.getFieldType(YearMonthDay.java:351)
	at org.joda.time.chrono.BaseChronology.get(BaseChronology.java:59)
	at org.joda.time.convert.StringConverter.getPartialValues(StringConverter.java:88)
	at org.joda.time.base.BasePartial.<init>(BasePartial.java:163)
	at org.joda.time.YearMonthDay.<init>(YearMonthDay.java:231)
	at org.joda.time.TestYearMonthDay_Constructors.testConstructor_ObjectString1(TestYearMonthDay_Constructors.java:250)

testConstructor_ObjectString2(org.joda.time.TestYearMonthDay_Constructors)  Time elapsed: 0.001 sec  <<< ERROR!
java.lang.ArrayIndexOutOfBoundsException: -1
	at org.joda.time.YearMonthDay.getFieldType(YearMonthDay.java:351)
	at org.joda.time.chrono.BaseChronology.get(BaseChronology.java:59)
	at org.joda.time.convert.StringConverter.getPartialValues(StringConverter.java:88)
	at org.joda.time.base.BasePartial.<init>(BasePartial.java:163)
	at org.joda.time.YearMonthDay.<init>(YearMonthDay.java:231)
	at org.joda.time.TestYearMonthDay_Constructors.testConstructor_ObjectString2(TestYearMonthDay_Constructors.java:258)

testConstructor_ObjectString3(org.joda.time.TestYearMonthDay_Constructors)  Time elapsed: 0.001 sec  <<< ERROR!
java.lang.ArrayIndexOutOfBoundsException: -1
	at org.joda.time.YearMonthDay.getFieldType(YearMonthDay.java:351)
	at org.joda.time.chrono.BaseChronology.get(BaseChronology.java:59)
	at org.joda.time.convert.StringConverter.getPartialValues(StringConverter.java:88)
	at org.joda.time.base.BasePartial.<init>(BasePartial.java:163)
	at org.joda.time.YearMonthDay.<init>(YearMonthDay.java:231)
	at org.joda.time.TestYearMonthDay_Constructors.testConstructor_ObjectString3(TestYearMonthDay_Constructors.java:266)

testConstructor_ObjectString4(org.joda.time.TestYearMonthDay_Constructors)  Time elapsed: 0.001 sec  <<< ERROR!
java.lang.ArrayIndexOutOfBoundsException: -1
	at org.joda.time.YearMonthDay.getFieldType(YearMonthDay.java:351)
	at org.joda.time.chrono.BaseChronology.get(BaseChronology.java:59)
	at org.joda.time.convert.StringConverter.getPartialValues(StringConverter.java:88)
	at org.joda.time.base.BasePartial.<init>(BasePartial.java:163)
	at org.joda.time.YearMonthDay.<init>(YearMonthDay.java:231)
	at org.joda.time.TestYearMonthDay_Constructors.testConstructor_ObjectString4(TestYearMonthDay_Constructors.java:274)

testConstructor_ObjectString5(org.joda.time.TestYearMonthDay_Constructors)  Time elapsed: 0 sec  <<< ERROR!
java.lang.ArrayIndexOutOfBoundsException: -1
	at org.joda.time.YearMonthDay.getFieldType(YearMonthDay.java:351)
	at org.joda.time.chrono.BaseChronology.get(BaseChronology.java:59)
	at org.joda.time.convert.StringConverter.getPartialValues(StringConverter.java:88)
	at org.joda.time.base.BasePartial.<init>(BasePartial.java:163)
	at org.joda.time.YearMonthDay.<init>(YearMonthDay.java:231)
	at org.joda.time.TestYearMonthDay_Constructors.testConstructor_ObjectString5(TestYearMonthDay_Constructors.java:282)

testConstructor_Object_Chronology(org.joda.time.TestYearMonthDay_Constructors)  Time elapsed: 0 sec  <<< ERROR!
java.lang.ArrayIndexOutOfBoundsException: -1
	at org.joda.time.YearMonthDay.getFieldType(YearMonthDay.java:351)
	at org.joda.time.chrono.BaseChronology.get(BaseChronology.java:59)
	at org.joda.time.convert.AbstractConverter.getPartialValues(AbstractConverter.java:102)
	at org.joda.time.convert.AbstractConverter.getPartialValues(AbstractConverter.java:123)
	at org.joda.time.base.BasePartial.<init>(BasePartial.java:163)
	at org.joda.time.YearMonthDay.<init>(YearMonthDay.java:256)
	at org.joda.time.TestYearMonthDay_Constructors.testConstructor_Object_Chronology(TestYearMonthDay_Constructors.java:331)

testConstructor_nullObject_Chronology(org.joda.time.TestYearMonthDay_Constructors)  Time elapsed: 0.001 sec  <<< ERROR!
java.lang.ArrayIndexOutOfBoundsException: -1
	at org.joda.time.YearMonthDay.getFieldType(YearMonthDay.java:351)
	at org.joda.time.chrono.BaseChronology.get(BaseChronology.java:59)
	at org.joda.time.convert.AbstractConverter.getPartialValues(AbstractConverter.java:102)
	at org.joda.time.convert.AbstractConverter.getPartialValues(AbstractConverter.java:123)
	at org.joda.time.base.BasePartial.<init>(BasePartial.java:163)
	at org.joda.time.YearMonthDay.<init>(YearMonthDay.java:256)
	at org.joda.time.TestYearMonthDay_Constructors.testConstructor_nullObject_Chronology(TestYearMonthDay_Constructors.java:342)

testConstructor_Object_nullChronology(org.joda.time.TestYearMonthDay_Constructors)  Time elapsed: 0 sec  <<< ERROR!
java.lang.ArrayIndexOutOfBoundsException: -1
	at org.joda.time.YearMonthDay.getFieldType(YearMonthDay.java:351)
	at org.joda.time.chrono.BaseChronology.get(BaseChronology.java:59)
	at org.joda.time.convert.AbstractConverter.getPartialValues(AbstractConverter.java:102)
	at org.joda.time.convert.AbstractConverter.getPartialValues(AbstractConverter.java:123)
	at org.joda.time.base.BasePartial.<init>(BasePartial.java:163)
	at org.joda.time.YearMonthDay.<init>(YearMonthDay.java:256)
	at org.joda.time.TestYearMonthDay_Constructors.testConstructor_Object_nullChronology(TestYearMonthDay_Constructors.java:354)

testConstructor_nullObject_nullChronology(org.joda.time.TestYearMonthDay_Constructors)  Time elapsed: 0.001 sec  <<< ERROR!
java.lang.ArrayIndexOutOfBoundsException: -1
	at org.joda.time.YearMonthDay.getFieldType(YearMonthDay.java:351)
	at org.joda.time.chrono.BaseChronology.get(BaseChronology.java:59)
	at org.joda.time.convert.AbstractConverter.getPartialValues(AbstractConverter.java:102)
	at org.joda.time.convert.AbstractConverter.getPartialValues(AbstractConverter.java:123)
	at org.joda.time.base.BasePartial.<init>(BasePartial.java:163)
	at org.joda.time.YearMonthDay.<init>(YearMonthDay.java:256)
	at org.joda.time.TestYearMonthDay_Constructors.testConstructor_nullObject_nullChronology(TestYearMonthDay_Constructors.java:365)

testConstructor_long1(org.joda.time.TestYearMonthDay_Constructors)  Time elapsed: 0.001 sec  <<< ERROR!
java.lang.ArrayIndexOutOfBoundsException: -1
	at org.joda.time.YearMonthDay.getFieldType(YearMonthDay.java:351)
	at org.joda.time.chrono.BaseChronology.get(BaseChronology.java:59)
	at org.joda.time.base.BasePartial.<init>(BasePartial.java:111)
	at org.joda.time.base.BasePartial.<init>(BasePartial.java:93)
	at org.joda.time.YearMonthDay.<init>(YearMonthDay.java:196)
	at org.joda.time.TestYearMonthDay_Constructors.testConstructor_long1(TestYearMonthDay_Constructors.java:180)

testConstructor_long2(org.joda.time.TestYearMonthDay_Constructors)  Time elapsed: 0 sec  <<< ERROR!
java.lang.ArrayIndexOutOfBoundsException: -1
	at org.joda.time.YearMonthDay.getFieldType(YearMonthDay.java:351)
	at org.joda.time.chrono.BaseChronology.get(BaseChronology.java:59)
	at org.joda.time.base.BasePartial.<init>(BasePartial.java:111)
	at org.joda.time.base.BasePartial.<init>(BasePartial.java:93)
	at org.joda.time.YearMonthDay.<init>(YearMonthDay.java:196)
	at org.joda.time.TestYearMonthDay_Constructors.testConstructor_long2(TestYearMonthDay_Constructors.java:191)

testConstructor_Object(org.joda.time.TestYearMonthDay_Constructors)  Time elapsed: 0.001 sec  <<< ERROR!
java.lang.ArrayIndexOutOfBoundsException: -1
	at org.joda.time.YearMonthDay.getFieldType(YearMonthDay.java:351)
	at org.joda.time.chrono.BaseChronology.get(BaseChronology.java:59)
	at org.joda.time.convert.AbstractConverter.getPartialValues(AbstractConverter.java:102)
	at org.joda.time.convert.AbstractConverter.getPartialValues(AbstractConverter.java:123)
	at org.joda.time.base.BasePartial.<init>(BasePartial.java:163)
	at org.joda.time.YearMonthDay.<init>(YearMonthDay.java:231)
	at org.joda.time.TestYearMonthDay_Constructors.testConstructor_Object(TestYearMonthDay_Constructors.java:234)

testConstructor_nullObject(org.joda.time.TestYearMonthDay_Constructors)  Time elapsed: 0 sec  <<< ERROR!
java.lang.ArrayIndexOutOfBoundsException: -1
	at org.joda.time.YearMonthDay.getFieldType(YearMonthDay.java:351)
	at org.joda.time.chrono.BaseChronology.get(BaseChronology.java:59)
	at org.joda.time.convert.AbstractConverter.getPartialValues(AbstractConverter.java:102)
	at org.joda.time.convert.AbstractConverter.getPartialValues(AbstractConverter.java:123)
	at org.joda.time.base.BasePartial.<init>(BasePartial.java:163)
	at org.joda.time.YearMonthDay.<init>(YearMonthDay.java:231)
	at org.joda.time.TestYearMonthDay_Constructors.testConstructor_nullObject(TestYearMonthDay_Constructors.java:242)

testConstructor_DateTimeZone(org.joda.time.TestYearMonthDay_Constructors)  Time elapsed: 0.001 sec  <<< ERROR!
java.lang.ArrayIndexOutOfBoundsException: -1
	at org.joda.time.YearMonthDay.getFieldType(YearMonthDay.java:351)
	at org.joda.time.chrono.BaseChronology.get(BaseChronology.java:59)
	at org.joda.time.base.BasePartial.<init>(BasePartial.java:111)
	at org.joda.time.base.BasePartial.<init>(BasePartial.java:79)
	at org.joda.time.YearMonthDay.<init>(YearMonthDay.java:168)
	at org.joda.time.TestYearMonthDay_Constructors.testConstructor_DateTimeZone(TestYearMonthDay_Constructors.java:125)

testConstructor_nullDateTimeZone(org.joda.time.TestYearMonthDay_Constructors)  Time elapsed: 0.001 sec  <<< ERROR!
java.lang.ArrayIndexOutOfBoundsException: -1
	at org.joda.time.YearMonthDay.getFieldType(YearMonthDay.java:351)
	at org.joda.time.chrono.BaseChronology.get(BaseChronology.java:59)
	at org.joda.time.base.BasePartial.<init>(BasePartial.java:111)
	at org.joda.time.base.BasePartial.<init>(BasePartial.java:79)
	at org.joda.time.YearMonthDay.<init>(YearMonthDay.java:168)
	at org.joda.time.TestYearMonthDay_Constructors.testConstructor_nullDateTimeZone(TestYearMonthDay_Constructors.java:146)

testConstructor_Chronology(org.joda.time.TestYearMonthDay_Constructors)  Time elapsed: 0 sec  <<< ERROR!
java.lang.ArrayIndexOutOfBoundsException: -1
	at org.joda.time.YearMonthDay.getFieldType(YearMonthDay.java:351)
	at org.joda.time.chrono.BaseChronology.get(BaseChronology.java:59)
	at org.joda.time.base.BasePartial.<init>(BasePartial.java:111)
	at org.joda.time.base.BasePartial.<init>(BasePartial.java:79)
	at org.joda.time.YearMonthDay.<init>(YearMonthDay.java:182)
	at org.joda.time.TestYearMonthDay_Constructors.testConstructor_Chronology(TestYearMonthDay_Constructors.java:157)

testConstructor_nullChronology(org.joda.time.TestYearMonthDay_Constructors)  Time elapsed: 0.001 sec  <<< ERROR!
java.lang.ArrayIndexOutOfBoundsException: -1
	at org.joda.time.YearMonthDay.getFieldType(YearMonthDay.java:351)
	at org.joda.time.chrono.BaseChronology.get(BaseChronology.java:59)
	at org.joda.time.base.BasePartial.<init>(BasePartial.java:111)
	at org.joda.time.base.BasePartial.<init>(BasePartial.java:79)
	at org.joda.time.YearMonthDay.<init>(YearMonthDay.java:182)
	at org.joda.time.TestYearMonthDay_Constructors.testConstructor_nullChronology(TestYearMonthDay_Constructors.java:168)

testPropertyCompareToYear(org.joda.time.TestYearMonthDay_Properties)  Time elapsed: 0 sec  <<< ERROR!
java.lang.ArrayIndexOutOfBoundsException: -1
	at org.joda.time.YearMonthDay.getFieldType(YearMonthDay.java:351)
	at org.joda.time.chrono.BaseChronology.get(BaseChronology.java:59)
	at org.joda.time.base.BasePartial.<init>(BasePartial.java:111)
	at org.joda.time.base.BasePartial.<init>(BasePartial.java:93)
	at org.joda.time.YearMonthDay.<init>(YearMonthDay.java:196)
	at org.joda.time.TestYearMonthDay_Properties.testPropertyCompareToYear(TestYearMonthDay_Properties.java:173)

testPropertyCompareToMonth(org.joda.time.TestYearMonthDay_Properties)  Time elapsed: 0.001 sec  <<< ERROR!
java.lang.ArrayIndexOutOfBoundsException: -1
	at org.joda.time.YearMonthDay.getFieldType(YearMonthDay.java:351)
	at org.joda.time.chrono.BaseChronology.get(BaseChronology.java:59)
	at org.joda.time.base.BasePartial.<init>(BasePartial.java:111)
	at org.joda.time.base.BasePartial.<init>(BasePartial.java:93)
	at org.joda.time.YearMonthDay.<init>(YearMonthDay.java:196)
	at org.joda.time.TestYearMonthDay_Properties.testPropertyCompareToMonth(TestYearMonthDay_Properties.java:318)

testPropertyCompareToDay(org.joda.time.TestYearMonthDay_Properties)  Time elapsed: 0.001 sec  <<< ERROR!
java.lang.ArrayIndexOutOfBoundsException: -1
	at org.joda.time.YearMonthDay.getFieldType(YearMonthDay.java:351)
	at org.joda.time.chrono.BaseChronology.get(BaseChronology.java:59)
	at org.joda.time.base.BasePartial.<init>(BasePartial.java:111)
	at org.joda.time.base.BasePartial.<init>(BasePartial.java:93)
	at org.joda.time.YearMonthDay.<init>(YearMonthDay.java:196)
	at org.joda.time.TestYearMonthDay_Properties.testPropertyCompareToDay(TestYearMonthDay_Properties.java:474)

testPropertyAddMonth(org.joda.time.TestYearMonthDay_Properties)  Time elapsed: 0 sec  <<< ERROR!
java.lang.ArrayIndexOutOfBoundsException: -1
	at org.joda.time.YearMonthDay.getFieldType(YearMonthDay.java:351)
	at org.joda.time.chrono.BaseChronology.get(BaseChronology.java:59)
	at org.joda.time.chrono.BasicMonthOfYearDateTimeField.add(BasicMonthOfYearDateTimeField.java:222)
	at org.joda.time.YearMonthDay$Property.addToCopy(YearMonthDay.java:1011)
	at org.joda.time.TestYearMonthDay_Properties.testPropertyAddMonth(TestYearMonthDay_Properties.java:227)

testPropertyAddDay(org.joda.time.TestYearMonthDay_Properties)  Time elapsed: 0.001 sec  <<< ERROR!
java.lang.ArrayIndexOutOfBoundsException: -1
	at org.joda.time.YearMonthDay.getFieldType(YearMonthDay.java:351)
	at org.joda.time.chrono.BaseChronology.get(BaseChronology.java:59)
	at org.joda.time.chrono.BasicMonthOfYearDateTimeField.add(BasicMonthOfYearDateTimeField.java:222)
	at org.joda.time.field.BaseDateTimeField.add(BaseDateTimeField.java:324)
	at org.joda.time.YearMonthDay$Property.addToCopy(YearMonthDay.java:1011)
	at org.joda.time.TestYearMonthDay_Properties.testPropertyAddDay(TestYearMonthDay_Properties.java:382)

testGet(org.joda.time.TestYearMonth_Basics)  Time elapsed: 0.001 sec  <<< ERROR!
java.lang.ArrayIndexOutOfBoundsException: -1
	at org.joda.time.YearMonth.getFieldType(YearMonth.java:418)
	at org.joda.time.chrono.BaseChronology.get(BaseChronology.java:59)
	at org.joda.time.base.BasePartial.<init>(BasePartial.java:111)
	at org.joda.time.base.BasePartial.<init>(BasePartial.java:65)
	at org.joda.time.YearMonth.<init>(YearMonth.java:213)
	at org.joda.time.TestYearMonth_Basics.testGet(TestYearMonth_Basics.java:89)

testIsSupported(org.joda.time.TestYearMonth_Basics)  Time elapsed: 0 sec  <<< ERROR!
java.lang.ArrayIndexOutOfBoundsException: -1
	at org.joda.time.YearMonth.getFieldType(YearMonth.java:418)
	at org.joda.time.chrono.BaseChronology.get(BaseChronology.java:59)
	at org.joda.time.base.BasePartial.<init>(BasePartial.java:111)
	at org.joda.time.base.BasePartial.<init>(BasePartial.java:79)
	at org.joda.time.YearMonth.<init>(YearMonth.java:243)
	at org.joda.time.TestYearMonth_Basics.testIsSupported(TestYearMonth_Basics.java:171)

testSize(org.joda.time.TestYearMonth_Basics)  Time elapsed: 0.001 sec  <<< ERROR!
java.lang.ArrayIndexOutOfBoundsException: -1
	at org.joda.time.YearMonth.getFieldType(YearMonth.java:418)
	at org.joda.time.chrono.BaseChronology.get(BaseChronology.java:59)
	at org.joda.time.base.BasePartial.<init>(BasePartial.java:111)
	at org.joda.time.base.BasePartial.<init>(BasePartial.java:65)
	at org.joda.time.YearMonth.<init>(YearMonth.java:213)
	at org.joda.time.TestYearMonth_Basics.testSize(TestYearMonth_Basics.java:103)

testGetFieldTypes(org.joda.time.TestYearMonth_Basics)  Time elapsed: 0.001 sec  <<< ERROR!
java.lang.ArrayIndexOutOfBoundsException: -1
	at org.joda.time.YearMonth.getFieldType(YearMonth.java:418)
	at org.joda.time.chrono.BaseChronology.get(BaseChronology.java:59)
	at org.joda.time.base.BasePartial.<init>(BasePartial.java:111)
	at org.joda.time.base.BasePartial.<init>(BasePartial.java:79)
	at org.joda.time.YearMonth.<init>(YearMonth.java:243)
	at org.joda.time.TestYearMonth_Basics.testGetFieldTypes(TestYearMonth_Basics.java:120)

testGetFields(org.joda.time.TestYearMonth_Basics)  Time elapsed: 0.001 sec  <<< ERROR!
java.lang.ArrayIndexOutOfBoundsException: -1
	at org.joda.time.YearMonth.getFieldType(YearMonth.java:418)
	at org.joda.time.chrono.BaseChronology.get(BaseChronology.java:59)
	at org.joda.time.base.BasePartial.<init>(BasePartial.java:111)
	at org.joda.time.base.BasePartial.<init>(BasePartial.java:79)
	at org.joda.time.YearMonth.<init>(YearMonth.java:243)
	at org.joda.time.TestYearMonth_Basics.testGetFields(TestYearMonth_Basics.java:141)

testGetValues(org.joda.time.TestYearMonth_Basics)  Time elapsed: 0 sec  <<< ERROR!
java.lang.ArrayIndexOutOfBoundsException: -1
	at org.joda.time.YearMonth.getFieldType(YearMonth.java:418)
	at org.joda.time.chrono.BaseChronology.get(BaseChronology.java:59)
	at org.joda.time.base.BasePartial.<init>(BasePartial.java:111)
	at org.joda.time.base.BasePartial.<init>(BasePartial.java:65)
	at org.joda.time.YearMonth.<init>(YearMonth.java:213)
	at org.joda.time.TestYearMonth_Basics.testGetValues(TestYearMonth_Basics.java:162)

testGetField(org.joda.time.TestYearMonth_Basics)  Time elapsed: 0.001 sec  <<< ERROR!
java.lang.ArrayIndexOutOfBoundsException: -1
	at org.joda.time.YearMonth.getFieldType(YearMonth.java:418)
	at org.joda.time.chrono.BaseChronology.get(BaseChronology.java:59)
	at org.joda.time.base.BasePartial.<init>(BasePartial.java:111)
	at org.joda.time.base.BasePartial.<init>(BasePartial.java:79)
	at org.joda.time.YearMonth.<init>(YearMonth.java:243)
	at org.joda.time.TestYearMonth_Basics.testGetField(TestYearMonth_Basics.java:129)

testGetValue(org.joda.time.TestYearMonth_Basics)  Time elapsed: 0.001 sec  <<< ERROR!
java.lang.ArrayIndexOutOfBoundsException: -1
	at org.joda.time.YearMonth.getFieldType(YearMonth.java:418)
	at org.joda.time.chrono.BaseChronology.get(BaseChronology.java:59)
	at org.joda.time.base.BasePartial.<init>(BasePartial.java:111)
	at org.joda.time.base.BasePartial.<init>(BasePartial.java:65)
	at org.joda.time.YearMonth.<init>(YearMonth.java:213)
	at org.joda.time.TestYearMonth_Basics.testGetValue(TestYearMonth_Basics.java:150)

testGetFieldType(org.joda.time.TestYearMonth_Basics)  Time elapsed: 0 sec  <<< ERROR!
java.lang.ArrayIndexOutOfBoundsException: -1
	at org.joda.time.YearMonth.getFieldType(YearMonth.java:418)
	at org.joda.time.chrono.BaseChronology.get(BaseChronology.java:59)
	at org.joda.time.base.BasePartial.<init>(BasePartial.java:111)
	at org.joda.time.base.BasePartial.<init>(BasePartial.java:79)
	at org.joda.time.YearMonth.<init>(YearMonth.java:243)
	at org.joda.time.TestYearMonth_Basics.testGetFieldType(TestYearMonth_Basics.java:108)

testConstructor(org.joda.time.TestYearMonth_Constructors)  Time elapsed: 0.001 sec  <<< ERROR!
java.lang.ArrayIndexOutOfBoundsException: -1
	at org.joda.time.YearMonth.getFieldType(YearMonth.java:418)
	at org.joda.time.chrono.BaseChronology.get(BaseChronology.java:59)
	at org.joda.time.base.BasePartial.<init>(BasePartial.java:111)
	at org.joda.time.base.BasePartial.<init>(BasePartial.java:65)
	at org.joda.time.YearMonth.<init>(YearMonth.java:213)
	at org.joda.time.TestYearMonth_Constructors.testConstructor(TestYearMonth_Constructors.java:122)

testConstructor_long1_Chronology(org.joda.time.TestYearMonth_Constructors)  Time elapsed: 0 sec  <<< ERROR!
java.lang.ArrayIndexOutOfBoundsException: -1
	at org.joda.time.YearMonth.getFieldType(YearMonth.java:418)
	at org.joda.time.chrono.BaseChronology.get(BaseChronology.java:59)
	at org.joda.time.base.BasePartial.<init>(BasePartial.java:111)
	at org.joda.time.YearMonth.<init>(YearMonth.java:272)
	at org.joda.time.TestYearMonth_Constructors.testConstructor_long1_Chronology(TestYearMonth_Constructors.java:210)

testConstructor_long2_Chronology(org.joda.time.TestYearMonth_Constructors)  Time elapsed: 0.001 sec  <<< ERROR!
java.lang.ArrayIndexOutOfBoundsException: -1
	at org.joda.time.YearMonth.getFieldType(YearMonth.java:418)
	at org.joda.time.chrono.BaseChronology.get(BaseChronology.java:59)
	at org.joda.time.base.BasePartial.<init>(BasePartial.java:111)
	at org.joda.time.YearMonth.<init>(YearMonth.java:272)
	at org.joda.time.TestYearMonth_Constructors.testConstructor_long2_Chronology(TestYearMonth_Constructors.java:220)

testConstructor_long_nullChronology(org.joda.time.TestYearMonth_Constructors)  Time elapsed: 0 sec  <<< ERROR!
java.lang.ArrayIndexOutOfBoundsException: -1
	at org.joda.time.YearMonth.getFieldType(YearMonth.java:418)
	at org.joda.time.chrono.BaseChronology.get(BaseChronology.java:59)
	at org.joda.time.base.BasePartial.<init>(BasePartial.java:111)
	at org.joda.time.YearMonth.<init>(YearMonth.java:272)
	at org.joda.time.TestYearMonth_Constructors.testConstructor_long_nullChronology(TestYearMonth_Constructors.java:230)

testConstructor_ObjectString1(org.joda.time.TestYearMonth_Constructors)  Time elapsed: 0.001 sec  <<< ERROR!
java.lang.ArrayIndexOutOfBoundsException: -1
	at org.joda.time.YearMonth.getFieldType(YearMonth.java:418)
	at org.joda.time.chrono.BaseChronology.get(BaseChronology.java:59)
	at org.joda.time.convert.StringConverter.getPartialValues(StringConverter.java:88)
	at org.joda.time.base.BasePartial.<init>(BasePartial.java:163)
	at org.joda.time.YearMonth.<init>(YearMonth.java:289)
	at org.joda.time.TestYearMonth_Constructors.testConstructor_ObjectString1(TestYearMonth_Constructors.java:253)

testConstructor_ObjectString5(org.joda.time.TestYearMonth_Constructors)  Time elapsed: 0.001 sec  <<< ERROR!
java.lang.ArrayIndexOutOfBoundsException: -1
	at org.joda.time.YearMonth.getFieldType(YearMonth.java:418)
	at org.joda.time.chrono.BaseChronology.get(BaseChronology.java:59)
	at org.joda.time.convert.StringConverter.getPartialValues(StringConverter.java:88)
	at org.joda.time.base.BasePartial.<init>(BasePartial.java:163)
	at org.joda.time.YearMonth.<init>(YearMonth.java:289)
	at org.joda.time.TestYearMonth_Constructors.testConstructor_ObjectString5(TestYearMonth_Constructors.java:260)

testConstructor_Object_Chronology(org.joda.time.TestYearMonth_Constructors)  Time elapsed: 0.001 sec  <<< ERROR!
java.lang.ArrayIndexOutOfBoundsException: -1
	at org.joda.time.YearMonth.getFieldType(YearMonth.java:418)
	at org.joda.time.chrono.BaseChronology.get(BaseChronology.java:59)
	at org.joda.time.convert.AbstractConverter.getPartialValues(AbstractConverter.java:102)
	at org.joda.time.convert.AbstractConverter.getPartialValues(AbstractConverter.java:123)
	at org.joda.time.base.BasePartial.<init>(BasePartial.java:163)
	at org.joda.time.YearMonth.<init>(YearMonth.java:311)
	at org.joda.time.TestYearMonth_Constructors.testConstructor_Object_Chronology(TestYearMonth_Constructors.java:308)

testConstructor_nullObject_Chronology(org.joda.time.TestYearMonth_Constructors)  Time elapsed: 0 sec  <<< ERROR!
java.lang.ArrayIndexOutOfBoundsException: -1
	at org.joda.time.YearMonth.getFieldType(YearMonth.java:418)
	at org.joda.time.chrono.BaseChronology.get(BaseChronology.java:59)
	at org.joda.time.convert.AbstractConverter.getPartialValues(AbstractConverter.java:102)
	at org.joda.time.convert.AbstractConverter.getPartialValues(AbstractConverter.java:123)
	at org.joda.time.base.BasePartial.<init>(BasePartial.java:163)
	at org.joda.time.YearMonth.<init>(YearMonth.java:311)
	at org.joda.time.TestYearMonth_Constructors.testConstructor_nullObject_Chronology(TestYearMonth_Constructors.java:318)

testConstructor_Object_nullChronology(org.joda.time.TestYearMonth_Constructors)  Time elapsed: 0.001 sec  <<< ERROR!
java.lang.ArrayIndexOutOfBoundsException: -1
	at org.joda.time.YearMonth.getFieldType(YearMonth.java:418)
	at org.joda.time.chrono.BaseChronology.get(BaseChronology.java:59)
	at org.joda.time.convert.AbstractConverter.getPartialValues(AbstractConverter.java:102)
	at org.joda.time.convert.AbstractConverter.getPartialValues(AbstractConverter.java:123)
	at org.joda.time.base.BasePartial.<init>(BasePartial.java:163)
	at org.joda.time.YearMonth.<init>(YearMonth.java:311)
	at org.joda.time.TestYearMonth_Constructors.testConstructor_Object_nullChronology(TestYearMonth_Constructors.java:329)

testConstructor_nullObject_nullChronology(org.joda.time.TestYearMonth_Constructors)  Time elapsed: 0.001 sec  <<< ERROR!
java.lang.ArrayIndexOutOfBoundsException: -1
	at org.joda.time.YearMonth.getFieldType(YearMonth.java:418)
	at org.joda.time.chrono.BaseChronology.get(BaseChronology.java:59)
	at org.joda.time.convert.AbstractConverter.getPartialValues(AbstractConverter.java:102)
	at org.joda.time.convert.AbstractConverter.getPartialValues(AbstractConverter.java:123)
	at org.joda.time.base.BasePartial.<init>(BasePartial.java:163)
	at org.joda.time.YearMonth.<init>(YearMonth.java:311)
	at org.joda.time.TestYearMonth_Constructors.testConstructor_nullObject_nullChronology(TestYearMonth_Constructors.java:339)

testConstructor_long1(org.joda.time.TestYearMonth_Constructors)  Time elapsed: 0 sec  <<< ERROR!
java.lang.ArrayIndexOutOfBoundsException: -1
	at org.joda.time.YearMonth.getFieldType(YearMonth.java:418)
	at org.joda.time.chrono.BaseChronology.get(BaseChronology.java:59)
	at org.joda.time.base.BasePartial.<init>(BasePartial.java:111)
	at org.joda.time.base.BasePartial.<init>(BasePartial.java:93)
	at org.joda.time.YearMonth.<init>(YearMonth.java:257)
	at org.joda.time.TestYearMonth_Constructors.testConstructor_long1(TestYearMonth_Constructors.java:190)

testConstructor_long2(org.joda.time.TestYearMonth_Constructors)  Time elapsed: 0.001 sec  <<< ERROR!
java.lang.ArrayIndexOutOfBoundsException: -1
	at org.joda.time.YearMonth.getFieldType(YearMonth.java:418)
	at org.joda.time.chrono.BaseChronology.get(BaseChronology.java:59)
	at org.joda.time.base.BasePartial.<init>(BasePartial.java:111)
	at org.joda.time.base.BasePartial.<init>(BasePartial.java:93)
	at org.joda.time.YearMonth.<init>(YearMonth.java:257)
	at org.joda.time.TestYearMonth_Constructors.testConstructor_long2(TestYearMonth_Constructors.java:200)

testConstructor_Object(org.joda.time.TestYearMonth_Constructors)  Time elapsed: 0 sec  <<< ERROR!
java.lang.ArrayIndexOutOfBoundsException: -1
	at org.joda.time.YearMonth.getFieldType(YearMonth.java:418)
	at org.joda.time.chrono.BaseChronology.get(BaseChronology.java:59)
	at org.joda.time.convert.AbstractConverter.getPartialValues(AbstractConverter.java:102)
	at org.joda.time.convert.AbstractConverter.getPartialValues(AbstractConverter.java:123)
	at org.joda.time.base.BasePartial.<init>(BasePartial.java:163)
	at org.joda.time.YearMonth.<init>(YearMonth.java:289)
	at org.joda.time.TestYearMonth_Constructors.testConstructor_Object(TestYearMonth_Constructors.java:239)

testConstructor_nullObject(org.joda.time.TestYearMonth_Constructors)  Time elapsed: 0.001 sec  <<< ERROR!
java.lang.ArrayIndexOutOfBoundsException: -1
	at org.joda.time.YearMonth.getFieldType(YearMonth.java:418)
	at org.joda.time.chrono.BaseChronology.get(BaseChronology.java:59)
	at org.joda.time.convert.AbstractConverter.getPartialValues(AbstractConverter.java:102)
	at org.joda.time.convert.AbstractConverter.getPartialValues(AbstractConverter.java:123)
	at org.joda.time.base.BasePartial.<init>(BasePartial.java:163)
	at org.joda.time.YearMonth.<init>(YearMonth.java:289)
	at org.joda.time.TestYearMonth_Constructors.testConstructor_nullObject(TestYearMonth_Constructors.java:246)

testConstructor_DateTimeZone(org.joda.time.TestYearMonth_Constructors)  Time elapsed: 0.001 sec  <<< ERROR!
java.lang.ArrayIndexOutOfBoundsException: -1
	at org.joda.time.YearMonth.getFieldType(YearMonth.java:418)
	at org.joda.time.chrono.BaseChronology.get(BaseChronology.java:59)
	at org.joda.time.base.BasePartial.<init>(BasePartial.java:111)
	at org.joda.time.base.BasePartial.<init>(BasePartial.java:79)
	at org.joda.time.YearMonth.<init>(YearMonth.java:228)
	at org.joda.time.TestYearMonth_Constructors.testConstructor_DateTimeZone(TestYearMonth_Constructors.java:137)

testConstructor_nullDateTimeZone(org.joda.time.TestYearMonth_Constructors)  Time elapsed: 0.001 sec  <<< ERROR!
java.lang.ArrayIndexOutOfBoundsException: -1
	at org.joda.time.YearMonth.getFieldType(YearMonth.java:418)
	at org.joda.time.chrono.BaseChronology.get(BaseChronology.java:59)
	at org.joda.time.base.BasePartial.<init>(BasePartial.java:111)
	at org.joda.time.base.BasePartial.<init>(BasePartial.java:79)
	at org.joda.time.YearMonth.<init>(YearMonth.java:228)
	at org.joda.time.TestYearMonth_Constructors.testConstructor_nullDateTimeZone(TestYearMonth_Constructors.java:158)

testConstructor_Chronology(org.joda.time.TestYearMonth_Constructors)  Time elapsed: 0.001 sec  <<< ERROR!
java.lang.ArrayIndexOutOfBoundsException: -1
	at org.joda.time.YearMonth.getFieldType(YearMonth.java:418)
	at org.joda.time.chrono.BaseChronology.get(BaseChronology.java:59)
	at org.joda.time.base.BasePartial.<init>(BasePartial.java:111)
	at org.joda.time.base.BasePartial.<init>(BasePartial.java:79)
	at org.joda.time.YearMonth.<init>(YearMonth.java:243)
	at org.joda.time.TestYearMonth_Constructors.testConstructor_Chronology(TestYearMonth_Constructors.java:168)

testConstructor_nullChronology(org.joda.time.TestYearMonth_Constructors)  Time elapsed: 0 sec  <<< ERROR!
java.lang.ArrayIndexOutOfBoundsException: -1
	at org.joda.time.YearMonth.getFieldType(YearMonth.java:418)
	at org.joda.time.chrono.BaseChronology.get(BaseChronology.java:59)
	at org.joda.time.base.BasePartial.<init>(BasePartial.java:111)
	at org.joda.time.base.BasePartial.<init>(BasePartial.java:79)
	at org.joda.time.YearMonth.<init>(YearMonth.java:243)
	at org.joda.time.TestYearMonth_Constructors.testConstructor_nullChronology(TestYearMonth_Constructors.java:179)

testPropertyCompareToYear(org.joda.time.TestYearMonth_Properties)  Time elapsed: 0.001 sec  <<< ERROR!
java.lang.ArrayIndexOutOfBoundsException: -1
	at org.joda.time.YearMonth.getFieldType(YearMonth.java:418)
	at org.joda.time.chrono.BaseChronology.get(BaseChronology.java:59)
	at org.joda.time.base.BasePartial.<init>(BasePartial.java:111)
	at org.joda.time.base.BasePartial.<init>(BasePartial.java:93)
	at org.joda.time.YearMonth.<init>(YearMonth.java:257)
	at org.joda.time.TestYearMonth_Properties.testPropertyCompareToYear(TestYearMonth_Properties.java:172)

testPropertyCompareToMonth(org.joda.time.TestYearMonth_Properties)  Time elapsed: 0 sec  <<< ERROR!
java.lang.ArrayIndexOutOfBoundsException: -1
	at org.joda.time.YearMonth.getFieldType(YearMonth.java:418)
	at org.joda.time.chrono.BaseChronology.get(BaseChronology.java:59)
	at org.joda.time.base.BasePartial.<init>(BasePartial.java:111)
	at org.joda.time.base.BasePartial.<init>(BasePartial.java:93)
	at org.joda.time.YearMonth.<init>(YearMonth.java:257)
	at org.joda.time.TestYearMonth_Properties.testPropertyCompareToMonth(TestYearMonth_Properties.java:285)

testPropertyAddMonth(org.joda.time.TestYearMonth_Properties)  Time elapsed: 0 sec  <<< ERROR!
java.lang.ArrayIndexOutOfBoundsException: -1
	at org.joda.time.YearMonth.getFieldType(YearMonth.java:418)
	at org.joda.time.chrono.BaseChronology.get(BaseChronology.java:59)
	at org.joda.time.chrono.BasicMonthOfYearDateTimeField.add(BasicMonthOfYearDateTimeField.java:222)
	at org.joda.time.YearMonth$Property.addToCopy(YearMonth.java:914)
	at org.joda.time.TestYearMonth_Properties.testPropertyAddMonth(TestYearMonth_Properties.java:226)

testGet(org.joda.time.TestMonthDay_Basics)  Time elapsed: 0.001 sec  <<< ERROR!
java.lang.ArrayIndexOutOfBoundsException: -1
	at org.joda.time.MonthDay.getFieldType(MonthDay.java:426)
	at org.joda.time.chrono.BaseChronology.get(BaseChronology.java:59)
	at org.joda.time.base.BasePartial.<init>(BasePartial.java:111)
	at org.joda.time.base.BasePartial.<init>(BasePartial.java:65)
	at org.joda.time.MonthDay.<init>(MonthDay.java:221)
	at org.joda.time.TestMonthDay_Basics.testGet(TestMonthDay_Basics.java:87)

testIsSupported(org.joda.time.TestMonthDay_Basics)  Time elapsed: 0 sec  <<< ERROR!
java.lang.ArrayIndexOutOfBoundsException: -1
	at org.joda.time.MonthDay.getFieldType(MonthDay.java:426)
	at org.joda.time.chrono.BaseChronology.get(BaseChronology.java:59)
	at org.joda.time.base.BasePartial.<init>(BasePartial.java:111)
	at org.joda.time.base.BasePartial.<init>(BasePartial.java:79)
	at org.joda.time.MonthDay.<init>(MonthDay.java:251)
	at org.joda.time.TestMonthDay_Basics.testIsSupported(TestMonthDay_Basics.java:170)

testSize(org.joda.time.TestMonthDay_Basics)  Time elapsed: 0 sec  <<< ERROR!
java.lang.ArrayIndexOutOfBoundsException: -1
	at org.joda.time.MonthDay.getFieldType(MonthDay.java:426)
	at org.joda.time.chrono.BaseChronology.get(BaseChronology.java:59)
	at org.joda.time.base.BasePartial.<init>(BasePartial.java:111)
	at org.joda.time.base.BasePartial.<init>(BasePartial.java:65)
	at org.joda.time.MonthDay.<init>(MonthDay.java:221)
	at org.joda.time.TestMonthDay_Basics.testSize(TestMonthDay_Basics.java:101)

testGetFieldTypes(org.joda.time.TestMonthDay_Basics)  Time elapsed: 0 sec  <<< ERROR!
java.lang.ArrayIndexOutOfBoundsException: -1
	at org.joda.time.MonthDay.getFieldType(MonthDay.java:426)
	at org.joda.time.chrono.BaseChronology.get(BaseChronology.java:59)
	at org.joda.time.base.BasePartial.<init>(BasePartial.java:111)
	at org.joda.time.base.BasePartial.<init>(BasePartial.java:79)
	at org.joda.time.MonthDay.<init>(MonthDay.java:251)
	at org.joda.time.TestMonthDay_Basics.testGetFieldTypes(TestMonthDay_Basics.java:119)

testGetFields(org.joda.time.TestMonthDay_Basics)  Time elapsed: 0.001 sec  <<< ERROR!
java.lang.ArrayIndexOutOfBoundsException: -1
	at org.joda.time.MonthDay.getFieldType(MonthDay.java:426)
	at org.joda.time.chrono.BaseChronology.get(BaseChronology.java:59)
	at org.joda.time.base.BasePartial.<init>(BasePartial.java:111)
	at org.joda.time.base.BasePartial.<init>(BasePartial.java:79)
	at org.joda.time.MonthDay.<init>(MonthDay.java:251)
	at org.joda.time.TestMonthDay_Basics.testGetFields(TestMonthDay_Basics.java:140)

testGetValues(org.joda.time.TestMonthDay_Basics)  Time elapsed: 0 sec  <<< ERROR!
java.lang.ArrayIndexOutOfBoundsException: -1
	at org.joda.time.MonthDay.getFieldType(MonthDay.java:426)
	at org.joda.time.chrono.BaseChronology.get(BaseChronology.java:59)
	at org.joda.time.base.BasePartial.<init>(BasePartial.java:111)
	at org.joda.time.base.BasePartial.<init>(BasePartial.java:65)
	at org.joda.time.MonthDay.<init>(MonthDay.java:221)
	at org.joda.time.TestMonthDay_Basics.testGetValues(TestMonthDay_Basics.java:161)

testGetField(org.joda.time.TestMonthDay_Basics)  Time elapsed: 0.001 sec  <<< ERROR!
java.lang.ArrayIndexOutOfBoundsException: -1
	at org.joda.time.MonthDay.getFieldType(MonthDay.java:426)
	at org.joda.time.chrono.BaseChronology.get(BaseChronology.java:59)
	at org.joda.time.base.BasePartial.<init>(BasePartial.java:111)
	at org.joda.time.base.BasePartial.<init>(BasePartial.java:79)
	at org.joda.time.MonthDay.<init>(MonthDay.java:251)
	at org.joda.time.TestMonthDay_Basics.testGetField(TestMonthDay_Basics.java:128)

testGetValue(org.joda.time.TestMonthDay_Basics)  Time elapsed: 0 sec  <<< ERROR!
java.lang.ArrayIndexOutOfBoundsException: -1
	at org.joda.time.MonthDay.getFieldType(MonthDay.java:426)
	at org.joda.time.chrono.BaseChronology.get(BaseChronology.java:59)
	at org.joda.time.base.BasePartial.<init>(BasePartial.java:111)
	at org.joda.time.base.BasePartial.<init>(BasePartial.java:65)
	at org.joda.time.MonthDay.<init>(MonthDay.java:221)
	at org.joda.time.TestMonthDay_Basics.testGetValue(TestMonthDay_Basics.java:149)

testGetFieldType(org.joda.time.TestMonthDay_Basics)  Time elapsed: 0 sec  <<< ERROR!
java.lang.ArrayIndexOutOfBoundsException: -1
	at org.joda.time.MonthDay.getFieldType(MonthDay.java:426)
	at org.joda.time.chrono.BaseChronology.get(BaseChronology.java:59)
	at org.joda.time.base.BasePartial.<init>(BasePartial.java:111)
	at org.joda.time.base.BasePartial.<init>(BasePartial.java:79)
	at org.joda.time.MonthDay.<init>(MonthDay.java:251)
	at org.joda.time.TestMonthDay_Basics.testGetFieldType(TestMonthDay_Basics.java:106)

testConstructor(org.joda.time.TestMonthDay_Constructors)  Time elapsed: 0 sec  <<< ERROR!
java.lang.ArrayIndexOutOfBoundsException: -1
	at org.joda.time.MonthDay.getFieldType(MonthDay.java:426)
	at org.joda.time.chrono.BaseChronology.get(BaseChronology.java:59)
	at org.joda.time.base.BasePartial.<init>(BasePartial.java:111)
	at org.joda.time.base.BasePartial.<init>(BasePartial.java:65)
	at org.joda.time.MonthDay.<init>(MonthDay.java:221)
	at org.joda.time.TestMonthDay_Constructors.testConstructor(TestMonthDay_Constructors.java:122)

testConstructor_long1_Chronology(org.joda.time.TestMonthDay_Constructors)  Time elapsed: 0.001 sec  <<< ERROR!
java.lang.ArrayIndexOutOfBoundsException: -1
	at org.joda.time.MonthDay.getFieldType(MonthDay.java:426)
	at org.joda.time.chrono.BaseChronology.get(BaseChronology.java:59)
	at org.joda.time.base.BasePartial.<init>(BasePartial.java:111)
	at org.joda.time.MonthDay.<init>(MonthDay.java:280)
	at org.joda.time.TestMonthDay_Constructors.testConstructor_long1_Chronology(TestMonthDay_Constructors.java:210)

testConstructor_long2_Chronology(org.joda.time.TestMonthDay_Constructors)  Time elapsed: 0 sec  <<< ERROR!
java.lang.ArrayIndexOutOfBoundsException: -1
	at org.joda.time.MonthDay.getFieldType(MonthDay.java:426)
	at org.joda.time.chrono.BaseChronology.get(BaseChronology.java:59)
	at org.joda.time.base.BasePartial.<init>(BasePartial.java:111)
	at org.joda.time.MonthDay.<init>(MonthDay.java:280)
	at org.joda.time.TestMonthDay_Constructors.testConstructor_long2_Chronology(TestMonthDay_Constructors.java:220)

testConstructor_long_nullChronology(org.joda.time.TestMonthDay_Constructors)  Time elapsed: 0.001 sec  <<< ERROR!
java.lang.ArrayIndexOutOfBoundsException: -1
	at org.joda.time.MonthDay.getFieldType(MonthDay.java:426)
	at org.joda.time.chrono.BaseChronology.get(BaseChronology.java:59)
	at org.joda.time.base.BasePartial.<init>(BasePartial.java:111)
	at org.joda.time.MonthDay.<init>(MonthDay.java:280)
	at org.joda.time.TestMonthDay_Constructors.testConstructor_long_nullChronology(TestMonthDay_Constructors.java:230)

testConstructor_ObjectString1(org.joda.time.TestMonthDay_Constructors)  Time elapsed: 0 sec  <<< ERROR!
java.lang.ArrayIndexOutOfBoundsException: -1
	at org.joda.time.MonthDay.getFieldType(MonthDay.java:426)
	at org.joda.time.chrono.BaseChronology.get(BaseChronology.java:59)
	at org.joda.time.convert.StringConverter.getPartialValues(StringConverter.java:88)
	at org.joda.time.base.BasePartial.<init>(BasePartial.java:163)
	at org.joda.time.MonthDay.<init>(MonthDay.java:297)
	at org.joda.time.TestMonthDay_Constructors.testConstructor_ObjectString1(TestMonthDay_Constructors.java:253)

testConstructor_ObjectString5(org.joda.time.TestMonthDay_Constructors)  Time elapsed: 0 sec  <<< ERROR!
java.lang.ArrayIndexOutOfBoundsException: -1
	at org.joda.time.MonthDay.getFieldType(MonthDay.java:426)
	at org.joda.time.chrono.BaseChronology.get(BaseChronology.java:59)
	at org.joda.time.convert.StringConverter.getPartialValues(StringConverter.java:88)
	at org.joda.time.base.BasePartial.<init>(BasePartial.java:163)
	at org.joda.time.MonthDay.<init>(MonthDay.java:297)
	at org.joda.time.TestMonthDay_Constructors.testConstructor_ObjectString5(TestMonthDay_Constructors.java:260)

testConstructor_Object_Chronology(org.joda.time.TestMonthDay_Constructors)  Time elapsed: 0 sec  <<< ERROR!
java.lang.ArrayIndexOutOfBoundsException: -1
	at org.joda.time.MonthDay.getFieldType(MonthDay.java:426)
	at org.joda.time.chrono.BaseChronology.get(BaseChronology.java:59)
	at org.joda.time.convert.AbstractConverter.getPartialValues(AbstractConverter.java:102)
	at org.joda.time.convert.AbstractConverter.getPartialValues(AbstractConverter.java:123)
	at org.joda.time.base.BasePartial.<init>(BasePartial.java:163)
	at org.joda.time.MonthDay.<init>(MonthDay.java:319)
	at org.joda.time.TestMonthDay_Constructors.testConstructor_Object_Chronology(TestMonthDay_Constructors.java:308)

testConstructor_nullObject_Chronology(org.joda.time.TestMonthDay_Constructors)  Time elapsed: 0.001 sec  <<< ERROR!
java.lang.ArrayIndexOutOfBoundsException: -1
	at org.joda.time.MonthDay.getFieldType(MonthDay.java:426)
	at org.joda.time.chrono.BaseChronology.get(BaseChronology.java:59)
	at org.joda.time.convert.AbstractConverter.getPartialValues(AbstractConverter.java:102)
	at org.joda.time.convert.AbstractConverter.getPartialValues(AbstractConverter.java:123)
	at org.joda.time.base.BasePartial.<init>(BasePartial.java:163)
	at org.joda.time.MonthDay.<init>(MonthDay.java:319)
	at org.joda.time.TestMonthDay_Constructors.testConstructor_nullObject_Chronology(TestMonthDay_Constructors.java:318)

testConstructor_Object_nullChronology(org.joda.time.TestMonthDay_Constructors)  Time elapsed: 0 sec  <<< ERROR!
java.lang.ArrayIndexOutOfBoundsException: -1
	at org.joda.time.MonthDay.getFieldType(MonthDay.java:426)
	at org.joda.time.chrono.BaseChronology.get(BaseChronology.java:59)
	at org.joda.time.convert.AbstractConverter.getPartialValues(AbstractConverter.java:102)
	at org.joda.time.convert.AbstractConverter.getPartialValues(AbstractConverter.java:123)
	at org.joda.time.base.BasePartial.<init>(BasePartial.java:163)
	at org.joda.time.MonthDay.<init>(MonthDay.java:319)
	at org.joda.time.TestMonthDay_Constructors.testConstructor_Object_nullChronology(TestMonthDay_Constructors.java:329)

testConstructor_nullObject_nullChronology(org.joda.time.TestMonthDay_Constructors)  Time elapsed: 0.001 sec  <<< ERROR!
java.lang.ArrayIndexOutOfBoundsException: -1
	at org.joda.time.MonthDay.getFieldType(MonthDay.java:426)
	at org.joda.time.chrono.BaseChronology.get(BaseChronology.java:59)
	at org.joda.time.convert.AbstractConverter.getPartialValues(AbstractConverter.java:102)
	at org.joda.time.convert.AbstractConverter.getPartialValues(AbstractConverter.java:123)
	at org.joda.time.base.BasePartial.<init>(BasePartial.java:163)
	at org.joda.time.MonthDay.<init>(MonthDay.java:319)
	at org.joda.time.TestMonthDay_Constructors.testConstructor_nullObject_nullChronology(TestMonthDay_Constructors.java:339)

testConstructor_long1(org.joda.time.TestMonthDay_Constructors)  Time elapsed: 0.001 sec  <<< ERROR!
java.lang.ArrayIndexOutOfBoundsException: -1
	at org.joda.time.MonthDay.getFieldType(MonthDay.java:426)
	at org.joda.time.chrono.BaseChronology.get(BaseChronology.java:59)
	at org.joda.time.base.BasePartial.<init>(BasePartial.java:111)
	at org.joda.time.base.BasePartial.<init>(BasePartial.java:93)
	at org.joda.time.MonthDay.<init>(MonthDay.java:265)
	at org.joda.time.TestMonthDay_Constructors.testConstructor_long1(TestMonthDay_Constructors.java:190)

testConstructor_long2(org.joda.time.TestMonthDay_Constructors)  Time elapsed: 0 sec  <<< ERROR!
java.lang.ArrayIndexOutOfBoundsException: -1
	at org.joda.time.MonthDay.getFieldType(MonthDay.java:426)
	at org.joda.time.chrono.BaseChronology.get(BaseChronology.java:59)
	at org.joda.time.base.BasePartial.<init>(BasePartial.java:111)
	at org.joda.time.base.BasePartial.<init>(BasePartial.java:93)
	at org.joda.time.MonthDay.<init>(MonthDay.java:265)
	at org.joda.time.TestMonthDay_Constructors.testConstructor_long2(TestMonthDay_Constructors.java:200)

testConstructor_Object(org.joda.time.TestMonthDay_Constructors)  Time elapsed: 0.001 sec  <<< ERROR!
java.lang.ArrayIndexOutOfBoundsException: -1
	at org.joda.time.MonthDay.getFieldType(MonthDay.java:426)
	at org.joda.time.chrono.BaseChronology.get(BaseChronology.java:59)
	at org.joda.time.convert.AbstractConverter.getPartialValues(AbstractConverter.java:102)
	at org.joda.time.convert.AbstractConverter.getPartialValues(AbstractConverter.java:123)
	at org.joda.time.base.BasePartial.<init>(BasePartial.java:163)
	at org.joda.time.MonthDay.<init>(MonthDay.java:297)
	at org.joda.time.TestMonthDay_Constructors.testConstructor_Object(TestMonthDay_Constructors.java:239)

testConstructor_nullObject(org.joda.time.TestMonthDay_Constructors)  Time elapsed: 0.001 sec  <<< ERROR!
java.lang.ArrayIndexOutOfBoundsException: -1
	at org.joda.time.MonthDay.getFieldType(MonthDay.java:426)
	at org.joda.time.chrono.BaseChronology.get(BaseChronology.java:59)
	at org.joda.time.convert.AbstractConverter.getPartialValues(AbstractConverter.java:102)
	at org.joda.time.convert.AbstractConverter.getPartialValues(AbstractConverter.java:123)
	at org.joda.time.base.BasePartial.<init>(BasePartial.java:163)
	at org.joda.time.MonthDay.<init>(MonthDay.java:297)
	at org.joda.time.TestMonthDay_Constructors.testConstructor_nullObject(TestMonthDay_Constructors.java:246)

testConstructor_DateTimeZone(org.joda.time.TestMonthDay_Constructors)  Time elapsed: 0.001 sec  <<< ERROR!
java.lang.ArrayIndexOutOfBoundsException: -1
	at org.joda.time.MonthDay.getFieldType(MonthDay.java:426)
	at org.joda.time.chrono.BaseChronology.get(BaseChronology.java:59)
	at org.joda.time.base.BasePartial.<init>(BasePartial.java:111)
	at org.joda.time.base.BasePartial.<init>(BasePartial.java:79)
	at org.joda.time.MonthDay.<init>(MonthDay.java:236)
	at org.joda.time.TestMonthDay_Constructors.testConstructor_DateTimeZone(TestMonthDay_Constructors.java:137)

testConstructor_nullDateTimeZone(org.joda.time.TestMonthDay_Constructors)  Time elapsed: 0.001 sec  <<< ERROR!
java.lang.ArrayIndexOutOfBoundsException: -1
	at org.joda.time.MonthDay.getFieldType(MonthDay.java:426)
	at org.joda.time.chrono.BaseChronology.get(BaseChronology.java:59)
	at org.joda.time.base.BasePartial.<init>(BasePartial.java:111)
	at org.joda.time.base.BasePartial.<init>(BasePartial.java:79)
	at org.joda.time.MonthDay.<init>(MonthDay.java:236)
	at org.joda.time.TestMonthDay_Constructors.testConstructor_nullDateTimeZone(TestMonthDay_Constructors.java:158)

testConstructor_Chronology(org.joda.time.TestMonthDay_Constructors)  Time elapsed: 0 sec  <<< ERROR!
java.lang.ArrayIndexOutOfBoundsException: -1
	at org.joda.time.MonthDay.getFieldType(MonthDay.java:426)
	at org.joda.time.chrono.BaseChronology.get(BaseChronology.java:59)
	at org.joda.time.base.BasePartial.<init>(BasePartial.java:111)
	at org.joda.time.base.BasePartial.<init>(BasePartial.java:79)
	at org.joda.time.MonthDay.<init>(MonthDay.java:251)
	at org.joda.time.TestMonthDay_Constructors.testConstructor_Chronology(TestMonthDay_Constructors.java:168)

testConstructor_nullChronology(org.joda.time.TestMonthDay_Constructors)  Time elapsed: 0 sec  <<< ERROR!
java.lang.ArrayIndexOutOfBoundsException: -1
	at org.joda.time.MonthDay.getFieldType(MonthDay.java:426)
	at org.joda.time.chrono.BaseChronology.get(BaseChronology.java:59)
	at org.joda.time.base.BasePartial.<init>(BasePartial.java:111)
	at org.joda.time.base.BasePartial.<init>(BasePartial.java:79)
	at org.joda.time.MonthDay.<init>(MonthDay.java:251)
	at org.joda.time.TestMonthDay_Constructors.testConstructor_nullChronology(TestMonthDay_Constructors.java:179)

testPropertyCompareToMonthOfYear(org.joda.time.TestMonthDay_Properties)  Time elapsed: 0.001 sec  <<< ERROR!
java.lang.ArrayIndexOutOfBoundsException: -1
	at org.joda.time.MonthDay.getFieldType(MonthDay.java:426)
	at org.joda.time.chrono.BaseChronology.get(BaseChronology.java:59)
	at org.joda.time.base.BasePartial.<init>(BasePartial.java:111)
	at org.joda.time.base.BasePartial.<init>(BasePartial.java:93)
	at org.joda.time.MonthDay.<init>(MonthDay.java:265)
	at org.joda.time.TestMonthDay_Properties.testPropertyCompareToMonthOfYear(TestMonthDay_Properties.java:154)

testPropertyCompareToDayOfMonth(org.joda.time.TestMonthDay_Properties)  Time elapsed: 0 sec  <<< ERROR!
java.lang.ArrayIndexOutOfBoundsException: -1
	at org.joda.time.MonthDay.getFieldType(MonthDay.java:426)
	at org.joda.time.chrono.BaseChronology.get(BaseChronology.java:59)
	at org.joda.time.base.BasePartial.<init>(BasePartial.java:111)
	at org.joda.time.base.BasePartial.<init>(BasePartial.java:93)
	at org.joda.time.MonthDay.<init>(MonthDay.java:265)
	at org.joda.time.TestMonthDay_Properties.testPropertyCompareToDayOfMonth(TestMonthDay_Properties.java:267)

testCompareTo(org.joda.time.TestPartial_Basics)  Time elapsed: 0.001 sec  <<< ERROR!
java.lang.ArrayIndexOutOfBoundsException: -1
	at org.joda.time.YearMonthDay.getFieldType(YearMonthDay.java:351)
	at org.joda.time.chrono.BaseChronology.get(BaseChronology.java:59)
	at org.joda.time.base.BasePartial.<init>(BasePartial.java:111)
	at org.joda.time.base.BasePartial.<init>(BasePartial.java:65)
	at org.joda.time.YearMonthDay.<init>(YearMonthDay.java:153)
	at org.joda.time.TestPartial_Basics.testCompareTo(TestPartial_Basics.java:237)

testSerializedYearMonthDay(org.joda.time.TestSerialization)  Time elapsed: 0.001 sec  <<< ERROR!
java.lang.ArrayIndexOutOfBoundsException: -1
	at org.joda.time.YearMonthDay.getFieldType(YearMonthDay.java:351)
	at org.joda.time.chrono.BaseChronology.get(BaseChronology.java:59)
	at org.joda.time.base.BasePartial.<init>(BasePartial.java:111)
	at org.joda.time.base.BasePartial.<init>(BasePartial.java:65)
	at org.joda.time.YearMonthDay.<init>(YearMonthDay.java:153)
	at org.joda.time.TestSerialization.testSerializedYearMonthDay(TestSerialization.java:198)

testSerializedTimeOfDay(org.joda.time.TestSerialization)  Time elapsed: 0 sec  <<< ERROR!
java.lang.ArrayIndexOutOfBoundsException: -1
	at org.joda.time.TimeOfDay.getFieldType(TimeOfDay.java:464)
	at org.joda.time.chrono.BaseChronology.get(BaseChronology.java:59)
	at org.joda.time.base.BasePartial.<init>(BasePartial.java:111)
	at org.joda.time.base.BasePartial.<init>(BasePartial.java:65)
	at org.joda.time.TimeOfDay.<init>(TimeOfDay.java:199)
	at org.joda.time.TestSerialization.testSerializedTimeOfDay(TestSerialization.java:205)

testMaximumValue(org.joda.time.chrono.TestGJChronology)  Time elapsed: 0 sec  <<< ERROR!
java.lang.ArrayIndexOutOfBoundsException: -1
	at org.joda.time.YearMonthDay.getFieldType(YearMonthDay.java:351)
	at org.joda.time.chrono.BaseChronology.get(BaseChronology.java:59)
	at org.joda.time.base.BasePartial.<init>(BasePartial.java:111)
	at org.joda.time.YearMonthDay.<init>(YearMonthDay.java:211)
	at org.joda.time.DateMidnight.toYearMonthDay(DateMidnight.java:871)
	at org.joda.time.chrono.TestGJChronology.testMaximumValue(TestGJChronology.java:514)

testPartialGetAsText(org.joda.time.chrono.TestGJChronology)  Time elapsed: 0.001 sec  <<< ERROR!
java.lang.ArrayIndexOutOfBoundsException: -1
	at org.joda.time.YearMonthDay.getFieldType(YearMonthDay.java:351)
	at org.joda.time.chrono.BaseChronology.get(BaseChronology.java:59)
	at org.joda.time.convert.StringConverter.getPartialValues(StringConverter.java:88)
	at org.joda.time.base.BasePartial.<init>(BasePartial.java:163)
	at org.joda.time.YearMonthDay.<init>(YearMonthDay.java:256)
	at org.joda.time.chrono.TestGJChronology.testPartialGetAsText(TestGJChronology.java:523)

testCutoverAddYears(org.joda.time.chrono.TestGJChronology)  Time elapsed: 0.001 sec  <<< ERROR!
java.lang.ArrayIndexOutOfBoundsException: -1
	at org.joda.time.YearMonthDay.getFieldType(YearMonthDay.java:351)
	at org.joda.time.chrono.BaseChronology.get(BaseChronology.java:59)
	at org.joda.time.convert.StringConverter.getPartialValues(StringConverter.java:88)
	at org.joda.time.base.BasePartial.<init>(BasePartial.java:163)
	at org.joda.time.YearMonthDay.<init>(YearMonthDay.java:256)
	at org.joda.time.chrono.TestGJChronology.testAdd(TestGJChronology.java:494)
	at org.joda.time.chrono.TestGJChronology.testCutoverAddYears(TestGJChronology.java:381)

testCutoverAddMonths(org.joda.time.chrono.TestGJChronology)  Time elapsed: 0 sec  <<< ERROR!
java.lang.ArrayIndexOutOfBoundsException: -1
	at org.joda.time.YearMonthDay.getFieldType(YearMonthDay.java:351)
	at org.joda.time.chrono.BaseChronology.get(BaseChronology.java:59)
	at org.joda.time.convert.StringConverter.getPartialValues(StringConverter.java:88)
	at org.joda.time.base.BasePartial.<init>(BasePartial.java:163)
	at org.joda.time.YearMonthDay.<init>(YearMonthDay.java:256)
	at org.joda.time.chrono.TestGJChronology.testAdd(TestGJChronology.java:494)
	at org.joda.time.chrono.TestGJChronology.testCutoverAddMonths(TestGJChronology.java:422)

testCutoverAddDays(org.joda.time.chrono.TestGJChronology)  Time elapsed: 0.001 sec  <<< ERROR!
java.lang.ArrayIndexOutOfBoundsException: -1
	at org.joda.time.YearMonthDay.getFieldType(YearMonthDay.java:351)
	at org.joda.time.chrono.BaseChronology.get(BaseChronology.java:59)
	at org.joda.time.convert.StringConverter.getPartialValues(StringConverter.java:88)
	at org.joda.time.base.BasePartial.<init>(BasePartial.java:163)
	at org.joda.time.YearMonthDay.<init>(YearMonthDay.java:256)
	at org.joda.time.chrono.TestGJChronology.testAdd(TestGJChronology.java:494)
	at org.joda.time.chrono.TestGJChronology.testCutoverAddDays(TestGJChronology.java:452)

testYearEndAddDays(org.joda.time.chrono.TestGJChronology)  Time elapsed: 0.001 sec  <<< ERROR!
java.lang.ArrayIndexOutOfBoundsException: -1
	at org.joda.time.YearMonthDay.getFieldType(YearMonthDay.java:351)
	at org.joda.time.chrono.BaseChronology.get(BaseChronology.java:59)
	at org.joda.time.convert.StringConverter.getPartialValues(StringConverter.java:88)
	at org.joda.time.base.BasePartial.<init>(BasePartial.java:163)
	at org.joda.time.YearMonthDay.<init>(YearMonthDay.java:256)
	at org.joda.time.chrono.TestGJChronology.testAdd(TestGJChronology.java:494)
	at org.joda.time.chrono.TestGJChronology.testYearEndAddDays(TestGJChronology.java:462)

testSubtractDays(org.joda.time.chrono.TestGJChronology)  Time elapsed: 0.001 sec  <<< ERROR!
java.lang.ArrayIndexOutOfBoundsException: -1
	at org.joda.time.YearMonthDay.getFieldType(YearMonthDay.java:351)
	at org.joda.time.chrono.BaseChronology.get(BaseChronology.java:59)
	at org.joda.time.base.BasePartial.<init>(BasePartial.java:111)
	at org.joda.time.YearMonthDay.<init>(YearMonthDay.java:211)
	at org.joda.time.DateTime.toYearMonthDay(DateTime.java:1565)
	at org.joda.time.chrono.TestGJChronology.testSubtractDays(TestGJChronology.java:475)

testAddMonths(org.joda.time.chrono.TestISOChronology)  Time elapsed: 0.001 sec  <<< ERROR!
java.lang.ArrayIndexOutOfBoundsException: -1
	at org.joda.time.YearMonthDay.getFieldType(YearMonthDay.java:351)
	at org.joda.time.chrono.BaseChronology.get(BaseChronology.java:59)
	at org.joda.time.convert.StringConverter.getPartialValues(StringConverter.java:88)
	at org.joda.time.base.BasePartial.<init>(BasePartial.java:163)
	at org.joda.time.YearMonthDay.<init>(YearMonthDay.java:256)
	at org.joda.time.chrono.TestISOChronology.testAdd(TestISOChronology.java:423)
	at org.joda.time.chrono.TestISOChronology.testAddMonths(TestISOChronology.java:394)

testMaximumValue(org.joda.time.chrono.TestISOChronology)  Time elapsed: 0 sec  <<< ERROR!
java.lang.ArrayIndexOutOfBoundsException: -1
	at org.joda.time.YearMonthDay.getFieldType(YearMonthDay.java:351)
	at org.joda.time.chrono.BaseChronology.get(BaseChronology.java:59)
	at org.joda.time.base.BasePartial.<init>(BasePartial.java:111)
	at org.joda.time.YearMonthDay.<init>(YearMonthDay.java:211)
	at org.joda.time.DateMidnight.toYearMonthDay(DateMidnight.java:871)
	at org.joda.time.chrono.TestISOChronology.testMaximumValue(TestISOChronology.java:450)

testCutoverAddYears(org.joda.time.chrono.TestISOChronology)  Time elapsed: 0.001 sec  <<< ERROR!
java.lang.ArrayIndexOutOfBoundsException: -1
	at org.joda.time.YearMonthDay.getFieldType(YearMonthDay.java:351)
	at org.joda.time.chrono.BaseChronology.get(BaseChronology.java:59)
	at org.joda.time.convert.StringConverter.getPartialValues(StringConverter.java:88)
	at org.joda.time.base.BasePartial.<init>(BasePartial.java:163)
	at org.joda.time.YearMonthDay.<init>(YearMonthDay.java:256)
	at org.joda.time.chrono.TestISOChronology.testAdd(TestISOChronology.java:423)
	at org.joda.time.chrono.TestISOChronology.testCutoverAddYears(TestISOChronology.java:376)

testGetPartialConverter(org.joda.time.convert.TestConverterManager)  Time elapsed: 0.001 sec  <<< ERROR!
java.lang.ArrayIndexOutOfBoundsException: -1
	at org.joda.time.TimeOfDay.getFieldType(TimeOfDay.java:464)
	at org.joda.time.chrono.BaseChronology.get(BaseChronology.java:59)
	at org.joda.time.base.BasePartial.<init>(BasePartial.java:111)
	at org.joda.time.base.BasePartial.<init>(BasePartial.java:65)
	at org.joda.time.TimeOfDay.<init>(TimeOfDay.java:199)
	at org.joda.time.convert.TestConverterManager.testGetPartialConverter(TestConverterManager.java:337)

testGetPartialValues(org.joda.time.convert.TestCalendarConverter)  Time elapsed: 0.001 sec  <<< ERROR!
java.lang.ArrayIndexOutOfBoundsException: -1
	at org.joda.time.TimeOfDay.getFieldType(TimeOfDay.java:464)
	at org.joda.time.chrono.BaseChronology.get(BaseChronology.java:59)
	at org.joda.time.base.BasePartial.<init>(BasePartial.java:111)
	at org.joda.time.base.BasePartial.<init>(BasePartial.java:65)
	at org.joda.time.TimeOfDay.<init>(TimeOfDay.java:199)
	at org.joda.time.convert.TestCalendarConverter.testGetPartialValues(TestCalendarConverter.java:170)

testGetPartialValues(org.joda.time.convert.TestDateConverter)  Time elapsed: 0 sec  <<< ERROR!
java.lang.ArrayIndexOutOfBoundsException: -1
	at org.joda.time.TimeOfDay.getFieldType(TimeOfDay.java:464)
	at org.joda.time.chrono.BaseChronology.get(BaseChronology.java:59)
	at org.joda.time.base.BasePartial.<init>(BasePartial.java:111)
	at org.joda.time.base.BasePartial.<init>(BasePartial.java:65)
	at org.joda.time.TimeOfDay.<init>(TimeOfDay.java:199)
	at org.joda.time.convert.TestDateConverter.testGetPartialValues(TestDateConverter.java:108)

testGetPartialValues(org.joda.time.convert.TestLongConverter)  Time elapsed: 0 sec  <<< ERROR!
java.lang.ArrayIndexOutOfBoundsException: -1
	at org.joda.time.TimeOfDay.getFieldType(TimeOfDay.java:464)
	at org.joda.time.chrono.BaseChronology.get(BaseChronology.java:59)
	at org.joda.time.base.BasePartial.<init>(BasePartial.java:111)
	at org.joda.time.base.BasePartial.<init>(BasePartial.java:65)
	at org.joda.time.TimeOfDay.<init>(TimeOfDay.java:199)
	at org.joda.time.convert.TestLongConverter.testGetPartialValues(TestLongConverter.java:105)

testGetPartialValues(org.joda.time.convert.TestNullConverter)  Time elapsed: 0.001 sec  <<< ERROR!
java.lang.ArrayIndexOutOfBoundsException: -1
	at org.joda.time.TimeOfDay.getFieldType(TimeOfDay.java:464)
	at org.joda.time.chrono.BaseChronology.get(BaseChronology.java:59)
	at org.joda.time.base.BasePartial.<init>(BasePartial.java:111)
	at org.joda.time.base.BasePartial.<init>(BasePartial.java:65)
	at org.joda.time.TimeOfDay.<init>(TimeOfDay.java:199)
	at org.joda.time.convert.TestNullConverter.testGetPartialValues(TestNullConverter.java:142)

testGetPartialValues(org.joda.time.convert.TestReadableInstantConverter)  Time elapsed: 0 sec  <<< ERROR!
java.lang.ArrayIndexOutOfBoundsException: -1
	at org.joda.time.TimeOfDay.getFieldType(TimeOfDay.java:464)
	at org.joda.time.chrono.BaseChronology.get(BaseChronology.java:59)
	at org.joda.time.base.BasePartial.<init>(BasePartial.java:111)
	at org.joda.time.base.BasePartial.<init>(BasePartial.java:65)
	at org.joda.time.TimeOfDay.<init>(TimeOfDay.java:199)
	at org.joda.time.convert.TestReadableInstantConverter.testGetPartialValues(TestReadableInstantConverter.java:136)

testGetChronology_Object_Zone(org.joda.time.convert.TestReadablePartialConverter)  Time elapsed: 0 sec  <<< ERROR!
java.lang.ArrayIndexOutOfBoundsException: -1
	at org.joda.time.TimeOfDay.getFieldType(TimeOfDay.java:464)
	at org.joda.time.chrono.BaseChronology.get(BaseChronology.java:59)
	at org.joda.time.base.BasePartial.<init>(BasePartial.java:111)
	at org.joda.time.base.BasePartial.<init>(BasePartial.java:93)
	at org.joda.time.TimeOfDay.<init>(TimeOfDay.java:242)
	at org.joda.time.convert.TestReadablePartialConverter.testGetChronology_Object_Zone(TestReadablePartialConverter.java:95)

testGetChronology_Object_Chronology(org.joda.time.convert.TestReadablePartialConverter)  Time elapsed: 0 sec  <<< ERROR!
java.lang.ArrayIndexOutOfBoundsException: -1
	at org.joda.time.TimeOfDay.getFieldType(TimeOfDay.java:464)
	at org.joda.time.chrono.BaseChronology.get(BaseChronology.java:59)
	at org.joda.time.base.BasePartial.<init>(BasePartial.java:111)
	at org.joda.time.TimeOfDay.<init>(TimeOfDay.java:257)
	at org.joda.time.convert.TestReadablePartialConverter.testGetChronology_Object_Chronology(TestReadablePartialConverter.java:101)

testGetPartialValues(org.joda.time.convert.TestReadablePartialConverter)  Time elapsed: 0 sec  <<< ERROR!
java.lang.ArrayIndexOutOfBoundsException: -1
	at org.joda.time.TimeOfDay.getFieldType(TimeOfDay.java:464)
	at org.joda.time.chrono.BaseChronology.get(BaseChronology.java:59)
	at org.joda.time.base.BasePartial.<init>(BasePartial.java:111)
	at org.joda.time.base.BasePartial.<init>(BasePartial.java:65)
	at org.joda.time.TimeOfDay.<init>(TimeOfDay.java:199)
	at org.joda.time.convert.TestReadablePartialConverter.testGetPartialValues(TestReadablePartialConverter.java:108)

testGetPartialValues(org.joda.time.convert.TestStringConverter)  Time elapsed: 0.001 sec  <<< ERROR!
java.lang.ArrayIndexOutOfBoundsException: -1
	at org.joda.time.TimeOfDay.getFieldType(TimeOfDay.java:464)
	at org.joda.time.chrono.BaseChronology.get(BaseChronology.java:59)
	at org.joda.time.base.BasePartial.<init>(BasePartial.java:111)
	at org.joda.time.base.BasePartial.<init>(BasePartial.java:65)
	at org.joda.time.TimeOfDay.<init>(TimeOfDay.java:199)
	at org.joda.time.convert.TestStringConverter.testGetPartialValues(TestStringConverter.java:203)

test_set_RP_int_intarray_String_Locale(org.joda.time.field.TestBaseDateTimeField)  Time elapsed: 0.001 sec  <<< ERROR!
java.lang.ArrayIndexOutOfBoundsException: -1
	at org.joda.time.TimeOfDay.getFieldType(TimeOfDay.java:464)
	at org.joda.time.chrono.BaseChronology.get(BaseChronology.java:59)
	at org.joda.time.base.BasePartial.<init>(BasePartial.java:111)
	at org.joda.time.base.BasePartial.<init>(BasePartial.java:65)
	at org.joda.time.TimeOfDay.<init>(TimeOfDay.java:199)
	at org.joda.time.field.TestBaseDateTimeField.test_set_RP_int_intarray_String_Locale(TestBaseDateTimeField.java:320)

test_getMinimumValue_RP(org.joda.time.field.TestBaseDateTimeField)  Time elapsed: 0 sec  <<< ERROR!
java.lang.ArrayIndexOutOfBoundsException: -1
	at org.joda.time.TimeOfDay.getFieldType(TimeOfDay.java:464)
	at org.joda.time.chrono.BaseChronology.get(BaseChronology.java:59)
	at org.joda.time.base.BasePartial.<init>(BasePartial.java:111)
	at org.joda.time.base.BasePartial.<init>(BasePartial.java:65)
	at org.joda.time.TimeOfDay.<init>(TimeOfDay.java:199)
	at org.joda.time.field.TestBaseDateTimeField.test_getMinimumValue_RP(TestBaseDateTimeField.java:392)

test_getMinimumValue_RP_intarray(org.joda.time.field.TestBaseDateTimeField)  Time elapsed: 0.001 sec  <<< ERROR!
java.lang.ArrayIndexOutOfBoundsException: -1
	at org.joda.time.TimeOfDay.getFieldType(TimeOfDay.java:464)
	at org.joda.time.chrono.BaseChronology.get(BaseChronology.java:59)
	at org.joda.time.base.BasePartial.<init>(BasePartial.java:111)
	at org.joda.time.base.BasePartial.<init>(BasePartial.java:65)
	at org.joda.time.TimeOfDay.<init>(TimeOfDay.java:199)
	at org.joda.time.field.TestBaseDateTimeField.test_getMinimumValue_RP_intarray(TestBaseDateTimeField.java:397)

test_getMaximumValue_RP(org.joda.time.field.TestBaseDateTimeField)  Time elapsed: 0 sec  <<< ERROR!
java.lang.ArrayIndexOutOfBoundsException: -1
	at org.joda.time.TimeOfDay.getFieldType(TimeOfDay.java:464)
	at org.joda.time.chrono.BaseChronology.get(BaseChronology.java:59)
	at org.joda.time.base.BasePartial.<init>(BasePartial.java:111)
	at org.joda.time.base.BasePartial.<init>(BasePartial.java:65)
	at org.joda.time.TimeOfDay.<init>(TimeOfDay.java:199)
	at org.joda.time.field.TestBaseDateTimeField.test_getMaximumValue_RP(TestBaseDateTimeField.java:412)

test_getMaximumValue_RP_intarray(org.joda.time.field.TestBaseDateTimeField)  Time elapsed: 0.001 sec  <<< ERROR!
java.lang.ArrayIndexOutOfBoundsException: -1
	at org.joda.time.TimeOfDay.getFieldType(TimeOfDay.java:464)
	at org.joda.time.chrono.BaseChronology.get(BaseChronology.java:59)
	at org.joda.time.base.BasePartial.<init>(BasePartial.java:111)
	at org.joda.time.base.BasePartial.<init>(BasePartial.java:65)
	at org.joda.time.TimeOfDay.<init>(TimeOfDay.java:199)
	at org.joda.time.field.TestBaseDateTimeField.test_getMaximumValue_RP_intarray(TestBaseDateTimeField.java:417)

test_add_RP_int_intarray_int(org.joda.time.field.TestBaseDateTimeField)  Time elapsed: 0 sec  <<< ERROR!
java.lang.ArrayIndexOutOfBoundsException: -1
	at org.joda.time.TimeOfDay.getFieldType(TimeOfDay.java:464)
	at org.joda.time.chrono.BaseChronology.get(BaseChronology.java:59)
	at org.joda.time.base.BasePartial.<init>(BasePartial.java:111)
	at org.joda.time.base.BasePartial.<init>(BasePartial.java:65)
	at org.joda.time.TimeOfDay.<init>(TimeOfDay.java:199)
	at org.joda.time.field.TestBaseDateTimeField.test_add_RP_int_intarray_int(TestBaseDateTimeField.java:174)

test_addWrapField_RP_int_intarray_int(org.joda.time.field.TestBaseDateTimeField)  Time elapsed: 0 sec  <<< ERROR!
java.lang.ArrayIndexOutOfBoundsException: -1
	at org.joda.time.TimeOfDay.getFieldType(TimeOfDay.java:464)
	at org.joda.time.chrono.BaseChronology.get(BaseChronology.java:59)
	at org.joda.time.base.BasePartial.<init>(BasePartial.java:111)
	at org.joda.time.base.BasePartial.<init>(BasePartial.java:65)
	at org.joda.time.TimeOfDay.<init>(TimeOfDay.java:199)
	at org.joda.time.field.TestBaseDateTimeField.test_addWrapField_RP_int_intarray_int(TestBaseDateTimeField.java:234)

test_set_RP_int_intarray_int(org.joda.time.field.TestBaseDateTimeField)  Time elapsed: 0 sec  <<< ERROR!
java.lang.ArrayIndexOutOfBoundsException: -1
	at org.joda.time.TimeOfDay.getFieldType(TimeOfDay.java:464)
	at org.joda.time.chrono.BaseChronology.get(BaseChronology.java:59)
	at org.joda.time.base.BasePartial.<init>(BasePartial.java:111)
	at org.joda.time.base.BasePartial.<init>(BasePartial.java:65)
	at org.joda.time.TimeOfDay.<init>(TimeOfDay.java:199)
	at org.joda.time.field.TestBaseDateTimeField.test_set_RP_int_intarray_int(TestBaseDateTimeField.java:279)

test_set_RP_int_intarray_String_Locale(org.joda.time.field.TestOffsetDateTimeField)  Time elapsed: 0 sec  <<< ERROR!
java.lang.ArrayIndexOutOfBoundsException: -1
	at org.joda.time.TimeOfDay.getFieldType(TimeOfDay.java:464)
	at org.joda.time.chrono.BaseChronology.get(BaseChronology.java:59)
	at org.joda.time.base.BasePartial.<init>(BasePartial.java:111)
	at org.joda.time.base.BasePartial.<init>(BasePartial.java:65)
	at org.joda.time.TimeOfDay.<init>(TimeOfDay.java:199)
	at org.joda.time.field.TestOffsetDateTimeField.test_set_RP_int_intarray_String_Locale(TestOffsetDateTimeField.java:353)

test_getMinimumValue_RP(org.joda.time.field.TestOffsetDateTimeField)  Time elapsed: 0 sec  <<< ERROR!
java.lang.ArrayIndexOutOfBoundsException: -1
	at org.joda.time.TimeOfDay.getFieldType(TimeOfDay.java:464)
	at org.joda.time.chrono.BaseChronology.get(BaseChronology.java:59)
	at org.joda.time.base.BasePartial.<init>(BasePartial.java:111)
	at org.joda.time.base.BasePartial.<init>(BasePartial.java:65)
	at org.joda.time.TimeOfDay.<init>(TimeOfDay.java:199)
	at org.joda.time.field.TestOffsetDateTimeField.test_getMinimumValue_RP(TestOffsetDateTimeField.java:425)

test_getMinimumValue_RP_intarray(org.joda.time.field.TestOffsetDateTimeField)  Time elapsed: 0 sec  <<< ERROR!
java.lang.ArrayIndexOutOfBoundsException: -1
	at org.joda.time.TimeOfDay.getFieldType(TimeOfDay.java:464)
	at org.joda.time.chrono.BaseChronology.get(BaseChronology.java:59)
	at org.joda.time.base.BasePartial.<init>(BasePartial.java:111)
	at org.joda.time.base.BasePartial.<init>(BasePartial.java:65)
	at org.joda.time.TimeOfDay.<init>(TimeOfDay.java:199)
	at org.joda.time.field.TestOffsetDateTimeField.test_getMinimumValue_RP_intarray(TestOffsetDateTimeField.java:430)

test_getMaximumValue_RP(org.joda.time.field.TestOffsetDateTimeField)  Time elapsed: 0 sec  <<< ERROR!
java.lang.ArrayIndexOutOfBoundsException: -1
	at org.joda.time.TimeOfDay.getFieldType(TimeOfDay.java:464)
	at org.joda.time.chrono.BaseChronology.get(BaseChronology.java:59)
	at org.joda.time.base.BasePartial.<init>(BasePartial.java:111)
	at org.joda.time.base.BasePartial.<init>(BasePartial.java:65)
	at org.joda.time.TimeOfDay.<init>(TimeOfDay.java:199)
	at org.joda.time.field.TestOffsetDateTimeField.test_getMaximumValue_RP(TestOffsetDateTimeField.java:445)

test_getMaximumValue_RP_intarray(org.joda.time.field.TestOffsetDateTimeField)  Time elapsed: 0 sec  <<< ERROR!
java.lang.ArrayIndexOutOfBoundsException: -1
	at org.joda.time.TimeOfDay.getFieldType(TimeOfDay.java:464)
	at org.joda.time.chrono.BaseChronology.get(BaseChronology.java:59)
	at org.joda.time.base.BasePartial.<init>(BasePartial.java:111)
	at org.joda.time.base.BasePartial.<init>(BasePartial.java:65)
	at org.joda.time.TimeOfDay.<init>(TimeOfDay.java:199)
	at org.joda.time.field.TestOffsetDateTimeField.test_getMaximumValue_RP_intarray(TestOffsetDateTimeField.java:450)

test_add_RP_int_intarray_int(org.joda.time.field.TestOffsetDateTimeField)  Time elapsed: 0 sec  <<< ERROR!
java.lang.ArrayIndexOutOfBoundsException: -1
	at org.joda.time.TimeOfDay.getFieldType(TimeOfDay.java:464)
	at org.joda.time.chrono.BaseChronology.get(BaseChronology.java:59)
	at org.joda.time.base.BasePartial.<init>(BasePartial.java:111)
	at org.joda.time.base.BasePartial.<init>(BasePartial.java:65)
	at org.joda.time.TimeOfDay.<init>(TimeOfDay.java:199)
	at org.joda.time.field.TestOffsetDateTimeField.test_add_RP_int_intarray_int(TestOffsetDateTimeField.java:222)

test_addWrapField_RP_int_intarray_int(org.joda.time.field.TestOffsetDateTimeField)  Time elapsed: 0.001 sec  <<< ERROR!
java.lang.ArrayIndexOutOfBoundsException: -1
	at org.joda.time.TimeOfDay.getFieldType(TimeOfDay.java:464)
	at org.joda.time.chrono.BaseChronology.get(BaseChronology.java:59)
	at org.joda.time.base.BasePartial.<init>(BasePartial.java:111)
	at org.joda.time.base.BasePartial.<init>(BasePartial.java:65)
	at org.joda.time.TimeOfDay.<init>(TimeOfDay.java:199)
	at org.joda.time.field.TestOffsetDateTimeField.test_addWrapField_RP_int_intarray_int(TestOffsetDateTimeField.java:275)

test_set_RP_int_intarray_int(org.joda.time.field.TestOffsetDateTimeField)  Time elapsed: 0.001 sec  <<< ERROR!
java.lang.ArrayIndexOutOfBoundsException: -1
	at org.joda.time.TimeOfDay.getFieldType(TimeOfDay.java:464)
	at org.joda.time.chrono.BaseChronology.get(BaseChronology.java:59)
	at org.joda.time.base.BasePartial.<init>(BasePartial.java:111)
	at org.joda.time.base.BasePartial.<init>(BasePartial.java:65)
	at org.joda.time.TimeOfDay.<init>(TimeOfDay.java:199)
	at org.joda.time.field.TestOffsetDateTimeField.test_set_RP_int_intarray_int(TestOffsetDateTimeField.java:312)

test_set_RP_int_intarray_String_Locale(org.joda.time.field.TestPreciseDurationDateTimeField)  Time elapsed: 0.001 sec  <<< ERROR!
java.lang.ArrayIndexOutOfBoundsException: -1
	at org.joda.time.TimeOfDay.getFieldType(TimeOfDay.java:464)
	at org.joda.time.chrono.BaseChronology.get(BaseChronology.java:59)
	at org.joda.time.base.BasePartial.<init>(BasePartial.java:111)
	at org.joda.time.base.BasePartial.<init>(BasePartial.java:65)
	at org.joda.time.TimeOfDay.<init>(TimeOfDay.java:199)
	at org.joda.time.field.TestPreciseDurationDateTimeField.test_set_RP_int_intarray_String_Locale(TestPreciseDurationDateTimeField.java:325)

test_getMinimumValue_RP(org.joda.time.field.TestPreciseDurationDateTimeField)  Time elapsed: 0.001 sec  <<< ERROR!
java.lang.ArrayIndexOutOfBoundsException: -1
	at org.joda.time.TimeOfDay.getFieldType(TimeOfDay.java:464)
	at org.joda.time.chrono.BaseChronology.get(BaseChronology.java:59)
	at org.joda.time.base.BasePartial.<init>(BasePartial.java:111)
	at org.joda.time.base.BasePartial.<init>(BasePartial.java:65)
	at org.joda.time.TimeOfDay.<init>(TimeOfDay.java:199)
	at org.joda.time.field.TestPreciseDurationDateTimeField.test_getMinimumValue_RP(TestPreciseDurationDateTimeField.java:397)

test_getMinimumValue_RP_intarray(org.joda.time.field.TestPreciseDurationDateTimeField)  Time elapsed: 0 sec  <<< ERROR!
java.lang.ArrayIndexOutOfBoundsException: -1
	at org.joda.time.TimeOfDay.getFieldType(TimeOfDay.java:464)
	at org.joda.time.chrono.BaseChronology.get(BaseChronology.java:59)
	at org.joda.time.base.BasePartial.<init>(BasePartial.java:111)
	at org.joda.time.base.BasePartial.<init>(BasePartial.java:65)
	at org.joda.time.TimeOfDay.<init>(TimeOfDay.java:199)
	at org.joda.time.field.TestPreciseDurationDateTimeField.test_getMinimumValue_RP_intarray(TestPreciseDurationDateTimeField.java:402)

test_getMaximumValue_RP(org.joda.time.field.TestPreciseDurationDateTimeField)  Time elapsed: 0 sec  <<< ERROR!
java.lang.ArrayIndexOutOfBoundsException: -1
	at org.joda.time.TimeOfDay.getFieldType(TimeOfDay.java:464)
	at org.joda.time.chrono.BaseChronology.get(BaseChronology.java:59)
	at org.joda.time.base.BasePartial.<init>(BasePartial.java:111)
	at org.joda.time.base.BasePartial.<init>(BasePartial.java:65)
	at org.joda.time.TimeOfDay.<init>(TimeOfDay.java:199)
	at org.joda.time.field.TestPreciseDurationDateTimeField.test_getMaximumValue_RP(TestPreciseDurationDateTimeField.java:417)

test_getMaximumValue_RP_intarray(org.joda.time.field.TestPreciseDurationDateTimeField)  Time elapsed: 0.001 sec  <<< ERROR!
java.lang.ArrayIndexOutOfBoundsException: -1
	at org.joda.time.TimeOfDay.getFieldType(TimeOfDay.java:464)
	at org.joda.time.chrono.BaseChronology.get(BaseChronology.java:59)
	at org.joda.time.base.BasePartial.<init>(BasePartial.java:111)
	at org.joda.time.base.BasePartial.<init>(BasePartial.java:65)
	at org.joda.time.TimeOfDay.<init>(TimeOfDay.java:199)
	at org.joda.time.field.TestPreciseDurationDateTimeField.test_getMaximumValue_RP_intarray(TestPreciseDurationDateTimeField.java:422)

test_add_RP_int_intarray_int(org.joda.time.field.TestPreciseDurationDateTimeField)  Time elapsed: 0 sec  <<< ERROR!
java.lang.ArrayIndexOutOfBoundsException: -1
	at org.joda.time.TimeOfDay.getFieldType(TimeOfDay.java:464)
	at org.joda.time.chrono.BaseChronology.get(BaseChronology.java:59)
	at org.joda.time.base.BasePartial.<init>(BasePartial.java:111)
	at org.joda.time.base.BasePartial.<init>(BasePartial.java:65)
	at org.joda.time.TimeOfDay.<init>(TimeOfDay.java:199)
	at org.joda.time.field.TestPreciseDurationDateTimeField.test_add_RP_int_intarray_int(TestPreciseDurationDateTimeField.java:191)

test_addWrapField_RP_int_intarray_int(org.joda.time.field.TestPreciseDurationDateTimeField)  Time elapsed: 0.001 sec  <<< ERROR!
java.lang.ArrayIndexOutOfBoundsException: -1
	at org.joda.time.TimeOfDay.getFieldType(TimeOfDay.java:464)
	at org.joda.time.chrono.BaseChronology.get(BaseChronology.java:59)
	at org.joda.time.base.BasePartial.<init>(BasePartial.java:111)
	at org.joda.time.base.BasePartial.<init>(BasePartial.java:65)
	at org.joda.time.TimeOfDay.<init>(TimeOfDay.java:199)
	at org.joda.time.field.TestPreciseDurationDateTimeField.test_addWrapField_RP_int_intarray_int(TestPreciseDurationDateTimeField.java:239)

test_set_RP_int_intarray_int(org.joda.time.field.TestPreciseDurationDateTimeField)  Time elapsed: 0 sec  <<< ERROR!
java.lang.ArrayIndexOutOfBoundsException: -1
	at org.joda.time.TimeOfDay.getFieldType(TimeOfDay.java:464)
	at org.joda.time.chrono.BaseChronology.get(BaseChronology.java:59)
	at org.joda.time.base.BasePartial.<init>(BasePartial.java:111)
	at org.joda.time.base.BasePartial.<init>(BasePartial.java:65)
	at org.joda.time.TimeOfDay.<init>(TimeOfDay.java:199)
	at org.joda.time.field.TestPreciseDurationDateTimeField.test_set_RP_int_intarray_int(TestPreciseDurationDateTimeField.java:284)

test_set_RP_int_intarray_String_Locale(org.joda.time.field.TestPreciseDateTimeField)  Time elapsed: 0.001 sec  <<< ERROR!
java.lang.ArrayIndexOutOfBoundsException: -1
	at org.joda.time.TimeOfDay.getFieldType(TimeOfDay.java:464)
	at org.joda.time.chrono.BaseChronology.get(BaseChronology.java:59)
	at org.joda.time.base.BasePartial.<init>(BasePartial.java:111)
	at org.joda.time.base.BasePartial.<init>(BasePartial.java:65)
	at org.joda.time.TimeOfDay.<init>(TimeOfDay.java:199)
	at org.joda.time.field.TestPreciseDateTimeField.test_set_RP_int_intarray_String_Locale(TestPreciseDateTimeField.java:354)

test_getMinimumValue_RP(org.joda.time.field.TestPreciseDateTimeField)  Time elapsed: 0 sec  <<< ERROR!
java.lang.ArrayIndexOutOfBoundsException: -1
	at org.joda.time.TimeOfDay.getFieldType(TimeOfDay.java:464)
	at org.joda.time.chrono.BaseChronology.get(BaseChronology.java:59)
	at org.joda.time.base.BasePartial.<init>(BasePartial.java:111)
	at org.joda.time.base.BasePartial.<init>(BasePartial.java:65)
	at org.joda.time.TimeOfDay.<init>(TimeOfDay.java:199)
	at org.joda.time.field.TestPreciseDateTimeField.test_getMinimumValue_RP(TestPreciseDateTimeField.java:426)

test_getMinimumValue_RP_intarray(org.joda.time.field.TestPreciseDateTimeField)  Time elapsed: 0.001 sec  <<< ERROR!
java.lang.ArrayIndexOutOfBoundsException: -1
	at org.joda.time.TimeOfDay.getFieldType(TimeOfDay.java:464)
	at org.joda.time.chrono.BaseChronology.get(BaseChronology.java:59)
	at org.joda.time.base.BasePartial.<init>(BasePartial.java:111)
	at org.joda.time.base.BasePartial.<init>(BasePartial.java:65)
	at org.joda.time.TimeOfDay.<init>(TimeOfDay.java:199)
	at org.joda.time.field.TestPreciseDateTimeField.test_getMinimumValue_RP_intarray(TestPreciseDateTimeField.java:431)

test_getMaximumValue_RP(org.joda.time.field.TestPreciseDateTimeField)  Time elapsed: 0 sec  <<< ERROR!
java.lang.ArrayIndexOutOfBoundsException: -1
	at org.joda.time.TimeOfDay.getFieldType(TimeOfDay.java:464)
	at org.joda.time.chrono.BaseChronology.get(BaseChronology.java:59)
	at org.joda.time.base.BasePartial.<init>(BasePartial.java:111)
	at org.joda.time.base.BasePartial.<init>(BasePartial.java:65)
	at org.joda.time.TimeOfDay.<init>(TimeOfDay.java:199)
	at org.joda.time.field.TestPreciseDateTimeField.test_getMaximumValue_RP(TestPreciseDateTimeField.java:446)

test_getMaximumValue_RP_intarray(org.joda.time.field.TestPreciseDateTimeField)  Time elapsed: 0.001 sec  <<< ERROR!
java.lang.ArrayIndexOutOfBoundsException: -1
	at org.joda.time.TimeOfDay.getFieldType(TimeOfDay.java:464)
	at org.joda.time.chrono.BaseChronology.get(BaseChronology.java:59)
	at org.joda.time.base.BasePartial.<init>(BasePartial.java:111)
	at org.joda.time.base.BasePartial.<init>(BasePartial.java:65)
	at org.joda.time.TimeOfDay.<init>(TimeOfDay.java:199)
	at org.joda.time.field.TestPreciseDateTimeField.test_getMaximumValue_RP_intarray(TestPreciseDateTimeField.java:451)

test_add_RP_int_intarray_int(org.joda.time.field.TestPreciseDateTimeField)  Time elapsed: 0.001 sec  <<< ERROR!
java.lang.ArrayIndexOutOfBoundsException: -1
	at org.joda.time.TimeOfDay.getFieldType(TimeOfDay.java:464)
	at org.joda.time.chrono.BaseChronology.get(BaseChronology.java:59)
	at org.joda.time.base.BasePartial.<init>(BasePartial.java:111)
	at org.joda.time.base.BasePartial.<init>(BasePartial.java:65)
	at org.joda.time.TimeOfDay.<init>(TimeOfDay.java:199)
	at org.joda.time.field.TestPreciseDateTimeField.test_add_RP_int_intarray_int(TestPreciseDateTimeField.java:220)

test_addWrapField_RP_int_intarray_int(org.joda.time.field.TestPreciseDateTimeField)  Time elapsed: 0 sec  <<< ERROR!
java.lang.ArrayIndexOutOfBoundsException: -1
	at org.joda.time.TimeOfDay.getFieldType(TimeOfDay.java:464)
	at org.joda.time.chrono.BaseChronology.get(BaseChronology.java:59)
	at org.joda.time.base.BasePartial.<init>(BasePartial.java:111)
	at org.joda.time.base.BasePartial.<init>(BasePartial.java:65)
	at org.joda.time.TimeOfDay.<init>(TimeOfDay.java:199)
	at org.joda.time.field.TestPreciseDateTimeField.test_addWrapField_RP_int_intarray_int(TestPreciseDateTimeField.java:268)

test_set_RP_int_intarray_int(org.joda.time.field.TestPreciseDateTimeField)  Time elapsed: 0 sec  <<< ERROR!
java.lang.ArrayIndexOutOfBoundsException: -1
	at org.joda.time.TimeOfDay.getFieldType(TimeOfDay.java:464)
	at org.joda.time.chrono.BaseChronology.get(BaseChronology.java:59)
	at org.joda.time.base.BasePartial.<init>(BasePartial.java:111)
	at org.joda.time.base.BasePartial.<init>(BasePartial.java:65)
	at org.joda.time.TimeOfDay.<init>(TimeOfDay.java:199)
	at org.joda.time.field.TestPreciseDateTimeField.test_set_RP_int_intarray_int(TestPreciseDateTimeField.java:313)

testPrint_bufferMethods(org.joda.time.format.TestDateTimeFormatter)  Time elapsed: 0.001 sec  <<< ERROR!
java.lang.ArrayIndexOutOfBoundsException: -1
	at org.joda.time.YearMonthDay.getFieldType(YearMonthDay.java:351)
	at org.joda.time.chrono.BaseChronology.get(BaseChronology.java:59)
	at org.joda.time.base.BasePartial.<init>(BasePartial.java:111)
	at org.joda.time.YearMonthDay.<init>(YearMonthDay.java:211)
	at org.joda.time.DateTime.toYearMonthDay(DateTime.java:1565)
	at org.joda.time.format.TestDateTimeFormatter.testPrint_bufferMethods(TestDateTimeFormatter.java:171)

testPrint_writerMethods(org.joda.time.format.TestDateTimeFormatter)  Time elapsed: 0 sec  <<< ERROR!
java.lang.ArrayIndexOutOfBoundsException: -1
	at org.joda.time.YearMonthDay.getFieldType(YearMonthDay.java:351)
	at org.joda.time.chrono.BaseChronology.get(BaseChronology.java:59)
	at org.joda.time.base.BasePartial.<init>(BasePartial.java:111)
	at org.joda.time.YearMonthDay.<init>(YearMonthDay.java:211)
	at org.joda.time.DateTime.toYearMonthDay(DateTime.java:1565)
	at org.joda.time.format.TestDateTimeFormatter.testPrint_writerMethods(TestDateTimeFormatter.java:193)


Results :

Tests in error: 
  org.joda.time.TestDateMidnight_Basics#testToYearMonthDay ArrayIndexOutOfBoundsException
  org.joda.time.TestDateTime_Basics#testToTimeOfDay ArrayIndexOutOfBoundsException
  org.joda.time.TestDateTime_Basics#testToYearMonthDay ArrayIndexOutOfBoundsException
  org.joda.time.TestLocalDateTime_Basics#testCompareTo ArrayIndexOutOfBoundsException
  org.joda.time.TestLocalDateTime_Constructors#testConstructor_Object1 IndexOutOfBoundsException
  org.joda.time.TestLocalDateTime_Constructors#testConstructor_ObjectString1 IndexOutOfBoundsException
  org.joda.time.TestLocalDateTime_Constructors#testConstructor_ObjectString2 IndexOutOfBoundsException
  org.joda.time.TestLocalDateTime_Constructors#testConstructor_ObjectString3 IndexOutOfBoundsException
  org.joda.time.TestLocalDateTime_Constructors#testConstructor_ObjectString4 IndexOutOfBoundsException
  org.joda.time.TestLocalDateTime_Constructors#testConstructor_Object_Chronology IndexOutOfBoundsException
  org.joda.time.TestLocalDateTime_Constructors#testConstructor_Object_ChronologyMoscow IndexOutOfBoundsException
  org.joda.time.TestLocalDateTime_Constructors#testConstructor_Object_ChronologyMoscowBadDateTime IndexOutOfBoundsException
  org.joda.time.TestLocalDateTime_Constructors#testConstructor_Object_DateTimeZone IndexOutOfBoundsException
  org.joda.time.TestLocalDateTime_Constructors#testConstructor_Object_DateTimeZoneMoscow IndexOutOfBoundsException
  org.joda.time.TestLocalDateTime_Constructors#testConstructor_Object_DateTimeZoneMoscowBadDateTime IndexOutOfBoundsException
  org.joda.time.TestLocalDateTime_Constructors#testConstructor_Object_nullChronology IndexOutOfBoundsException
  org.joda.time.TestLocalDateTime_Constructors#testConstructor_Object_nullDateTimeZone IndexOutOfBoundsException
  org.joda.time.TestLocalDateTime_Constructors#testConstructor_nullObject IndexOutOfBoundsException
  org.joda.time.TestLocalDateTime_Constructors#testConstructor_nullObject_Chronology IndexOutOfBoundsException
  org.joda.time.TestLocalDateTime_Constructors#testConstructor_nullObject_DateTimeZone IndexOutOfBoundsException
  org.joda.time.TestLocalDateTime_Constructors#testConstructor_nullObject_nullChronology IndexOutOfBoundsException
  org.joda.time.TestLocalDateTime_Constructors#testConstructor_nullObject_nullDateTimeZone IndexOutOfBoundsException
  org.joda.time.TestLocalDate_Basics#testCompareTo ArrayIndexOutOfBoundsException
  org.joda.time.TestLocalDate_Constructors#testConstructor_Object1 IndexOutOfBoundsException
  org.joda.time.TestLocalDate_Constructors#testConstructor_ObjectString1 IndexOutOfBoundsException
  org.joda.time.TestLocalDate_Constructors#testConstructor_ObjectString2 IndexOutOfBoundsException
  org.joda.time.TestLocalDate_Constructors#testConstructor_ObjectString3 IndexOutOfBoundsException
  org.joda.time.TestLocalDate_Constructors#testConstructor_Object_Chronology IndexOutOfBoundsException
  org.joda.time.TestLocalDate_Constructors#testConstructor_Object_DateTimeZone IndexOutOfBoundsException
  org.joda.time.TestLocalDate_Constructors#testConstructor_Object_nullChronology IndexOutOfBoundsException
  org.joda.time.TestLocalDate_Constructors#testConstructor_Object_nullDateTimeZone IndexOutOfBoundsException
  org.joda.time.TestLocalDate_Constructors#testConstructor_nullObject IndexOutOfBoundsException
  org.joda.time.TestLocalDate_Constructors#testConstructor_nullObject_Chronology IndexOutOfBoundsException
  org.joda.time.TestLocalDate_Constructors#testConstructor_nullObject_DateTimeZone IndexOutOfBoundsException
  org.joda.time.TestLocalDate_Constructors#testConstructor_nullObject_nullChronology IndexOutOfBoundsException
  org.joda.time.TestLocalDate_Constructors#testConstructor_nullObject_nullDateTimeZone IndexOutOfBoundsException
  org.joda.time.TestLocalTime_Constructors#testConstructor_Object1 IndexOutOfBoundsException
  org.joda.time.TestLocalTime_Constructors#testConstructor_Object1_Chronology IndexOutOfBoundsException
  org.joda.time.TestLocalTime_Constructors#testConstructor_Object1_DateTimeZone IndexOutOfBoundsException
  org.joda.time.TestLocalTime_Constructors#testConstructor_Object2 IndexOutOfBoundsException
  org.joda.time.TestLocalTime_Constructors#testConstructor_Object2_Chronology IndexOutOfBoundsException
  org.joda.time.TestLocalTime_Constructors#testConstructor_ObjectString1 IndexOutOfBoundsException
  org.joda.time.TestLocalTime_Constructors#testConstructor_ObjectString1NewYork IndexOutOfBoundsException
  org.joda.time.TestLocalTime_Constructors#testConstructor_ObjectString1Tokyo IndexOutOfBoundsException
  org.joda.time.TestLocalTime_Constructors#testConstructor_ObjectString2 IndexOutOfBoundsException
  org.joda.time.TestLocalTime_Constructors#testConstructor_ObjectString3 IndexOutOfBoundsException
  org.joda.time.TestLocalTime_Constructors#testConstructor_ObjectString4 IndexOutOfBoundsException
  org.joda.time.TestLocalTime_Constructors#testConstructor_ObjectString_DateTimeZoneLondon IndexOutOfBoundsException
  org.joda.time.TestLocalTime_Constructors#testConstructor_ObjectString_DateTimeZoneNewYork IndexOutOfBoundsException
  org.joda.time.TestLocalTime_Constructors#testConstructor_ObjectString_DateTimeZoneTokyo IndexOutOfBoundsException
  org.joda.time.TestLocalTime_Constructors#testConstructor_Object_nullChronology IndexOutOfBoundsException
  org.joda.time.TestLocalTime_Constructors#testConstructor_Object_nullDateTimeZone IndexOutOfBoundsException
  org.joda.time.TestLocalTime_Constructors#testConstructor_nullObject IndexOutOfBoundsException
  org.joda.time.TestLocalTime_Constructors#testConstructor_nullObject_Chronology IndexOutOfBoundsException
  org.joda.time.TestLocalTime_Constructors#testConstructor_nullObject_DateTimeZone IndexOutOfBoundsException
  org.joda.time.TestLocalTime_Constructors#testConstructor_nullObject_nullChronology IndexOutOfBoundsException
  org.joda.time.TestLocalTime_Constructors#testConstructor_nullObject_nullDateTimeZone IndexOutOfBoundsException
  org.joda.time.TestMonthDay_Basics#testGet ArrayIndexOutOfBoundsException -1
  org.joda.time.TestMonthDay_Basics#testGetField ArrayIndexOutOfBoundsException ...
  org.joda.time.TestMonthDay_Basics#testGetFieldType ArrayIndexOutOfBoundsException
  org.joda.time.TestMonthDay_Basics#testGetFieldTypes ArrayIndexOutOfBoundsException
  org.joda.time.TestMonthDay_Basics#testGetFields ArrayIndexOutOfBoundsException
  org.joda.time.TestMonthDay_Basics#testGetValue ArrayIndexOutOfBoundsException ...
  org.joda.time.TestMonthDay_Basics#testGetValues ArrayIndexOutOfBoundsException
  org.joda.time.TestMonthDay_Basics#testIsSupported ArrayIndexOutOfBoundsException
  org.joda.time.TestMonthDay_Basics#testSize ArrayIndexOutOfBoundsException -1
  org.joda.time.TestMonthDay_Constructors#testConstructor ArrayIndexOutOfBoundsException
  org.joda.time.TestMonthDay_Constructors#testConstructor_Chronology ArrayIndexOutOfBoundsException
  org.joda.time.TestMonthDay_Constructors#testConstructor_DateTimeZone ArrayIndexOutOfBoundsException
  org.joda.time.TestMonthDay_Constructors#testConstructor_Object ArrayIndexOutOfBoundsException
  org.joda.time.TestMonthDay_Constructors#testConstructor_ObjectString1 ArrayIndexOutOfBoundsException
  org.joda.time.TestMonthDay_Constructors#testConstructor_ObjectString5 ArrayIndexOutOfBoundsException
  org.joda.time.TestMonthDay_Constructors#testConstructor_Object_Chronology ArrayIndexOutOfBoundsException
  org.joda.time.TestMonthDay_Constructors#testConstructor_Object_nullChronology ArrayIndexOutOfBoundsException
  org.joda.time.TestMonthDay_Constructors#testConstructor_long1 ArrayIndexOutOfBoundsException
  org.joda.time.TestMonthDay_Constructors#testConstructor_long1_Chronology ArrayIndexOutOfBoundsException
  org.joda.time.TestMonthDay_Constructors#testConstructor_long2 ArrayIndexOutOfBoundsException
  org.joda.time.TestMonthDay_Constructors#testConstructor_long2_Chronology ArrayIndexOutOfBoundsException
  org.joda.time.TestMonthDay_Constructors#testConstructor_long_nullChronology ArrayIndexOutOfBoundsException
  org.joda.time.TestMonthDay_Constructors#testConstructor_nullChronology ArrayIndexOutOfBoundsException
  org.joda.time.TestMonthDay_Constructors#testConstructor_nullDateTimeZone ArrayIndexOutOfBoundsException
  org.joda.time.TestMonthDay_Constructors#testConstructor_nullObject ArrayIndexOutOfBoundsException
  org.joda.time.TestMonthDay_Constructors#testConstructor_nullObject_Chronology ArrayIndexOutOfBoundsException
  org.joda.time.TestMonthDay_Constructors#testConstructor_nullObject_nullChronology ArrayIndexOutOfBoundsException
  org.joda.time.TestMonthDay_Properties#testPropertyCompareToDayOfMonth ArrayIndexOutOfBoundsException
  org.joda.time.TestMonthDay_Properties#testPropertyCompareToMonthOfYear ArrayIndexOutOfBoundsException
  org.joda.time.TestPartial_Basics#testCompareTo ArrayIndexOutOfBoundsException ...
  org.joda.time.TestSerialization#testSerializedTimeOfDay ArrayIndexOutOfBoundsException
  org.joda.time.TestSerialization#testSerializedYearMonthDay ArrayIndexOutOfBoundsException
  org.joda.time.TestTimeOfDay_Basics#testGet ArrayIndexOutOfBoundsException -1
  org.joda.time.TestTimeOfDay_Basics#testGetField ArrayIndexOutOfBoundsException
  org.joda.time.TestTimeOfDay_Basics#testGetFieldType ArrayIndexOutOfBoundsException
  org.joda.time.TestTimeOfDay_Basics#testGetFieldTypes ArrayIndexOutOfBoundsException
  org.joda.time.TestTimeOfDay_Basics#testGetFields ArrayIndexOutOfBoundsException
  org.joda.time.TestTimeOfDay_Basics#testIsSupported ArrayIndexOutOfBoundsException
  org.joda.time.TestTimeOfDay_Basics#testSize ArrayIndexOutOfBoundsException -1
  org.joda.time.TestTimeOfDay_Constructors#testConstructor ArrayIndexOutOfBoundsException
  org.joda.time.TestTimeOfDay_Constructors#testConstructor2_Object_Chronology ArrayIndexOutOfBoundsException
  org.joda.time.TestTimeOfDay_Constructors#testConstructor_Chronology ArrayIndexOutOfBoundsException
  org.joda.time.TestTimeOfDay_Constructors#testConstructor_DateTimeZone ArrayIndexOutOfBoundsException
  org.joda.time.TestTimeOfDay_Constructors#testConstructor_Object1 ArrayIndexOutOfBoundsException
  org.joda.time.TestTimeOfDay_Constructors#testConstructor_Object2 ArrayIndexOutOfBoundsException
  org.joda.time.TestTimeOfDay_Constructors#testConstructor_ObjectString1 ArrayIndexOutOfBoundsException
  org.joda.time.TestTimeOfDay_Constructors#testConstructor_ObjectString2 ArrayIndexOutOfBoundsException
  org.joda.time.TestTimeOfDay_Constructors#testConstructor_ObjectString3 ArrayIndexOutOfBoundsException
  org.joda.time.TestTimeOfDay_Constructors#testConstructor_ObjectString4 ArrayIndexOutOfBoundsException
  org.joda.time.TestTimeOfDay_Constructors#testConstructor_ObjectString5 ArrayIndexOutOfBoundsException
  org.joda.time.TestTimeOfDay_Constructors#testConstructor_ObjectString6 ArrayIndexOutOfBoundsException
  org.joda.time.TestTimeOfDay_Constructors#testConstructor_Object_Chronology ArrayIndexOutOfBoundsException
  org.joda.time.TestTimeOfDay_Constructors#testConstructor_Object_nullChronology ArrayIndexOutOfBoundsException
  org.joda.time.TestTimeOfDay_Constructors#testConstructor_long1 ArrayIndexOutOfBoundsException
  org.joda.time.TestTimeOfDay_Constructors#testConstructor_long1_Chronology ArrayIndexOutOfBoundsException
  org.joda.time.TestTimeOfDay_Constructors#testConstructor_long2 ArrayIndexOutOfBoundsException
  org.joda.time.TestTimeOfDay_Constructors#testConstructor_long2_Chronology ArrayIndexOutOfBoundsException
  org.joda.time.TestTimeOfDay_Constructors#testConstructor_long_nullChronology ArrayIndexOutOfBoundsException
  org.joda.time.TestTimeOfDay_Constructors#testConstructor_nullChronology ArrayIndexOutOfBoundsException
  org.joda.time.TestTimeOfDay_Constructors#testConstructor_nullDateTimeZone ArrayIndexOutOfBoundsException
  org.joda.time.TestTimeOfDay_Constructors#testConstructor_nullObject ArrayIndexOutOfBoundsException
  org.joda.time.TestTimeOfDay_Constructors#testConstructor_nullObject_Chronology ArrayIndexOutOfBoundsException
  org.joda.time.TestTimeOfDay_Constructors#testConstructor_nullObject_nullChronology ArrayIndexOutOfBoundsException
  org.joda.time.TestTimeOfDay_Constructors#testFactoryMillisOfDay_long1 ArrayIndexOutOfBoundsException
  org.joda.time.TestTimeOfDay_Constructors#testFactoryMillisOfDay_long1_Chronology ArrayIndexOutOfBoundsException
  org.joda.time.TestTimeOfDay_Constructors#testFactoryMillisOfDay_long_nullChronology ArrayIndexOutOfBoundsException
  org.joda.time.TestTimeOfDay_Properties#testPropertyCompareToHour ArrayIndexOutOfBoundsException
  org.joda.time.TestTimeOfDay_Properties#testPropertyCompareToMilli ArrayIndexOutOfBoundsException
  org.joda.time.TestTimeOfDay_Properties#testPropertyCompareToMinute ArrayIndexOutOfBoundsException
  org.joda.time.TestTimeOfDay_Properties#testPropertyCompareToSecond ArrayIndexOutOfBoundsException
  org.joda.time.TestYearMonthDay_Basics#testCompareTo ArrayIndexOutOfBoundsException
  org.joda.time.TestYearMonthDay_Basics#testGet ArrayIndexOutOfBoundsException -...
  org.joda.time.TestYearMonthDay_Basics#testGetField ArrayIndexOutOfBoundsException
  org.joda.time.TestYearMonthDay_Basics#testGetFieldType ArrayIndexOutOfBoundsException
  org.joda.time.TestYearMonthDay_Basics#testGetFieldTypes ArrayIndexOutOfBoundsException
  org.joda.time.TestYearMonthDay_Basics#testGetFields ArrayIndexOutOfBoundsException
  org.joda.time.TestYearMonthDay_Basics#testGetValue ArrayIndexOutOfBoundsException
  org.joda.time.TestYearMonthDay_Basics#testGetValues ArrayIndexOutOfBoundsException
  org.joda.time.TestYearMonthDay_Basics#testIsSupported ArrayIndexOutOfBoundsException
  org.joda.time.TestYearMonthDay_Basics#testSize ArrayIndexOutOfBoundsException ...
  org.joda.time.TestYearMonthDay_Constructors#testConstructor ArrayIndexOutOfBoundsException
  org.joda.time.TestYearMonthDay_Constructors#testConstructor_Chronology ArrayIndexOutOfBoundsException
  org.joda.time.TestYearMonthDay_Constructors#testConstructor_DateTimeZone ArrayIndexOutOfBoundsException
  org.joda.time.TestYearMonthDay_Constructors#testConstructor_Object ArrayIndexOutOfBoundsException
  org.joda.time.TestYearMonthDay_Constructors#testConstructor_ObjectString1 ArrayIndexOutOfBoundsException
  org.joda.time.TestYearMonthDay_Constructors#testConstructor_ObjectString2 ArrayIndexOutOfBoundsException
  org.joda.time.TestYearMonthDay_Constructors#testConstructor_ObjectString3 ArrayIndexOutOfBoundsException
  org.joda.time.TestYearMonthDay_Constructors#testConstructor_ObjectString4 ArrayIndexOutOfBoundsException
  org.joda.time.TestYearMonthDay_Constructors#testConstructor_ObjectString5 ArrayIndexOutOfBoundsException
  org.joda.time.TestYearMonthDay_Constructors#testConstructor_Object_Chronology ArrayIndexOutOfBoundsException
  org.joda.time.TestYearMonthDay_Constructors#testConstructor_Object_nullChronology ArrayIndexOutOfBoundsException
  org.joda.time.TestYearMonthDay_Constructors#testConstructor_long1 ArrayIndexOutOfBoundsException
  org.joda.time.TestYearMonthDay_Constructors#testConstructor_long1_Chronology ArrayIndexOutOfBoundsException
  org.joda.time.TestYearMonthDay_Constructors#testConstructor_long2 ArrayIndexOutOfBoundsException
  org.joda.time.TestYearMonthDay_Constructors#testConstructor_long2_Chronology ArrayIndexOutOfBoundsException
  org.joda.time.TestYearMonthDay_Constructors#testConstructor_long_nullChronology ArrayIndexOutOfBoundsException
  org.joda.time.TestYearMonthDay_Constructors#testConstructor_nullChronology ArrayIndexOutOfBoundsException
  org.joda.time.TestYearMonthDay_Constructors#testConstructor_nullDateTimeZone ArrayIndexOutOfBoundsException
  org.joda.time.TestYearMonthDay_Constructors#testConstructor_nullObject ArrayIndexOutOfBoundsException
  org.joda.time.TestYearMonthDay_Constructors#testConstructor_nullObject_Chronology ArrayIndexOutOfBoundsException
  org.joda.time.TestYearMonthDay_Constructors#testConstructor_nullObject_nullChronology ArrayIndexOutOfBoundsException
  org.joda.time.TestYearMonthDay_Properties#testPropertyAddDay ArrayIndexOutOfBoundsException
  org.joda.time.TestYearMonthDay_Properties#testPropertyAddMonth ArrayIndexOutOfBoundsException
  org.joda.time.TestYearMonthDay_Properties#testPropertyCompareToDay ArrayIndexOutOfBoundsException
  org.joda.time.TestYearMonthDay_Properties#testPropertyCompareToMonth ArrayIndexOutOfBoundsException
  org.joda.time.TestYearMonthDay_Properties#testPropertyCompareToYear ArrayIndexOutOfBoundsException
  org.joda.time.TestYearMonth_Basics#testGet ArrayIndexOutOfBoundsException -1
  org.joda.time.TestYearMonth_Basics#testGetField ArrayIndexOutOfBoundsException
  org.joda.time.TestYearMonth_Basics#testGetFieldType ArrayIndexOutOfBoundsException
  org.joda.time.TestYearMonth_Basics#testGetFieldTypes ArrayIndexOutOfBoundsException
  org.joda.time.TestYearMonth_Basics#testGetFields ArrayIndexOutOfBoundsException
  org.joda.time.TestYearMonth_Basics#testGetValue ArrayIndexOutOfBoundsException
  org.joda.time.TestYearMonth_Basics#testGetValues ArrayIndexOutOfBoundsException
  org.joda.time.TestYearMonth_Basics#testIsSupported ArrayIndexOutOfBoundsException
  org.joda.time.TestYearMonth_Basics#testSize ArrayIndexOutOfBoundsException -1
  org.joda.time.TestYearMonth_Constructors#testConstructor ArrayIndexOutOfBoundsException
  org.joda.time.TestYearMonth_Constructors#testConstructor_Chronology ArrayIndexOutOfBoundsException
  org.joda.time.TestYearMonth_Constructors#testConstructor_DateTimeZone ArrayIndexOutOfBoundsException
  org.joda.time.TestYearMonth_Constructors#testConstructor_Object ArrayIndexOutOfBoundsException
  org.joda.time.TestYearMonth_Constructors#testConstructor_ObjectString1 ArrayIndexOutOfBoundsException
  org.joda.time.TestYearMonth_Constructors#testConstructor_ObjectString5 ArrayIndexOutOfBoundsException
  org.joda.time.TestYearMonth_Constructors#testConstructor_Object_Chronology ArrayIndexOutOfBoundsException
  org.joda.time.TestYearMonth_Constructors#testConstructor_Object_nullChronology ArrayIndexOutOfBoundsException
  org.joda.time.TestYearMonth_Constructors#testConstructor_long1 ArrayIndexOutOfBoundsException
  org.joda.time.TestYearMonth_Constructors#testConstructor_long1_Chronology ArrayIndexOutOfBoundsException
  org.joda.time.TestYearMonth_Constructors#testConstructor_long2 ArrayIndexOutOfBoundsException
  org.joda.time.TestYearMonth_Constructors#testConstructor_long2_Chronology ArrayIndexOutOfBoundsException
  org.joda.time.TestYearMonth_Constructors#testConstructor_long_nullChronology ArrayIndexOutOfBoundsException
  org.joda.time.TestYearMonth_Constructors#testConstructor_nullChronology ArrayIndexOutOfBoundsException
  org.joda.time.TestYearMonth_Constructors#testConstructor_nullDateTimeZone ArrayIndexOutOfBoundsException
  org.joda.time.TestYearMonth_Constructors#testConstructor_nullObject ArrayIndexOutOfBoundsException
  org.joda.time.TestYearMonth_Constructors#testConstructor_nullObject_Chronology ArrayIndexOutOfBoundsException
  org.joda.time.TestYearMonth_Constructors#testConstructor_nullObject_nullChronology ArrayIndexOutOfBoundsException
  org.joda.time.TestYearMonth_Properties#testPropertyAddMonth ArrayIndexOutOfBoundsException
  org.joda.time.TestYearMonth_Properties#testPropertyCompareToMonth ArrayIndexOutOfBoundsException
  org.joda.time.TestYearMonth_Properties#testPropertyCompareToYear ArrayIndexOutOfBoundsException
  org.joda.time.chrono.TestGJChronology#testCutoverAddDays ArrayIndexOutOfBoundsException
  org.joda.time.chrono.TestGJChronology#testCutoverAddMonths ArrayIndexOutOfBoundsException
  org.joda.time.chrono.TestGJChronology#testCutoverAddYears ArrayIndexOutOfBoundsException
  org.joda.time.chrono.TestGJChronology#testMaximumValue ArrayIndexOutOfBoundsException
  org.joda.time.chrono.TestGJChronology#testPartialGetAsText ArrayIndexOutOfBoundsException
  org.joda.time.chrono.TestGJChronology#testSubtractDays ArrayIndexOutOfBoundsException
  org.joda.time.chrono.TestGJChronology#testYearEndAddDays ArrayIndexOutOfBoundsException
  org.joda.time.chrono.TestISOChronology#testAddMonths ArrayIndexOutOfBoundsException
  org.joda.time.chrono.TestISOChronology#testCutoverAddYears ArrayIndexOutOfBoundsException
  org.joda.time.chrono.TestISOChronology#testMaximumValue ArrayIndexOutOfBoundsException
  org.joda.time.convert.TestCalendarConverter#testGetPartialValues ArrayIndexOutOfBoundsException
  org.joda.time.convert.TestConverterManager#testGetPartialConverter ArrayIndexOutOfBoundsException
  org.joda.time.convert.TestDateConverter#testGetPartialValues ArrayIndexOutOfBoundsException
  org.joda.time.convert.TestLongConverter#testGetPartialValues ArrayIndexOutOfBoundsException
  org.joda.time.convert.TestNullConverter#testGetPartialValues ArrayIndexOutOfBoundsException
  org.joda.time.convert.TestReadableInstantConverter#testGetPartialValues ArrayIndexOutOfBoundsException
  org.joda.time.convert.TestReadablePartialConverter#testGetChronology_Object_Chronology ArrayIndexOutOfBoundsException
  org.joda.time.convert.TestReadablePartialConverter#testGetChronology_Object_Zone ArrayIndexOutOfBoundsException
  org.joda.time.convert.TestReadablePartialConverter#testGetPartialValues ArrayIndexOutOfBoundsException
  org.joda.time.convert.TestStringConverter#testGetPartialValues ArrayIndexOutOfBoundsException
  org.joda.time.field.TestBaseDateTimeField#test_addWrapField_RP_int_intarray_int ArrayIndexOutOfBoundsException
  org.joda.time.field.TestBaseDateTimeField#test_add_RP_int_intarray_int ArrayIndexOutOfBoundsException
  org.joda.time.field.TestBaseDateTimeField#test_getMaximumValue_RP ArrayIndexOutOfBoundsException
  org.joda.time.field.TestBaseDateTimeField#test_getMaximumValue_RP_intarray ArrayIndexOutOfBoundsException
  org.joda.time.field.TestBaseDateTimeField#test_getMinimumValue_RP ArrayIndexOutOfBoundsException
  org.joda.time.field.TestBaseDateTimeField#test_getMinimumValue_RP_intarray ArrayIndexOutOfBoundsException
  org.joda.time.field.TestBaseDateTimeField#test_set_RP_int_intarray_String_Locale ArrayIndexOutOfBoundsException
  org.joda.time.field.TestBaseDateTimeField#test_set_RP_int_intarray_int ArrayIndexOutOfBoundsException
  org.joda.time.field.TestOffsetDateTimeField#test_addWrapField_RP_int_intarray_int ArrayIndexOutOfBoundsException
  org.joda.time.field.TestOffsetDateTimeField#test_add_RP_int_intarray_int ArrayIndexOutOfBoundsException
  org.joda.time.field.TestOffsetDateTimeField#test_getMaximumValue_RP ArrayIndexOutOfBoundsException
  org.joda.time.field.TestOffsetDateTimeField#test_getMaximumValue_RP_intarray ArrayIndexOutOfBoundsException
  org.joda.time.field.TestOffsetDateTimeField#test_getMinimumValue_RP ArrayIndexOutOfBoundsException
  org.joda.time.field.TestOffsetDateTimeField#test_getMinimumValue_RP_intarray ArrayIndexOutOfBoundsException
  org.joda.time.field.TestOffsetDateTimeField#test_set_RP_int_intarray_String_Locale ArrayIndexOutOfBoundsException
  org.joda.time.field.TestOffsetDateTimeField#test_set_RP_int_intarray_int ArrayIndexOutOfBoundsException
  org.joda.time.field.TestPreciseDateTimeField#test_addWrapField_RP_int_intarray_int ArrayIndexOutOfBoundsException
  org.joda.time.field.TestPreciseDateTimeField#test_add_RP_int_intarray_int ArrayIndexOutOfBoundsException
  org.joda.time.field.TestPreciseDateTimeField#test_getMaximumValue_RP ArrayIndexOutOfBoundsException
  org.joda.time.field.TestPreciseDateTimeField#test_getMaximumValue_RP_intarray ArrayIndexOutOfBoundsException
  org.joda.time.field.TestPreciseDateTimeField#test_getMinimumValue_RP ArrayIndexOutOfBoundsException
  org.joda.time.field.TestPreciseDateTimeField#test_getMinimumValue_RP_intarray ArrayIndexOutOfBoundsException
  org.joda.time.field.TestPreciseDateTimeField#test_set_RP_int_intarray_String_Locale ArrayIndexOutOfBoundsException
  org.joda.time.field.TestPreciseDateTimeField#test_set_RP_int_intarray_int ArrayIndexOutOfBoundsException
  org.joda.time.field.TestPreciseDurationDateTimeField#test_addWrapField_RP_int_intarray_int ArrayIndexOutOfBoundsException
  org.joda.time.field.TestPreciseDurationDateTimeField#test_add_RP_int_intarray_int ArrayIndexOutOfBoundsException
  org.joda.time.field.TestPreciseDurationDateTimeField#test_getMaximumValue_RP ArrayIndexOutOfBoundsException
  org.joda.time.field.TestPreciseDurationDateTimeField#test_getMaximumValue_RP_intarray ArrayIndexOutOfBoundsException
  org.joda.time.field.TestPreciseDurationDateTimeField#test_getMinimumValue_RP ArrayIndexOutOfBoundsException
  org.joda.time.field.TestPreciseDurationDateTimeField#test_getMinimumValue_RP_intarray ArrayIndexOutOfBoundsException
  org.joda.time.field.TestPreciseDurationDateTimeField#test_set_RP_int_intarray_String_Locale ArrayIndexOutOfBoundsException
  org.joda.time.field.TestPreciseDurationDateTimeField#test_set_RP_int_intarray_int ArrayIndexOutOfBoundsException
  org.joda.time.format.TestDateTimeFormatter#testPrint_bufferMethods ArrayIndexOutOfBoundsException
  org.joda.time.format.TestDateTimeFormatter#testPrint_writerMethods ArrayIndexOutOfBoundsException

Tests run: 4157, Failures: 0, Errors: 247, Skipped: 0

[INFO] ------------------------------------------------------------------------
[INFO] BUILD FAILURE
[INFO] ------------------------------------------------------------------------
[INFO] Total time: 18.498s
[INFO] Finished at: Wed Aug 05 21:47:56 BST 2015
[INFO] Final Memory: 9M/213M
[INFO] ------------------------------------------------------------------------
[ERROR] Failed to execute goal org.apache.maven.plugins:maven-surefire-plugin:2.18.1:test (default-test) on project joda-time: There are test failures.
[ERROR] 
[ERROR] Please refer to /home/perham/Study/LittleDarwin/Cases/joda-time-2.8.1/target/surefire-reports for the individual test results.
[ERROR] -> [Help 1]
[ERROR] 
[ERROR] To see the full stack trace of the errors, re-run Maven with the -e switch.
[ERROR] Re-run Maven using the -X switch to enable full debug logging.
[ERROR] 
[ERROR] For more information about the errors and possible solutions, please read the following articles:
[ERROR] [Help 1] http://cwiki.apache.org/confluence/display/MAVEN/MojoFailureException
