[INFO] Scanning for projects...
[INFO]                                                                         
[INFO] ------------------------------------------------------------------------
[INFO] Building Joda-Time 2.8.1
[INFO] ------------------------------------------------------------------------
[INFO] 
[INFO] --- maven-resources-plugin:2.7:resources (default-resources) @ joda-time ---
[INFO] Using 'UTF-8' encoding to copy filtered resources.
[INFO] Copying 2 resources to META-INF
[INFO] Copying 10 resources
[INFO] 
[INFO] --- maven-compiler-plugin:3.3:compile (default-compile) @ joda-time ---
[INFO] Changes detected - recompiling the module!
[INFO] Compiling 166 source files to /home/perham/Study/LittleDarwin/Cases/joda-time-2.8.1/target/classes
[INFO] 
[INFO] --- exec-maven-plugin:1.4.0:java (compile-tzdb) @ joda-time ---
Writing zoneinfo files
Writing ZoneInfoMap
[INFO] 
[INFO] --- maven-resources-plugin:2.7:testResources (default-testResources) @ joda-time ---
[INFO] Using 'UTF-8' encoding to copy filtered resources.
[INFO] Copying 34 resources
[INFO] 
[INFO] --- maven-compiler-plugin:3.3:testCompile (default-testCompile) @ joda-time ---
[INFO] Nothing to compile - all classes are up to date
[INFO] 
[INFO] --- maven-surefire-plugin:2.18.1:test (default-test) @ joda-time ---
[INFO] Surefire report directory: /home/perham/Study/LittleDarwin/Cases/joda-time-2.8.1/target/surefire-reports

-------------------------------------------------------
 T E S T S
-------------------------------------------------------
Running org.joda.time.TestAllPackages

TestBuddhistChronology.testCalendar

TestCopticChronology.testCalendar

TestEthiopicChronology.testCalendar

TestIslamicChronology.testCalendar

Testing Gregorian chronology over 1000 iterations
100% complete (i=1000)

Testing Julian chronology over 1000 iterations
100% complete (i=1000)
Writing zoneinfo files
Writing ZoneInfoMap
Tests run: 4157, Failures: 0, Errors: 104, Skipped: 0, Time elapsed: 8.073 sec <<< FAILURE! - in org.joda.time.TestAllPackages
testToPeriod(org.joda.time.TestDuration_Basics)  Time elapsed: 0.007 sec  <<< ERROR!
java.lang.ArrayIndexOutOfBoundsException: -1
	at org.joda.time.PeriodType.getFieldType(PeriodType.java:628)
	at org.joda.time.base.AbstractPeriod.getFieldType(AbstractPeriod.java:68)
	at org.joda.time.chrono.BaseChronology.get(BaseChronology.java:79)
	at org.joda.time.base.BasePeriod.<init>(BasePeriod.java:236)
	at org.joda.time.Period.<init>(Period.java:382)
	at org.joda.time.base.AbstractDuration.toPeriod(AbstractDuration.java:80)
	at org.joda.time.TestDuration_Basics.testToPeriod(TestDuration_Basics.java:456)

testToPeriod_PeriodType(org.joda.time.TestDuration_Basics)  Time elapsed: 0.002 sec  <<< ERROR!
java.lang.ArrayIndexOutOfBoundsException: -1
	at org.joda.time.PeriodType.getFieldType(PeriodType.java:628)
	at org.joda.time.base.AbstractPeriod.getFieldType(AbstractPeriod.java:68)
	at org.joda.time.chrono.BaseChronology.get(BaseChronology.java:79)
	at org.joda.time.base.BasePeriod.<init>(BasePeriod.java:258)
	at org.joda.time.Period.<init>(Period.java:402)
	at org.joda.time.base.BaseDuration.toPeriod(BaseDuration.java:144)
	at org.joda.time.TestDuration_Basics.testToPeriod_PeriodType(TestDuration_Basics.java:502)

testToPeriod_Chronology(org.joda.time.TestDuration_Basics)  Time elapsed: 0 sec  <<< ERROR!
java.lang.ArrayIndexOutOfBoundsException: -1
	at org.joda.time.PeriodType.getFieldType(PeriodType.java:628)
	at org.joda.time.base.AbstractPeriod.getFieldType(AbstractPeriod.java:68)
	at org.joda.time.chrono.BaseChronology.get(BaseChronology.java:79)
	at org.joda.time.base.BasePeriod.<init>(BasePeriod.java:258)
	at org.joda.time.Period.<init>(Period.java:423)
	at org.joda.time.base.BaseDuration.toPeriod(BaseDuration.java:164)
	at org.joda.time.TestDuration_Basics.testToPeriod_Chronology(TestDuration_Basics.java:515)

testToPeriod_PeriodType_Chronology(org.joda.time.TestDuration_Basics)  Time elapsed: 0.001 sec  <<< ERROR!
java.lang.ArrayIndexOutOfBoundsException: -1
	at org.joda.time.PeriodType.getFieldType(PeriodType.java:628)
	at org.joda.time.base.AbstractPeriod.getFieldType(AbstractPeriod.java:68)
	at org.joda.time.chrono.BaseChronology.get(BaseChronology.java:79)
	at org.joda.time.base.BasePeriod.<init>(BasePeriod.java:258)
	at org.joda.time.Period.<init>(Period.java:444)
	at org.joda.time.base.BaseDuration.toPeriod(BaseDuration.java:185)
	at org.joda.time.TestDuration_Basics.testToPeriod_PeriodType_Chronology(TestDuration_Basics.java:528)

testToPeriod_fixedZone(org.joda.time.TestDuration_Basics)  Time elapsed: 0.001 sec  <<< ERROR!
java.lang.ArrayIndexOutOfBoundsException: -1
	at org.joda.time.PeriodType.getFieldType(PeriodType.java:628)
	at org.joda.time.base.AbstractPeriod.getFieldType(AbstractPeriod.java:68)
	at org.joda.time.chrono.BaseChronology.get(BaseChronology.java:79)
	at org.joda.time.base.BasePeriod.<init>(BasePeriod.java:236)
	at org.joda.time.Period.<init>(Period.java:382)
	at org.joda.time.base.AbstractDuration.toPeriod(AbstractDuration.java:80)
	at org.joda.time.TestDuration_Basics.testToPeriod_fixedZone(TestDuration_Basics.java:480)

testConstructor_RI_RP4(org.joda.time.TestInterval_Constructors)  Time elapsed: 0.001 sec  <<< ERROR!
java.lang.ArrayIndexOutOfBoundsException: -1
	at org.joda.time.PeriodType.getFieldType(PeriodType.java:628)
	at org.joda.time.base.AbstractPeriod.getFieldType(AbstractPeriod.java:68)
	at org.joda.time.chrono.BaseChronology.get(BaseChronology.java:79)
	at org.joda.time.base.BasePeriod.<init>(BasePeriod.java:236)
	at org.joda.time.Period.<init>(Period.java:382)
	at org.joda.time.TestInterval_Constructors.testConstructor_RI_RP4(TestInterval_Constructors.java:308)

testConstructor_RP_RI4(org.joda.time.TestInterval_Constructors)  Time elapsed: 0.002 sec  <<< ERROR!
java.lang.ArrayIndexOutOfBoundsException: -1
	at org.joda.time.PeriodType.getFieldType(PeriodType.java:628)
	at org.joda.time.base.AbstractPeriod.getFieldType(AbstractPeriod.java:68)
	at org.joda.time.chrono.BaseChronology.get(BaseChronology.java:79)
	at org.joda.time.base.BasePeriod.<init>(BasePeriod.java:236)
	at org.joda.time.Period.<init>(Period.java:382)
	at org.joda.time.TestInterval_Constructors.testConstructor_RP_RI4(TestInterval_Constructors.java:392)

testConstructor_RI_RP4(org.joda.time.TestMutableInterval_Constructors)  Time elapsed: 0.001 sec  <<< ERROR!
java.lang.ArrayIndexOutOfBoundsException: -1
	at org.joda.time.PeriodType.getFieldType(PeriodType.java:628)
	at org.joda.time.base.AbstractPeriod.getFieldType(AbstractPeriod.java:68)
	at org.joda.time.chrono.BaseChronology.get(BaseChronology.java:79)
	at org.joda.time.base.BasePeriod.<init>(BasePeriod.java:236)
	at org.joda.time.Period.<init>(Period.java:382)
	at org.joda.time.TestMutableInterval_Constructors.testConstructor_RI_RP4(TestMutableInterval_Constructors.java:284)

testConstructor_RP_RI4(org.joda.time.TestMutableInterval_Constructors)  Time elapsed: 0.001 sec  <<< ERROR!
java.lang.ArrayIndexOutOfBoundsException: -1
	at org.joda.time.PeriodType.getFieldType(PeriodType.java:628)
	at org.joda.time.base.AbstractPeriod.getFieldType(AbstractPeriod.java:68)
	at org.joda.time.chrono.BaseChronology.get(BaseChronology.java:79)
	at org.joda.time.base.BasePeriod.<init>(BasePeriod.java:236)
	at org.joda.time.Period.<init>(Period.java:382)
	at org.joda.time.TestMutableInterval_Constructors.testConstructor_RP_RI4(TestMutableInterval_Constructors.java:368)

testSetPeriodAfterStart_RI1(org.joda.time.TestMutableInterval_Updates)  Time elapsed: 0 sec  <<< ERROR!
java.lang.ArrayIndexOutOfBoundsException: -1
	at org.joda.time.PeriodType.getFieldType(PeriodType.java:628)
	at org.joda.time.base.AbstractPeriod.getFieldType(AbstractPeriod.java:68)
	at org.joda.time.chrono.BaseChronology.get(BaseChronology.java:79)
	at org.joda.time.base.BasePeriod.<init>(BasePeriod.java:236)
	at org.joda.time.Period.<init>(Period.java:382)
	at org.joda.time.TestMutableInterval_Updates.testSetPeriodAfterStart_RI1(TestMutableInterval_Updates.java:355)

testSePeriodAfterStart_RI2(org.joda.time.TestMutableInterval_Updates)  Time elapsed: 0 sec  <<< ERROR!
java.lang.ArrayIndexOutOfBoundsException: -1
	at org.joda.time.PeriodType.getFieldType(PeriodType.java:628)
	at org.joda.time.base.AbstractPeriod.getFieldType(AbstractPeriod.java:68)
	at org.joda.time.chrono.BaseChronology.get(BaseChronology.java:79)
	at org.joda.time.base.BasePeriod.<init>(BasePeriod.java:236)
	at org.joda.time.Period.<init>(Period.java:382)
	at org.joda.time.TestMutableInterval_Updates.testSePeriodAfterStart_RI2(TestMutableInterval_Updates.java:363)

testSetPeriodBeforeEnd_RI1(org.joda.time.TestMutableInterval_Updates)  Time elapsed: 0 sec  <<< ERROR!
java.lang.ArrayIndexOutOfBoundsException: -1
	at org.joda.time.PeriodType.getFieldType(PeriodType.java:628)
	at org.joda.time.base.AbstractPeriod.getFieldType(AbstractPeriod.java:68)
	at org.joda.time.chrono.BaseChronology.get(BaseChronology.java:79)
	at org.joda.time.base.BasePeriod.<init>(BasePeriod.java:236)
	at org.joda.time.Period.<init>(Period.java:382)
	at org.joda.time.TestMutableInterval_Updates.testSetPeriodBeforeEnd_RI1(TestMutableInterval_Updates.java:378)

testSePeriodBeforeEnd_RI2(org.joda.time.TestMutableInterval_Updates)  Time elapsed: 0 sec  <<< ERROR!
java.lang.ArrayIndexOutOfBoundsException: -1
	at org.joda.time.PeriodType.getFieldType(PeriodType.java:628)
	at org.joda.time.base.AbstractPeriod.getFieldType(AbstractPeriod.java:68)
	at org.joda.time.chrono.BaseChronology.get(BaseChronology.java:79)
	at org.joda.time.base.BasePeriod.<init>(BasePeriod.java:236)
	at org.joda.time.Period.<init>(Period.java:382)
	at org.joda.time.TestMutableInterval_Updates.testSePeriodBeforeEnd_RI2(TestMutableInterval_Updates.java:386)

testConstructor_long1(org.joda.time.TestPeriod_Constructors)  Time elapsed: 0 sec  <<< ERROR!
java.lang.ArrayIndexOutOfBoundsException: -1
	at org.joda.time.PeriodType.getFieldType(PeriodType.java:628)
	at org.joda.time.base.AbstractPeriod.getFieldType(AbstractPeriod.java:68)
	at org.joda.time.chrono.BaseChronology.get(BaseChronology.java:79)
	at org.joda.time.base.BasePeriod.<init>(BasePeriod.java:236)
	at org.joda.time.Period.<init>(Period.java:382)
	at org.joda.time.TestPeriod_Constructors.testConstructor_long1(TestPeriod_Constructors.java:127)

testConstructor_long2(org.joda.time.TestPeriod_Constructors)  Time elapsed: 0 sec  <<< ERROR!
java.lang.ArrayIndexOutOfBoundsException: -1
	at org.joda.time.PeriodType.getFieldType(PeriodType.java:628)
	at org.joda.time.base.AbstractPeriod.getFieldType(AbstractPeriod.java:68)
	at org.joda.time.chrono.BaseChronology.get(BaseChronology.java:79)
	at org.joda.time.base.BasePeriod.<init>(BasePeriod.java:236)
	at org.joda.time.Period.<init>(Period.java:382)
	at org.joda.time.TestPeriod_Constructors.testConstructor_long2(TestPeriod_Constructors.java:144)

testConstructor_long3(org.joda.time.TestPeriod_Constructors)  Time elapsed: 0 sec  <<< ERROR!
java.lang.ArrayIndexOutOfBoundsException: -1
	at org.joda.time.PeriodType.getFieldType(PeriodType.java:628)
	at org.joda.time.base.AbstractPeriod.getFieldType(AbstractPeriod.java:68)
	at org.joda.time.chrono.BaseChronology.get(BaseChronology.java:79)
	at org.joda.time.base.BasePeriod.<init>(BasePeriod.java:236)
	at org.joda.time.Period.<init>(Period.java:382)
	at org.joda.time.TestPeriod_Constructors.testConstructor_long3(TestPeriod_Constructors.java:162)

testConstructor_long_fixedZone(org.joda.time.TestPeriod_Constructors)  Time elapsed: 0.001 sec  <<< ERROR!
java.lang.ArrayIndexOutOfBoundsException: -1
	at org.joda.time.PeriodType.getFieldType(PeriodType.java:628)
	at org.joda.time.base.AbstractPeriod.getFieldType(AbstractPeriod.java:68)
	at org.joda.time.chrono.BaseChronology.get(BaseChronology.java:79)
	at org.joda.time.base.BasePeriod.<init>(BasePeriod.java:236)
	at org.joda.time.Period.<init>(Period.java:382)
	at org.joda.time.TestPeriod_Constructors.testConstructor_long_fixedZone(TestPeriod_Constructors.java:184)

testConstructor_long_PeriodType1(org.joda.time.TestPeriod_Constructors)  Time elapsed: 0.001 sec  <<< ERROR!
java.lang.ArrayIndexOutOfBoundsException: -1
	at org.joda.time.PeriodType.getFieldType(PeriodType.java:628)
	at org.joda.time.base.AbstractPeriod.getFieldType(AbstractPeriod.java:68)
	at org.joda.time.chrono.BaseChronology.get(BaseChronology.java:79)
	at org.joda.time.base.BasePeriod.<init>(BasePeriod.java:258)
	at org.joda.time.Period.<init>(Period.java:402)
	at org.joda.time.TestPeriod_Constructors.testConstructor_long_PeriodType1(TestPeriod_Constructors.java:206)

testConstructor_long_PeriodType2(org.joda.time.TestPeriod_Constructors)  Time elapsed: 0 sec  <<< ERROR!
java.lang.ArrayIndexOutOfBoundsException: -1
	at org.joda.time.PeriodType.getFieldType(PeriodType.java:628)
	at org.joda.time.base.AbstractPeriod.getFieldType(AbstractPeriod.java:68)
	at org.joda.time.chrono.BaseChronology.get(BaseChronology.java:79)
	at org.joda.time.base.BasePeriod.<init>(BasePeriod.java:258)
	at org.joda.time.Period.<init>(Period.java:402)
	at org.joda.time.TestPeriod_Constructors.testConstructor_long_PeriodType2(TestPeriod_Constructors.java:223)

testConstructor_long_PeriodType3(org.joda.time.TestPeriod_Constructors)  Time elapsed: 0.001 sec  <<< ERROR!
java.lang.ArrayIndexOutOfBoundsException: -1
	at org.joda.time.PeriodType.getFieldType(PeriodType.java:628)
	at org.joda.time.base.AbstractPeriod.getFieldType(AbstractPeriod.java:68)
	at org.joda.time.chrono.BaseChronology.get(BaseChronology.java:79)
	at org.joda.time.base.BasePeriod.<init>(BasePeriod.java:258)
	at org.joda.time.Period.<init>(Period.java:402)
	at org.joda.time.TestPeriod_Constructors.testConstructor_long_PeriodType3(TestPeriod_Constructors.java:240)

testConstructor_long_PeriodType4(org.joda.time.TestPeriod_Constructors)  Time elapsed: 0 sec  <<< ERROR!
java.lang.ArrayIndexOutOfBoundsException: -1
	at org.joda.time.PeriodType.getFieldType(PeriodType.java:628)
	at org.joda.time.base.AbstractPeriod.getFieldType(AbstractPeriod.java:68)
	at org.joda.time.chrono.BaseChronology.get(BaseChronology.java:79)
	at org.joda.time.base.BasePeriod.<init>(BasePeriod.java:258)
	at org.joda.time.Period.<init>(Period.java:402)
	at org.joda.time.TestPeriod_Constructors.testConstructor_long_PeriodType4(TestPeriod_Constructors.java:257)

testConstructor_long_Chronology1(org.joda.time.TestPeriod_Constructors)  Time elapsed: 0.001 sec  <<< ERROR!
java.lang.ArrayIndexOutOfBoundsException: -1
	at org.joda.time.PeriodType.getFieldType(PeriodType.java:628)
	at org.joda.time.base.AbstractPeriod.getFieldType(AbstractPeriod.java:68)
	at org.joda.time.chrono.BaseChronology.get(BaseChronology.java:79)
	at org.joda.time.base.BasePeriod.<init>(BasePeriod.java:258)
	at org.joda.time.Period.<init>(Period.java:423)
	at org.joda.time.TestPeriod_Constructors.testConstructor_long_Chronology1(TestPeriod_Constructors.java:275)

testConstructor_long_Chronology2(org.joda.time.TestPeriod_Constructors)  Time elapsed: 0 sec  <<< ERROR!
java.lang.ArrayIndexOutOfBoundsException: -1
	at org.joda.time.PeriodType.getFieldType(PeriodType.java:628)
	at org.joda.time.base.AbstractPeriod.getFieldType(AbstractPeriod.java:68)
	at org.joda.time.chrono.BaseChronology.get(BaseChronology.java:79)
	at org.joda.time.base.BasePeriod.<init>(BasePeriod.java:258)
	at org.joda.time.Period.<init>(Period.java:423)
	at org.joda.time.TestPeriod_Constructors.testConstructor_long_Chronology2(TestPeriod_Constructors.java:292)

testConstructor_long_Chronology3(org.joda.time.TestPeriod_Constructors)  Time elapsed: 0.001 sec  <<< ERROR!
java.lang.ArrayIndexOutOfBoundsException: -1
	at org.joda.time.PeriodType.getFieldType(PeriodType.java:628)
	at org.joda.time.base.AbstractPeriod.getFieldType(AbstractPeriod.java:68)
	at org.joda.time.chrono.BaseChronology.get(BaseChronology.java:79)
	at org.joda.time.base.BasePeriod.<init>(BasePeriod.java:258)
	at org.joda.time.Period.<init>(Period.java:423)
	at org.joda.time.TestPeriod_Constructors.testConstructor_long_Chronology3(TestPeriod_Constructors.java:309)

testConstructor_long_PeriodType_Chronology1(org.joda.time.TestPeriod_Constructors)  Time elapsed: 0.001 sec  <<< ERROR!
java.lang.ArrayIndexOutOfBoundsException: -1
	at org.joda.time.PeriodType.getFieldType(PeriodType.java:628)
	at org.joda.time.base.AbstractPeriod.getFieldType(AbstractPeriod.java:68)
	at org.joda.time.chrono.BaseChronology.get(BaseChronology.java:79)
	at org.joda.time.base.BasePeriod.<init>(BasePeriod.java:258)
	at org.joda.time.Period.<init>(Period.java:444)
	at org.joda.time.TestPeriod_Constructors.testConstructor_long_PeriodType_Chronology1(TestPeriod_Constructors.java:327)

testConstructor_long_PeriodType_Chronology2(org.joda.time.TestPeriod_Constructors)  Time elapsed: 0 sec  <<< ERROR!
java.lang.ArrayIndexOutOfBoundsException: -1
	at org.joda.time.PeriodType.getFieldType(PeriodType.java:628)
	at org.joda.time.base.AbstractPeriod.getFieldType(AbstractPeriod.java:68)
	at org.joda.time.chrono.BaseChronology.get(BaseChronology.java:79)
	at org.joda.time.base.BasePeriod.<init>(BasePeriod.java:258)
	at org.joda.time.Period.<init>(Period.java:444)
	at org.joda.time.TestPeriod_Constructors.testConstructor_long_PeriodType_Chronology2(TestPeriod_Constructors.java:344)

testConstructor_long_PeriodType_Chronology3(org.joda.time.TestPeriod_Constructors)  Time elapsed: 0.001 sec  <<< ERROR!
java.lang.ArrayIndexOutOfBoundsException: -1
	at org.joda.time.PeriodType.getFieldType(PeriodType.java:628)
	at org.joda.time.base.AbstractPeriod.getFieldType(AbstractPeriod.java:68)
	at org.joda.time.chrono.BaseChronology.get(BaseChronology.java:79)
	at org.joda.time.base.BasePeriod.<init>(BasePeriod.java:258)
	at org.joda.time.Period.<init>(Period.java:444)
	at org.joda.time.TestPeriod_Constructors.testConstructor_long_PeriodType_Chronology3(TestPeriod_Constructors.java:361)

testConstructor_long_PeriodType_Chronology4(org.joda.time.TestPeriod_Constructors)  Time elapsed: 0 sec  <<< ERROR!
java.lang.ArrayIndexOutOfBoundsException: -1
	at org.joda.time.PeriodType.getFieldType(PeriodType.java:628)
	at org.joda.time.base.AbstractPeriod.getFieldType(AbstractPeriod.java:68)
	at org.joda.time.chrono.BaseChronology.get(BaseChronology.java:79)
	at org.joda.time.base.BasePeriod.<init>(BasePeriod.java:258)
	at org.joda.time.Period.<init>(Period.java:444)
	at org.joda.time.TestPeriod_Constructors.testConstructor_long_PeriodType_Chronology4(TestPeriod_Constructors.java:378)

testToString(org.joda.time.TestPeriod_Basics)  Time elapsed: 0.003 sec  <<< ERROR!
java.lang.ArrayIndexOutOfBoundsException: -1
	at org.joda.time.PeriodType.getFieldType(PeriodType.java:628)
	at org.joda.time.base.AbstractPeriod.getFieldType(AbstractPeriod.java:68)
	at org.joda.time.chrono.BaseChronology.get(BaseChronology.java:79)
	at org.joda.time.base.BasePeriod.<init>(BasePeriod.java:236)
	at org.joda.time.Period.<init>(Period.java:382)
	at org.joda.time.TestPeriod_Basics.testToString(TestPeriod_Basics.java:477)

testEqualsHashCode(org.joda.time.TestPeriod_Basics)  Time elapsed: 0 sec  <<< ERROR!
java.lang.ArrayIndexOutOfBoundsException: -1
	at org.joda.time.PeriodType.getFieldType(PeriodType.java:628)
	at org.joda.time.base.AbstractPeriod.getFieldType(AbstractPeriod.java:68)
	at org.joda.time.chrono.BaseChronology.get(BaseChronology.java:79)
	at org.joda.time.base.BasePeriod.<init>(BasePeriod.java:236)
	at org.joda.time.Period.<init>(Period.java:382)
	at org.joda.time.TestPeriod_Basics.testEqualsHashCode(TestPeriod_Basics.java:196)

testSerialization(org.joda.time.TestPeriod_Basics)  Time elapsed: 0.001 sec  <<< ERROR!
java.lang.ArrayIndexOutOfBoundsException: -1
	at org.joda.time.PeriodType.getFieldType(PeriodType.java:628)
	at org.joda.time.base.AbstractPeriod.getFieldType(AbstractPeriod.java:68)
	at org.joda.time.chrono.BaseChronology.get(BaseChronology.java:79)
	at org.joda.time.base.BasePeriod.<init>(BasePeriod.java:236)
	at org.joda.time.Period.<init>(Period.java:382)
	at org.joda.time.TestPeriod_Basics.testSerialization(TestPeriod_Basics.java:228)

testToPeriod(org.joda.time.TestPeriod_Basics)  Time elapsed: 0 sec  <<< ERROR!
java.lang.ArrayIndexOutOfBoundsException: -1
	at org.joda.time.PeriodType.getFieldType(PeriodType.java:628)
	at org.joda.time.base.AbstractPeriod.getFieldType(AbstractPeriod.java:68)
	at org.joda.time.chrono.BaseChronology.get(BaseChronology.java:79)
	at org.joda.time.base.BasePeriod.<init>(BasePeriod.java:236)
	at org.joda.time.Period.<init>(Period.java:382)
	at org.joda.time.TestPeriod_Basics.testToPeriod(TestPeriod_Basics.java:497)

testToMutablePeriod(org.joda.time.TestPeriod_Basics)  Time elapsed: 0.001 sec  <<< ERROR!
java.lang.ArrayIndexOutOfBoundsException: -1
	at org.joda.time.PeriodType.getFieldType(PeriodType.java:628)
	at org.joda.time.base.AbstractPeriod.getFieldType(AbstractPeriod.java:68)
	at org.joda.time.chrono.BaseChronology.get(BaseChronology.java:79)
	at org.joda.time.base.BasePeriod.<init>(BasePeriod.java:236)
	at org.joda.time.Period.<init>(Period.java:382)
	at org.joda.time.TestPeriod_Basics.testToMutablePeriod(TestPeriod_Basics.java:503)

testToDurationFrom(org.joda.time.TestPeriod_Basics)  Time elapsed: 0 sec  <<< ERROR!
java.lang.ArrayIndexOutOfBoundsException: -1
	at org.joda.time.PeriodType.getFieldType(PeriodType.java:628)
	at org.joda.time.base.AbstractPeriod.getFieldType(AbstractPeriod.java:68)
	at org.joda.time.chrono.BaseChronology.get(BaseChronology.java:79)
	at org.joda.time.base.BasePeriod.<init>(BasePeriod.java:236)
	at org.joda.time.Period.<init>(Period.java:382)
	at org.joda.time.TestPeriod_Basics.testToDurationFrom(TestPeriod_Basics.java:515)

testToDurationTo(org.joda.time.TestPeriod_Basics)  Time elapsed: 0.001 sec  <<< ERROR!
java.lang.ArrayIndexOutOfBoundsException: -1
	at org.joda.time.PeriodType.getFieldType(PeriodType.java:628)
	at org.joda.time.base.AbstractPeriod.getFieldType(AbstractPeriod.java:68)
	at org.joda.time.chrono.BaseChronology.get(BaseChronology.java:79)
	at org.joda.time.base.BasePeriod.<init>(BasePeriod.java:236)
	at org.joda.time.Period.<init>(Period.java:382)
	at org.joda.time.TestPeriod_Basics.testToDurationTo(TestPeriod_Basics.java:520)

testWithPeriodType1(org.joda.time.TestPeriod_Basics)  Time elapsed: 0.001 sec  <<< ERROR!
java.lang.ArrayIndexOutOfBoundsException: -1
	at org.joda.time.PeriodType.getFieldType(PeriodType.java:628)
	at org.joda.time.base.AbstractPeriod.getFieldType(AbstractPeriod.java:68)
	at org.joda.time.chrono.BaseChronology.get(BaseChronology.java:79)
	at org.joda.time.base.BasePeriod.<init>(BasePeriod.java:236)
	at org.joda.time.Period.<init>(Period.java:382)
	at org.joda.time.TestPeriod_Basics.testWithPeriodType1(TestPeriod_Basics.java:526)

testWithPeriodType2(org.joda.time.TestPeriod_Basics)  Time elapsed: 0 sec  <<< ERROR!
java.lang.ArrayIndexOutOfBoundsException: -1
	at org.joda.time.PeriodType.getFieldType(PeriodType.java:628)
	at org.joda.time.base.AbstractPeriod.getFieldType(AbstractPeriod.java:68)
	at org.joda.time.chrono.BaseChronology.get(BaseChronology.java:79)
	at org.joda.time.base.BasePeriod.<init>(BasePeriod.java:236)
	at org.joda.time.Period.<init>(Period.java:382)
	at org.joda.time.TestPeriod_Basics.testWithPeriodType2(TestPeriod_Basics.java:532)

testWithPeriodType4(org.joda.time.TestPeriod_Basics)  Time elapsed: 0 sec  <<< ERROR!
java.lang.ArrayIndexOutOfBoundsException: -1
	at org.joda.time.PeriodType.getFieldType(PeriodType.java:628)
	at org.joda.time.base.AbstractPeriod.getFieldType(AbstractPeriod.java:68)
	at org.joda.time.chrono.BaseChronology.get(BaseChronology.java:79)
	at org.joda.time.base.BasePeriod.<init>(BasePeriod.java:236)
	at org.joda.time.Period.<init>(Period.java:382)
	at org.joda.time.TestPeriod_Basics.testWithPeriodType4(TestPeriod_Basics.java:548)

testNormalizedStandard_weekDay1(org.joda.time.TestPeriod_Basics)  Time elapsed: 0 sec  <<< ERROR!
java.lang.ArrayIndexOutOfBoundsException: -1
	at org.joda.time.PeriodType.getFieldType(PeriodType.java:628)
	at org.joda.time.base.AbstractPeriod.getFieldType(AbstractPeriod.java:68)
	at org.joda.time.chrono.BaseChronology.get(BaseChronology.java:79)
	at org.joda.time.base.BasePeriod.<init>(BasePeriod.java:258)
	at org.joda.time.Period.<init>(Period.java:444)
	at org.joda.time.Period.normalizedStandard(Period.java:1644)
	at org.joda.time.Period.normalizedStandard(Period.java:1601)
	at org.joda.time.TestPeriod_Basics.testNormalizedStandard_weekDay1(TestPeriod_Basics.java:1419)

testNormalizedStandard_weekDay2(org.joda.time.TestPeriod_Basics)  Time elapsed: 0.003 sec  <<< ERROR!
java.lang.ArrayIndexOutOfBoundsException: -1
	at org.joda.time.PeriodType.getFieldType(PeriodType.java:628)
	at org.joda.time.base.AbstractPeriod.getFieldType(AbstractPeriod.java:68)
	at org.joda.time.chrono.BaseChronology.get(BaseChronology.java:79)
	at org.joda.time.base.BasePeriod.<init>(BasePeriod.java:258)
	at org.joda.time.Period.<init>(Period.java:444)
	at org.joda.time.Period.normalizedStandard(Period.java:1644)
	at org.joda.time.Period.normalizedStandard(Period.java:1601)
	at org.joda.time.TestPeriod_Basics.testNormalizedStandard_weekDay2(TestPeriod_Basics.java:1427)

testNormalizedStandard_yearMonthWeekDay(org.joda.time.TestPeriod_Basics)  Time elapsed: 0 sec  <<< ERROR!
java.lang.ArrayIndexOutOfBoundsException: -1
	at org.joda.time.PeriodType.getFieldType(PeriodType.java:628)
	at org.joda.time.base.AbstractPeriod.getFieldType(AbstractPeriod.java:68)
	at org.joda.time.chrono.BaseChronology.get(BaseChronology.java:79)
	at org.joda.time.base.BasePeriod.<init>(BasePeriod.java:258)
	at org.joda.time.Period.<init>(Period.java:444)
	at org.joda.time.Period.normalizedStandard(Period.java:1644)
	at org.joda.time.Period.normalizedStandard(Period.java:1601)
	at org.joda.time.TestPeriod_Basics.testNormalizedStandard_yearMonthWeekDay(TestPeriod_Basics.java:1434)

testNormalizedStandard_yearMonthDay(org.joda.time.TestPeriod_Basics)  Time elapsed: 0 sec  <<< ERROR!
java.lang.ArrayIndexOutOfBoundsException: -1
	at org.joda.time.PeriodType.getFieldType(PeriodType.java:628)
	at org.joda.time.base.AbstractPeriod.getFieldType(AbstractPeriod.java:68)
	at org.joda.time.chrono.BaseChronology.get(BaseChronology.java:79)
	at org.joda.time.base.BasePeriod.<init>(BasePeriod.java:258)
	at org.joda.time.Period.<init>(Period.java:444)
	at org.joda.time.Period.normalizedStandard(Period.java:1644)
	at org.joda.time.Period.normalizedStandard(Period.java:1601)
	at org.joda.time.TestPeriod_Basics.testNormalizedStandard_yearMonthDay(TestPeriod_Basics.java:1441)

testNormalizedStandard_negative(org.joda.time.TestPeriod_Basics)  Time elapsed: 0.001 sec  <<< ERROR!
java.lang.ArrayIndexOutOfBoundsException: -1
	at org.joda.time.PeriodType.getFieldType(PeriodType.java:628)
	at org.joda.time.base.AbstractPeriod.getFieldType(AbstractPeriod.java:68)
	at org.joda.time.chrono.BaseChronology.get(BaseChronology.java:79)
	at org.joda.time.base.BasePeriod.<init>(BasePeriod.java:258)
	at org.joda.time.Period.<init>(Period.java:444)
	at org.joda.time.Period.normalizedStandard(Period.java:1644)
	at org.joda.time.Period.normalizedStandard(Period.java:1601)
	at org.joda.time.TestPeriod_Basics.testNormalizedStandard_negative(TestPeriod_Basics.java:1448)

testNormalizedStandard_fullNegative(org.joda.time.TestPeriod_Basics)  Time elapsed: 0 sec  <<< ERROR!
java.lang.ArrayIndexOutOfBoundsException: -1
	at org.joda.time.PeriodType.getFieldType(PeriodType.java:628)
	at org.joda.time.base.AbstractPeriod.getFieldType(AbstractPeriod.java:68)
	at org.joda.time.chrono.BaseChronology.get(BaseChronology.java:79)
	at org.joda.time.base.BasePeriod.<init>(BasePeriod.java:258)
	at org.joda.time.Period.<init>(Period.java:444)
	at org.joda.time.Period.normalizedStandard(Period.java:1644)
	at org.joda.time.Period.normalizedStandard(Period.java:1601)
	at org.joda.time.TestPeriod_Basics.testNormalizedStandard_fullNegative(TestPeriod_Basics.java:1455)

testNormalizedStandard_periodType_yearMonth3(org.joda.time.TestPeriod_Basics)  Time elapsed: 0 sec  <<< ERROR!
java.lang.ArrayIndexOutOfBoundsException: -1
	at org.joda.time.PeriodType.getFieldType(PeriodType.java:628)
	at org.joda.time.base.AbstractPeriod.getFieldType(AbstractPeriod.java:68)
	at org.joda.time.chrono.BaseChronology.get(BaseChronology.java:79)
	at org.joda.time.base.BasePeriod.<init>(BasePeriod.java:258)
	at org.joda.time.Period.<init>(Period.java:444)
	at org.joda.time.Period.normalizedStandard(Period.java:1644)
	at org.joda.time.TestPeriod_Basics.testNormalizedStandard_periodType_yearMonth3(TestPeriod_Basics.java:1479)

testNormalizedStandard_periodType_weekDay1(org.joda.time.TestPeriod_Basics)  Time elapsed: 0.001 sec  <<< ERROR!
java.lang.ArrayIndexOutOfBoundsException: -1
	at org.joda.time.PeriodType.getFieldType(PeriodType.java:628)
	at org.joda.time.base.AbstractPeriod.getFieldType(AbstractPeriod.java:68)
	at org.joda.time.chrono.BaseChronology.get(BaseChronology.java:79)
	at org.joda.time.base.BasePeriod.<init>(BasePeriod.java:258)
	at org.joda.time.Period.<init>(Period.java:444)
	at org.joda.time.Period.normalizedStandard(Period.java:1644)
	at org.joda.time.TestPeriod_Basics.testNormalizedStandard_periodType_weekDay1(TestPeriod_Basics.java:1486)

testNormalizedStandard_periodType_weekDay2(org.joda.time.TestPeriod_Basics)  Time elapsed: 0 sec  <<< ERROR!
java.lang.ArrayIndexOutOfBoundsException: -1
	at org.joda.time.PeriodType.getFieldType(PeriodType.java:628)
	at org.joda.time.base.AbstractPeriod.getFieldType(AbstractPeriod.java:68)
	at org.joda.time.chrono.BaseChronology.get(BaseChronology.java:79)
	at org.joda.time.base.BasePeriod.<init>(BasePeriod.java:258)
	at org.joda.time.Period.<init>(Period.java:444)
	at org.joda.time.Period.normalizedStandard(Period.java:1644)
	at org.joda.time.TestPeriod_Basics.testNormalizedStandard_periodType_weekDay2(TestPeriod_Basics.java:1494)

testNormalizedStandard_periodType_weekDay3(org.joda.time.TestPeriod_Basics)  Time elapsed: 0.001 sec  <<< ERROR!
java.lang.ArrayIndexOutOfBoundsException: -1
	at org.joda.time.PeriodType.getFieldType(PeriodType.java:628)
	at org.joda.time.base.AbstractPeriod.getFieldType(AbstractPeriod.java:68)
	at org.joda.time.chrono.BaseChronology.get(BaseChronology.java:79)
	at org.joda.time.base.BasePeriod.<init>(BasePeriod.java:258)
	at org.joda.time.Period.<init>(Period.java:444)
	at org.joda.time.Period.normalizedStandard(Period.java:1644)
	at org.joda.time.TestPeriod_Basics.testNormalizedStandard_periodType_weekDay3(TestPeriod_Basics.java:1501)

testNormalizedStandard_periodType_yearMonthWeekDay(org.joda.time.TestPeriod_Basics)  Time elapsed: 0.001 sec  <<< ERROR!
java.lang.ArrayIndexOutOfBoundsException: -1
	at org.joda.time.PeriodType.getFieldType(PeriodType.java:628)
	at org.joda.time.base.AbstractPeriod.getFieldType(AbstractPeriod.java:68)
	at org.joda.time.chrono.BaseChronology.get(BaseChronology.java:79)
	at org.joda.time.base.BasePeriod.<init>(BasePeriod.java:258)
	at org.joda.time.Period.<init>(Period.java:444)
	at org.joda.time.Period.normalizedStandard(Period.java:1644)
	at org.joda.time.TestPeriod_Basics.testNormalizedStandard_periodType_yearMonthWeekDay(TestPeriod_Basics.java:1508)

testNormalizedStandard_periodType_yearMonthDay(org.joda.time.TestPeriod_Basics)  Time elapsed: 0 sec  <<< ERROR!
java.lang.ArrayIndexOutOfBoundsException: -1
	at org.joda.time.PeriodType.getFieldType(PeriodType.java:628)
	at org.joda.time.base.AbstractPeriod.getFieldType(AbstractPeriod.java:68)
	at org.joda.time.chrono.BaseChronology.get(BaseChronology.java:79)
	at org.joda.time.base.BasePeriod.<init>(BasePeriod.java:258)
	at org.joda.time.Period.<init>(Period.java:444)
	at org.joda.time.Period.normalizedStandard(Period.java:1644)
	at org.joda.time.TestPeriod_Basics.testNormalizedStandard_periodType_yearMonthDay(TestPeriod_Basics.java:1515)

testNormalizedStandard_periodType_monthsWeeks(org.joda.time.TestPeriod_Basics)  Time elapsed: 0 sec  <<< ERROR!
java.lang.ArrayIndexOutOfBoundsException: -1
	at org.joda.time.PeriodType.getFieldType(PeriodType.java:628)
	at org.joda.time.base.AbstractPeriod.getFieldType(AbstractPeriod.java:68)
	at org.joda.time.chrono.BaseChronology.get(BaseChronology.java:79)
	at org.joda.time.base.BasePeriod.<init>(BasePeriod.java:258)
	at org.joda.time.Period.<init>(Period.java:444)
	at org.joda.time.Period.normalizedStandard(Period.java:1644)
	at org.joda.time.TestPeriod_Basics.testNormalizedStandard_periodType_monthsWeeks(TestPeriod_Basics.java:1557)

testConstructor_long1(org.joda.time.TestMutablePeriod_Constructors)  Time elapsed: 0 sec  <<< ERROR!
java.lang.ArrayIndexOutOfBoundsException: -1
	at org.joda.time.PeriodType.getFieldType(PeriodType.java:628)
	at org.joda.time.base.AbstractPeriod.getFieldType(AbstractPeriod.java:68)
	at org.joda.time.chrono.BaseChronology.get(BaseChronology.java:79)
	at org.joda.time.base.BasePeriod.<init>(BasePeriod.java:236)
	at org.joda.time.MutablePeriod.<init>(MutablePeriod.java:180)
	at org.joda.time.TestMutablePeriod_Constructors.testConstructor_long1(TestMutablePeriod_Constructors.java:158)

testConstructor_long2(org.joda.time.TestMutablePeriod_Constructors)  Time elapsed: 0 sec  <<< ERROR!
java.lang.ArrayIndexOutOfBoundsException: -1
	at org.joda.time.PeriodType.getFieldType(PeriodType.java:628)
	at org.joda.time.base.AbstractPeriod.getFieldType(AbstractPeriod.java:68)
	at org.joda.time.chrono.BaseChronology.get(BaseChronology.java:79)
	at org.joda.time.base.BasePeriod.<init>(BasePeriod.java:236)
	at org.joda.time.MutablePeriod.<init>(MutablePeriod.java:180)
	at org.joda.time.TestMutablePeriod_Constructors.testConstructor_long2(TestMutablePeriod_Constructors.java:175)

testConstructor_long3(org.joda.time.TestMutablePeriod_Constructors)  Time elapsed: 0 sec  <<< ERROR!
java.lang.ArrayIndexOutOfBoundsException: -1
	at org.joda.time.PeriodType.getFieldType(PeriodType.java:628)
	at org.joda.time.base.AbstractPeriod.getFieldType(AbstractPeriod.java:68)
	at org.joda.time.chrono.BaseChronology.get(BaseChronology.java:79)
	at org.joda.time.base.BasePeriod.<init>(BasePeriod.java:236)
	at org.joda.time.MutablePeriod.<init>(MutablePeriod.java:180)
	at org.joda.time.TestMutablePeriod_Constructors.testConstructor_long3(TestMutablePeriod_Constructors.java:193)

testConstructor_long_PeriodType1(org.joda.time.TestMutablePeriod_Constructors)  Time elapsed: 0 sec  <<< ERROR!
java.lang.ArrayIndexOutOfBoundsException: -1
	at org.joda.time.PeriodType.getFieldType(PeriodType.java:628)
	at org.joda.time.base.AbstractPeriod.getFieldType(AbstractPeriod.java:68)
	at org.joda.time.chrono.BaseChronology.get(BaseChronology.java:79)
	at org.joda.time.base.BasePeriod.<init>(BasePeriod.java:258)
	at org.joda.time.MutablePeriod.<init>(MutablePeriod.java:200)
	at org.joda.time.TestMutablePeriod_Constructors.testConstructor_long_PeriodType1(TestMutablePeriod_Constructors.java:212)

testConstructor_long_PeriodType2(org.joda.time.TestMutablePeriod_Constructors)  Time elapsed: 0 sec  <<< ERROR!
java.lang.ArrayIndexOutOfBoundsException: -1
	at org.joda.time.PeriodType.getFieldType(PeriodType.java:628)
	at org.joda.time.base.AbstractPeriod.getFieldType(AbstractPeriod.java:68)
	at org.joda.time.chrono.BaseChronology.get(BaseChronology.java:79)
	at org.joda.time.base.BasePeriod.<init>(BasePeriod.java:258)
	at org.joda.time.MutablePeriod.<init>(MutablePeriod.java:200)
	at org.joda.time.TestMutablePeriod_Constructors.testConstructor_long_PeriodType2(TestMutablePeriod_Constructors.java:229)

testConstructor_long_PeriodType3(org.joda.time.TestMutablePeriod_Constructors)  Time elapsed: 0.007 sec  <<< ERROR!
java.lang.ArrayIndexOutOfBoundsException: -1
	at org.joda.time.PeriodType.getFieldType(PeriodType.java:628)
	at org.joda.time.base.AbstractPeriod.getFieldType(AbstractPeriod.java:68)
	at org.joda.time.chrono.BaseChronology.get(BaseChronology.java:79)
	at org.joda.time.base.BasePeriod.<init>(BasePeriod.java:258)
	at org.joda.time.MutablePeriod.<init>(MutablePeriod.java:200)
	at org.joda.time.TestMutablePeriod_Constructors.testConstructor_long_PeriodType3(TestMutablePeriod_Constructors.java:246)

testConstructor_long_PeriodType4(org.joda.time.TestMutablePeriod_Constructors)  Time elapsed: 0 sec  <<< ERROR!
java.lang.ArrayIndexOutOfBoundsException: -1
	at org.joda.time.PeriodType.getFieldType(PeriodType.java:628)
	at org.joda.time.base.AbstractPeriod.getFieldType(AbstractPeriod.java:68)
	at org.joda.time.chrono.BaseChronology.get(BaseChronology.java:79)
	at org.joda.time.base.BasePeriod.<init>(BasePeriod.java:258)
	at org.joda.time.MutablePeriod.<init>(MutablePeriod.java:200)
	at org.joda.time.TestMutablePeriod_Constructors.testConstructor_long_PeriodType4(TestMutablePeriod_Constructors.java:263)

testConstructor_long_Chronology1(org.joda.time.TestMutablePeriod_Constructors)  Time elapsed: 0.001 sec  <<< ERROR!
java.lang.ArrayIndexOutOfBoundsException: -1
	at org.joda.time.PeriodType.getFieldType(PeriodType.java:628)
	at org.joda.time.base.AbstractPeriod.getFieldType(AbstractPeriod.java:68)
	at org.joda.time.chrono.BaseChronology.get(BaseChronology.java:79)
	at org.joda.time.base.BasePeriod.<init>(BasePeriod.java:258)
	at org.joda.time.MutablePeriod.<init>(MutablePeriod.java:221)
	at org.joda.time.TestMutablePeriod_Constructors.testConstructor_long_Chronology1(TestMutablePeriod_Constructors.java:281)

testConstructor_long_Chronology2(org.joda.time.TestMutablePeriod_Constructors)  Time elapsed: 0 sec  <<< ERROR!
java.lang.ArrayIndexOutOfBoundsException: -1
	at org.joda.time.PeriodType.getFieldType(PeriodType.java:628)
	at org.joda.time.base.AbstractPeriod.getFieldType(AbstractPeriod.java:68)
	at org.joda.time.chrono.BaseChronology.get(BaseChronology.java:79)
	at org.joda.time.base.BasePeriod.<init>(BasePeriod.java:258)
	at org.joda.time.MutablePeriod.<init>(MutablePeriod.java:221)
	at org.joda.time.TestMutablePeriod_Constructors.testConstructor_long_Chronology2(TestMutablePeriod_Constructors.java:298)

testConstructor_long_Chronology3(org.joda.time.TestMutablePeriod_Constructors)  Time elapsed: 0 sec  <<< ERROR!
java.lang.ArrayIndexOutOfBoundsException: -1
	at org.joda.time.PeriodType.getFieldType(PeriodType.java:628)
	at org.joda.time.base.AbstractPeriod.getFieldType(AbstractPeriod.java:68)
	at org.joda.time.chrono.BaseChronology.get(BaseChronology.java:79)
	at org.joda.time.base.BasePeriod.<init>(BasePeriod.java:258)
	at org.joda.time.MutablePeriod.<init>(MutablePeriod.java:221)
	at org.joda.time.TestMutablePeriod_Constructors.testConstructor_long_Chronology3(TestMutablePeriod_Constructors.java:315)

testConstructor_long_PeriodType_Chronology1(org.joda.time.TestMutablePeriod_Constructors)  Time elapsed: 0.002 sec  <<< ERROR!
java.lang.ArrayIndexOutOfBoundsException: -1
	at org.joda.time.PeriodType.getFieldType(PeriodType.java:628)
	at org.joda.time.base.AbstractPeriod.getFieldType(AbstractPeriod.java:68)
	at org.joda.time.chrono.BaseChronology.get(BaseChronology.java:79)
	at org.joda.time.base.BasePeriod.<init>(BasePeriod.java:258)
	at org.joda.time.MutablePeriod.<init>(MutablePeriod.java:242)
	at org.joda.time.TestMutablePeriod_Constructors.testConstructor_long_PeriodType_Chronology1(TestMutablePeriod_Constructors.java:333)

testConstructor_long_PeriodType_Chronology2(org.joda.time.TestMutablePeriod_Constructors)  Time elapsed: 0.004 sec  <<< ERROR!
java.lang.ArrayIndexOutOfBoundsException: -1
	at org.joda.time.PeriodType.getFieldType(PeriodType.java:628)
	at org.joda.time.base.AbstractPeriod.getFieldType(AbstractPeriod.java:68)
	at org.joda.time.chrono.BaseChronology.get(BaseChronology.java:79)
	at org.joda.time.base.BasePeriod.<init>(BasePeriod.java:258)
	at org.joda.time.MutablePeriod.<init>(MutablePeriod.java:242)
	at org.joda.time.TestMutablePeriod_Constructors.testConstructor_long_PeriodType_Chronology2(TestMutablePeriod_Constructors.java:350)

testConstructor_long_PeriodType_Chronology3(org.joda.time.TestMutablePeriod_Constructors)  Time elapsed: 0.001 sec  <<< ERROR!
java.lang.ArrayIndexOutOfBoundsException: -1
	at org.joda.time.PeriodType.getFieldType(PeriodType.java:628)
	at org.joda.time.base.AbstractPeriod.getFieldType(AbstractPeriod.java:68)
	at org.joda.time.chrono.BaseChronology.get(BaseChronology.java:79)
	at org.joda.time.base.BasePeriod.<init>(BasePeriod.java:258)
	at org.joda.time.MutablePeriod.<init>(MutablePeriod.java:242)
	at org.joda.time.TestMutablePeriod_Constructors.testConstructor_long_PeriodType_Chronology3(TestMutablePeriod_Constructors.java:367)

testConstructor_long_PeriodType_Chronology4(org.joda.time.TestMutablePeriod_Constructors)  Time elapsed: 0.001 sec  <<< ERROR!
java.lang.ArrayIndexOutOfBoundsException: -1
	at org.joda.time.PeriodType.getFieldType(PeriodType.java:628)
	at org.joda.time.base.AbstractPeriod.getFieldType(AbstractPeriod.java:68)
	at org.joda.time.chrono.BaseChronology.get(BaseChronology.java:79)
	at org.joda.time.base.BasePeriod.<init>(BasePeriod.java:258)
	at org.joda.time.MutablePeriod.<init>(MutablePeriod.java:242)
	at org.joda.time.TestMutablePeriod_Constructors.testConstructor_long_PeriodType_Chronology4(TestMutablePeriod_Constructors.java:384)

testConstructor_Object_Chronology1(org.joda.time.TestMutablePeriod_Constructors)  Time elapsed: 0 sec  <<< ERROR!
java.lang.ArrayIndexOutOfBoundsException: -1
	at org.joda.time.PeriodType.getFieldType(PeriodType.java:628)
	at org.joda.time.base.AbstractPeriod.getFieldType(AbstractPeriod.java:68)
	at org.joda.time.chrono.BaseChronology.get(BaseChronology.java:79)
	at org.joda.time.convert.ReadableDurationConverter.setInto(ReadableDurationConverter.java:75)
	at org.joda.time.base.BasePeriod.<init>(BasePeriod.java:279)
	at org.joda.time.MutablePeriod.<init>(MutablePeriod.java:408)
	at org.joda.time.TestMutablePeriod_Constructors.testConstructor_Object_Chronology1(TestMutablePeriod_Constructors.java:942)

testConstructor_Object_Chronology2(org.joda.time.TestMutablePeriod_Constructors)  Time elapsed: 0.001 sec  <<< ERROR!
java.lang.ArrayIndexOutOfBoundsException: -1
	at org.joda.time.PeriodType.getFieldType(PeriodType.java:628)
	at org.joda.time.base.AbstractPeriod.getFieldType(AbstractPeriod.java:68)
	at org.joda.time.chrono.BaseChronology.get(BaseChronology.java:79)
	at org.joda.time.convert.ReadableDurationConverter.setInto(ReadableDurationConverter.java:75)
	at org.joda.time.base.BasePeriod.<init>(BasePeriod.java:279)
	at org.joda.time.MutablePeriod.<init>(MutablePeriod.java:408)
	at org.joda.time.TestMutablePeriod_Constructors.testConstructor_Object_Chronology2(TestMutablePeriod_Constructors.java:960)

testToString(org.joda.time.TestMutablePeriod_Basics)  Time elapsed: 0 sec  <<< ERROR!
java.lang.ArrayIndexOutOfBoundsException: -1
	at org.joda.time.PeriodType.getFieldType(PeriodType.java:628)
	at org.joda.time.base.AbstractPeriod.getFieldType(AbstractPeriod.java:68)
	at org.joda.time.chrono.BaseChronology.get(BaseChronology.java:79)
	at org.joda.time.base.BasePeriod.<init>(BasePeriod.java:236)
	at org.joda.time.MutablePeriod.<init>(MutablePeriod.java:180)
	at org.joda.time.TestMutablePeriod_Basics.testToString(TestMutablePeriod_Basics.java:410)

testEqualsHashCode(org.joda.time.TestMutablePeriod_Basics)  Time elapsed: 0 sec  <<< ERROR!
java.lang.ArrayIndexOutOfBoundsException: -1
	at org.joda.time.PeriodType.getFieldType(PeriodType.java:628)
	at org.joda.time.base.AbstractPeriod.getFieldType(AbstractPeriod.java:68)
	at org.joda.time.chrono.BaseChronology.get(BaseChronology.java:79)
	at org.joda.time.base.BasePeriod.<init>(BasePeriod.java:236)
	at org.joda.time.MutablePeriod.<init>(MutablePeriod.java:180)
	at org.joda.time.TestMutablePeriod_Basics.testEqualsHashCode(TestMutablePeriod_Basics.java:130)

testSerialization(org.joda.time.TestMutablePeriod_Basics)  Time elapsed: 0 sec  <<< ERROR!
java.lang.ArrayIndexOutOfBoundsException: -1
	at org.joda.time.PeriodType.getFieldType(PeriodType.java:628)
	at org.joda.time.base.AbstractPeriod.getFieldType(AbstractPeriod.java:68)
	at org.joda.time.chrono.BaseChronology.get(BaseChronology.java:79)
	at org.joda.time.base.BasePeriod.<init>(BasePeriod.java:236)
	at org.joda.time.MutablePeriod.<init>(MutablePeriod.java:180)
	at org.joda.time.TestMutablePeriod_Basics.testSerialization(TestMutablePeriod_Basics.java:161)

testToPeriod(org.joda.time.TestMutablePeriod_Basics)  Time elapsed: 0.004 sec  <<< ERROR!
java.lang.ArrayIndexOutOfBoundsException: -1
	at org.joda.time.PeriodType.getFieldType(PeriodType.java:628)
	at org.joda.time.base.AbstractPeriod.getFieldType(AbstractPeriod.java:68)
	at org.joda.time.chrono.BaseChronology.get(BaseChronology.java:79)
	at org.joda.time.base.BasePeriod.<init>(BasePeriod.java:236)
	at org.joda.time.MutablePeriod.<init>(MutablePeriod.java:180)
	at org.joda.time.TestMutablePeriod_Basics.testToPeriod(TestMutablePeriod_Basics.java:416)

testToMutablePeriod(org.joda.time.TestMutablePeriod_Basics)  Time elapsed: 0 sec  <<< ERROR!
java.lang.ArrayIndexOutOfBoundsException: -1
	at org.joda.time.PeriodType.getFieldType(PeriodType.java:628)
	at org.joda.time.base.AbstractPeriod.getFieldType(AbstractPeriod.java:68)
	at org.joda.time.chrono.BaseChronology.get(BaseChronology.java:79)
	at org.joda.time.base.BasePeriod.<init>(BasePeriod.java:236)
	at org.joda.time.MutablePeriod.<init>(MutablePeriod.java:180)
	at org.joda.time.TestMutablePeriod_Basics.testToMutablePeriod(TestMutablePeriod_Basics.java:422)

testToDurationFrom(org.joda.time.TestMutablePeriod_Basics)  Time elapsed: 0 sec  <<< ERROR!
java.lang.ArrayIndexOutOfBoundsException: -1
	at org.joda.time.PeriodType.getFieldType(PeriodType.java:628)
	at org.joda.time.base.AbstractPeriod.getFieldType(AbstractPeriod.java:68)
	at org.joda.time.chrono.BaseChronology.get(BaseChronology.java:79)
	at org.joda.time.base.BasePeriod.<init>(BasePeriod.java:236)
	at org.joda.time.MutablePeriod.<init>(MutablePeriod.java:180)
	at org.joda.time.TestMutablePeriod_Basics.testToDurationFrom(TestMutablePeriod_Basics.java:434)

testClone(org.joda.time.TestMutablePeriod_Basics)  Time elapsed: 0.004 sec  <<< ERROR!
java.lang.ArrayIndexOutOfBoundsException: -1
	at org.joda.time.PeriodType.getFieldType(PeriodType.java:628)
	at org.joda.time.base.AbstractPeriod.getFieldType(AbstractPeriod.java:68)
	at org.joda.time.chrono.BaseChronology.get(BaseChronology.java:79)
	at org.joda.time.base.BasePeriod.<init>(BasePeriod.java:236)
	at org.joda.time.MutablePeriod.<init>(MutablePeriod.java:180)
	at org.joda.time.TestMutablePeriod_Basics.testClone(TestMutablePeriod_Basics.java:448)

testCopy(org.joda.time.TestMutablePeriod_Basics)  Time elapsed: 0.001 sec  <<< ERROR!
java.lang.ArrayIndexOutOfBoundsException: -1
	at org.joda.time.PeriodType.getFieldType(PeriodType.java:628)
	at org.joda.time.base.AbstractPeriod.getFieldType(AbstractPeriod.java:68)
	at org.joda.time.chrono.BaseChronology.get(BaseChronology.java:79)
	at org.joda.time.base.BasePeriod.<init>(BasePeriod.java:236)
	at org.joda.time.MutablePeriod.<init>(MutablePeriod.java:180)
	at org.joda.time.TestMutablePeriod_Basics.testCopy(TestMutablePeriod_Basics.java:440)

testAdd_RP1(org.joda.time.TestMutablePeriod_Updates)  Time elapsed: 0 sec  <<< ERROR!
java.lang.ArrayIndexOutOfBoundsException: -1
	at org.joda.time.PeriodType.getFieldType(PeriodType.java:628)
	at org.joda.time.base.AbstractPeriod.getFieldType(AbstractPeriod.java:68)
	at org.joda.time.chrono.BaseChronology.get(BaseChronology.java:79)
	at org.joda.time.base.BasePeriod.<init>(BasePeriod.java:236)
	at org.joda.time.MutablePeriod.<init>(MutablePeriod.java:180)
	at org.joda.time.TestMutablePeriod_Updates.testAdd_RP1(TestMutablePeriod_Updates.java:1235)

testAdd_RP2(org.joda.time.TestMutablePeriod_Updates)  Time elapsed: 0.001 sec  <<< ERROR!
java.lang.ArrayIndexOutOfBoundsException: -1
	at org.joda.time.PeriodType.getFieldType(PeriodType.java:628)
	at org.joda.time.base.AbstractPeriod.getFieldType(AbstractPeriod.java:68)
	at org.joda.time.chrono.BaseChronology.get(BaseChronology.java:79)
	at org.joda.time.base.BasePeriod.<init>(BasePeriod.java:258)
	at org.joda.time.MutablePeriod.<init>(MutablePeriod.java:200)
	at org.joda.time.TestMutablePeriod_Updates.testAdd_RP2(TestMutablePeriod_Updates.java:1248)

testAdd_RD2(org.joda.time.TestMutablePeriod_Updates)  Time elapsed: 0 sec  <<< ERROR!
java.lang.ArrayIndexOutOfBoundsException: -1
	at org.joda.time.PeriodType.getFieldType(PeriodType.java:628)
	at org.joda.time.base.AbstractPeriod.getFieldType(AbstractPeriod.java:68)
	at org.joda.time.chrono.BaseChronology.get(BaseChronology.java:79)
	at org.joda.time.base.BasePeriod.<init>(BasePeriod.java:258)
	at org.joda.time.MutablePeriod.<init>(MutablePeriod.java:200)
	at org.joda.time.TestMutablePeriod_Updates.testAdd_RD2(TestMutablePeriod_Updates.java:1203)

testSetPeriod_8ints2(org.joda.time.TestMutablePeriod_Updates)  Time elapsed: 0.001 sec  <<< ERROR!
java.lang.ArrayIndexOutOfBoundsException: -1
	at org.joda.time.PeriodType.getFieldType(PeriodType.java:628)
	at org.joda.time.base.AbstractPeriod.getFieldType(AbstractPeriod.java:68)
	at org.joda.time.chrono.BaseChronology.get(BaseChronology.java:79)
	at org.joda.time.base.BasePeriod.<init>(BasePeriod.java:258)
	at org.joda.time.MutablePeriod.<init>(MutablePeriod.java:200)
	at org.joda.time.TestMutablePeriod_Updates.testSetPeriod_8ints2(TestMutablePeriod_Updates.java:447)

testSetPeriod_8ints3(org.joda.time.TestMutablePeriod_Updates)  Time elapsed: 0.001 sec  <<< ERROR!
java.lang.ArrayIndexOutOfBoundsException: -1
	at org.joda.time.PeriodType.getFieldType(PeriodType.java:628)
	at org.joda.time.base.AbstractPeriod.getFieldType(AbstractPeriod.java:68)
	at org.joda.time.chrono.BaseChronology.get(BaseChronology.java:79)
	at org.joda.time.base.BasePeriod.<init>(BasePeriod.java:258)
	at org.joda.time.MutablePeriod.<init>(MutablePeriod.java:200)
	at org.joda.time.TestMutablePeriod_Updates.testSetPeriod_8ints3(TestMutablePeriod_Updates.java:463)

testSetPeriod_RP2(org.joda.time.TestMutablePeriod_Updates)  Time elapsed: 0.001 sec  <<< ERROR!
java.lang.ArrayIndexOutOfBoundsException: -1
	at org.joda.time.PeriodType.getFieldType(PeriodType.java:628)
	at org.joda.time.base.AbstractPeriod.getFieldType(AbstractPeriod.java:68)
	at org.joda.time.chrono.BaseChronology.get(BaseChronology.java:79)
	at org.joda.time.base.BasePeriod.<init>(BasePeriod.java:258)
	at org.joda.time.MutablePeriod.<init>(MutablePeriod.java:200)
	at org.joda.time.TestMutablePeriod_Updates.testSetPeriod_RP2(TestMutablePeriod_Updates.java:503)

testSetPeriod_RP3(org.joda.time.TestMutablePeriod_Updates)  Time elapsed: 0 sec  <<< ERROR!
java.lang.ArrayIndexOutOfBoundsException: -1
	at org.joda.time.PeriodType.getFieldType(PeriodType.java:628)
	at org.joda.time.base.AbstractPeriod.getFieldType(AbstractPeriod.java:68)
	at org.joda.time.chrono.BaseChronology.get(BaseChronology.java:79)
	at org.joda.time.base.BasePeriod.<init>(BasePeriod.java:258)
	at org.joda.time.MutablePeriod.<init>(MutablePeriod.java:200)
	at org.joda.time.TestMutablePeriod_Updates.testSetPeriod_RP3(TestMutablePeriod_Updates.java:519)

testSetPeriod_long1(org.joda.time.TestMutablePeriod_Updates)  Time elapsed: 0.001 sec  <<< ERROR!
java.lang.ArrayIndexOutOfBoundsException: -1
	at org.joda.time.PeriodType.getFieldType(PeriodType.java:628)
	at org.joda.time.base.AbstractPeriod.getFieldType(AbstractPeriod.java:68)
	at org.joda.time.chrono.BaseChronology.get(BaseChronology.java:79)
	at org.joda.time.MutablePeriod.setPeriod(MutablePeriod.java:611)
	at org.joda.time.MutablePeriod.setPeriod(MutablePeriod.java:595)
	at org.joda.time.TestMutablePeriod_Updates.testSetPeriod_long1(TestMutablePeriod_Updates.java:799)

testSetPeriod_long2(org.joda.time.TestMutablePeriod_Updates)  Time elapsed: 0 sec  <<< ERROR!
java.lang.ArrayIndexOutOfBoundsException: -1
	at org.joda.time.PeriodType.getFieldType(PeriodType.java:628)
	at org.joda.time.base.AbstractPeriod.getFieldType(AbstractPeriod.java:68)
	at org.joda.time.chrono.BaseChronology.get(BaseChronology.java:79)
	at org.joda.time.MutablePeriod.setPeriod(MutablePeriod.java:611)
	at org.joda.time.MutablePeriod.setPeriod(MutablePeriod.java:595)
	at org.joda.time.TestMutablePeriod_Updates.testSetPeriod_long2(TestMutablePeriod_Updates.java:812)

testSetPeriod_RD1(org.joda.time.TestMutablePeriod_Updates)  Time elapsed: 0.001 sec  <<< ERROR!
java.lang.ArrayIndexOutOfBoundsException: -1
	at org.joda.time.PeriodType.getFieldType(PeriodType.java:628)
	at org.joda.time.base.AbstractPeriod.getFieldType(AbstractPeriod.java:68)
	at org.joda.time.chrono.BaseChronology.get(BaseChronology.java:79)
	at org.joda.time.MutablePeriod.setPeriod(MutablePeriod.java:611)
	at org.joda.time.MutablePeriod.setPeriod(MutablePeriod.java:580)
	at org.joda.time.MutablePeriod.setPeriod(MutablePeriod.java:563)
	at org.joda.time.TestMutablePeriod_Updates.testSetPeriod_RD1(TestMutablePeriod_Updates.java:1017)

testSetPeriod_RD2(org.joda.time.TestMutablePeriod_Updates)  Time elapsed: 0 sec  <<< ERROR!
java.lang.ArrayIndexOutOfBoundsException: -1
	at org.joda.time.PeriodType.getFieldType(PeriodType.java:628)
	at org.joda.time.base.AbstractPeriod.getFieldType(AbstractPeriod.java:68)
	at org.joda.time.chrono.BaseChronology.get(BaseChronology.java:79)
	at org.joda.time.MutablePeriod.setPeriod(MutablePeriod.java:611)
	at org.joda.time.MutablePeriod.setPeriod(MutablePeriod.java:580)
	at org.joda.time.MutablePeriod.setPeriod(MutablePeriod.java:563)
	at org.joda.time.TestMutablePeriod_Updates.testSetPeriod_RD2(TestMutablePeriod_Updates.java:1035)

testAdd_8ints1(org.joda.time.TestMutablePeriod_Updates)  Time elapsed: 0 sec  <<< ERROR!
java.lang.ArrayIndexOutOfBoundsException: -1
	at org.joda.time.PeriodType.getFieldType(PeriodType.java:628)
	at org.joda.time.base.AbstractPeriod.getFieldType(AbstractPeriod.java:68)
	at org.joda.time.chrono.BaseChronology.get(BaseChronology.java:79)
	at org.joda.time.base.BasePeriod.<init>(BasePeriod.java:236)
	at org.joda.time.MutablePeriod.<init>(MutablePeriod.java:180)
	at org.joda.time.TestMutablePeriod_Updates.testAdd_8ints1(TestMutablePeriod_Updates.java:1062)

testAdd_8ints2(org.joda.time.TestMutablePeriod_Updates)  Time elapsed: 0.001 sec  <<< ERROR!
java.lang.ArrayIndexOutOfBoundsException: -1
	at org.joda.time.PeriodType.getFieldType(PeriodType.java:628)
	at org.joda.time.base.AbstractPeriod.getFieldType(AbstractPeriod.java:68)
	at org.joda.time.chrono.BaseChronology.get(BaseChronology.java:79)
	at org.joda.time.base.BasePeriod.<init>(BasePeriod.java:258)
	at org.joda.time.MutablePeriod.<init>(MutablePeriod.java:200)
	at org.joda.time.TestMutablePeriod_Updates.testAdd_8ints2(TestMutablePeriod_Updates.java:1075)

testAdd_long2(org.joda.time.TestMutablePeriod_Updates)  Time elapsed: 0 sec  <<< ERROR!
java.lang.ArrayIndexOutOfBoundsException: -1
	at org.joda.time.PeriodType.getFieldType(PeriodType.java:628)
	at org.joda.time.base.AbstractPeriod.getFieldType(AbstractPeriod.java:68)
	at org.joda.time.chrono.BaseChronology.get(BaseChronology.java:79)
	at org.joda.time.base.BasePeriod.<init>(BasePeriod.java:258)
	at org.joda.time.MutablePeriod.<init>(MutablePeriod.java:200)
	at org.joda.time.TestMutablePeriod_Updates.testAdd_long2(TestMutablePeriod_Updates.java:1105)

testAdd_long3(org.joda.time.TestMutablePeriod_Updates)  Time elapsed: 0.001 sec  <<< ERROR!
java.lang.ArrayIndexOutOfBoundsException: -1
	at org.joda.time.PeriodType.getFieldType(PeriodType.java:628)
	at org.joda.time.base.AbstractPeriod.getFieldType(AbstractPeriod.java:68)
	at org.joda.time.chrono.BaseChronology.get(BaseChronology.java:79)
	at org.joda.time.base.BasePeriod.<init>(BasePeriod.java:258)
	at org.joda.time.Period.<init>(Period.java:402)
	at org.joda.time.MutablePeriod.add(MutablePeriod.java:707)
	at org.joda.time.TestMutablePeriod_Updates.testAdd_long3(TestMutablePeriod_Updates.java:1125)

testAdd_long_Chronology1(org.joda.time.TestMutablePeriod_Updates)  Time elapsed: 0 sec  <<< ERROR!
java.lang.ArrayIndexOutOfBoundsException: -1
	at org.joda.time.PeriodType.getFieldType(PeriodType.java:628)
	at org.joda.time.base.AbstractPeriod.getFieldType(AbstractPeriod.java:68)
	at org.joda.time.chrono.BaseChronology.get(BaseChronology.java:79)
	at org.joda.time.base.BasePeriod.<init>(BasePeriod.java:236)
	at org.joda.time.MutablePeriod.<init>(MutablePeriod.java:180)
	at org.joda.time.TestMutablePeriod_Updates.testAdd_long_Chronology1(TestMutablePeriod_Updates.java:1138)

testAdd_long_Chronology2(org.joda.time.TestMutablePeriod_Updates)  Time elapsed: 0 sec  <<< ERROR!
java.lang.ArrayIndexOutOfBoundsException: -1
	at org.joda.time.PeriodType.getFieldType(PeriodType.java:628)
	at org.joda.time.base.AbstractPeriod.getFieldType(AbstractPeriod.java:68)
	at org.joda.time.chrono.BaseChronology.get(BaseChronology.java:79)
	at org.joda.time.base.BasePeriod.<init>(BasePeriod.java:258)
	at org.joda.time.MutablePeriod.<init>(MutablePeriod.java:200)
	at org.joda.time.TestMutablePeriod_Updates.testAdd_long_Chronology2(TestMutablePeriod_Updates.java:1151)

testAdd_long_Chronology3(org.joda.time.TestMutablePeriod_Updates)  Time elapsed: 0 sec  <<< ERROR!
java.lang.ArrayIndexOutOfBoundsException: -1
	at org.joda.time.PeriodType.getFieldType(PeriodType.java:628)
	at org.joda.time.base.AbstractPeriod.getFieldType(AbstractPeriod.java:68)
	at org.joda.time.chrono.BaseChronology.get(BaseChronology.java:79)
	at org.joda.time.base.BasePeriod.<init>(BasePeriod.java:258)
	at org.joda.time.MutablePeriod.<init>(MutablePeriod.java:200)
	at org.joda.time.TestMutablePeriod_Updates.testAdd_long_Chronology3(TestMutablePeriod_Updates.java:1170)

testAdd_RP3(org.joda.time.TestMutablePeriod_Updates)  Time elapsed: 0 sec  <<< ERROR!
java.lang.ArrayIndexOutOfBoundsException: -1
	at org.joda.time.PeriodType.getFieldType(PeriodType.java:628)
	at org.joda.time.base.AbstractPeriod.getFieldType(AbstractPeriod.java:68)
	at org.joda.time.chrono.BaseChronology.get(BaseChronology.java:79)
	at org.joda.time.base.BasePeriod.<init>(BasePeriod.java:258)
	at org.joda.time.MutablePeriod.<init>(MutablePeriod.java:200)
	at org.joda.time.TestMutablePeriod_Updates.testAdd_RP3(TestMutablePeriod_Updates.java:1262)

testAdd_RInterval1(org.joda.time.TestMutablePeriod_Updates)  Time elapsed: 0 sec  <<< ERROR!
java.lang.ArrayIndexOutOfBoundsException: -1
	at org.joda.time.PeriodType.getFieldType(PeriodType.java:628)
	at org.joda.time.base.AbstractPeriod.getFieldType(AbstractPeriod.java:68)
	at org.joda.time.chrono.BaseChronology.get(BaseChronology.java:79)
	at org.joda.time.base.BasePeriod.<init>(BasePeriod.java:236)
	at org.joda.time.MutablePeriod.<init>(MutablePeriod.java:180)
	at org.joda.time.TestMutablePeriod_Updates.testAdd_RInterval1(TestMutablePeriod_Updates.java:1318)

testAdd_RInterval2(org.joda.time.TestMutablePeriod_Updates)  Time elapsed: 0.001 sec  <<< ERROR!
java.lang.ArrayIndexOutOfBoundsException: -1
	at org.joda.time.PeriodType.getFieldType(PeriodType.java:628)
	at org.joda.time.base.AbstractPeriod.getFieldType(AbstractPeriod.java:68)
	at org.joda.time.chrono.BaseChronology.get(BaseChronology.java:79)
	at org.joda.time.base.BasePeriod.<init>(BasePeriod.java:236)
	at org.joda.time.MutablePeriod.<init>(MutablePeriod.java:180)
	at org.joda.time.TestMutablePeriod_Updates.testAdd_RInterval2(TestMutablePeriod_Updates.java:1333)

testAdd_RInterval3(org.joda.time.TestMutablePeriod_Updates)  Time elapsed: 0.001 sec  <<< ERROR!
java.lang.ArrayIndexOutOfBoundsException: -1
	at org.joda.time.PeriodType.getFieldType(PeriodType.java:628)
	at org.joda.time.base.AbstractPeriod.getFieldType(AbstractPeriod.java:68)
	at org.joda.time.chrono.BaseChronology.get(BaseChronology.java:79)
	at org.joda.time.base.BasePeriod.<init>(BasePeriod.java:258)
	at org.joda.time.MutablePeriod.<init>(MutablePeriod.java:200)
	at org.joda.time.TestMutablePeriod_Updates.testAdd_RInterval3(TestMutablePeriod_Updates.java:1346)

testAdd_RInterval4(org.joda.time.TestMutablePeriod_Updates)  Time elapsed: 0.003 sec  <<< ERROR!
java.lang.ArrayIndexOutOfBoundsException: -1
	at org.joda.time.PeriodType.getFieldType(PeriodType.java:628)
	at org.joda.time.base.AbstractPeriod.getFieldType(AbstractPeriod.java:68)
	at org.joda.time.chrono.BaseChronology.get(BaseChronology.java:79)
	at org.joda.time.base.BasePeriod.<init>(BasePeriod.java:258)
	at org.joda.time.MutablePeriod.<init>(MutablePeriod.java:200)
	at org.joda.time.TestMutablePeriod_Updates.testAdd_RInterval4(TestMutablePeriod_Updates.java:1361)

testMergePeriod_RP2(org.joda.time.TestMutablePeriod_Updates)  Time elapsed: 0 sec  <<< ERROR!
java.lang.ArrayIndexOutOfBoundsException: -1
	at org.joda.time.PeriodType.getFieldType(PeriodType.java:628)
	at org.joda.time.base.AbstractPeriod.getFieldType(AbstractPeriod.java:68)
	at org.joda.time.chrono.BaseChronology.get(BaseChronology.java:79)
	at org.joda.time.base.BasePeriod.<init>(BasePeriod.java:258)
	at org.joda.time.MutablePeriod.<init>(MutablePeriod.java:200)
	at org.joda.time.TestMutablePeriod_Updates.testMergePeriod_RP2(TestMutablePeriod_Updates.java:1401)

testMergePeriod_RP3(org.joda.time.TestMutablePeriod_Updates)  Time elapsed: 0 sec  <<< ERROR!
java.lang.ArrayIndexOutOfBoundsException: -1
	at org.joda.time.PeriodType.getFieldType(PeriodType.java:628)
	at org.joda.time.base.AbstractPeriod.getFieldType(AbstractPeriod.java:68)
	at org.joda.time.chrono.BaseChronology.get(BaseChronology.java:79)
	at org.joda.time.base.BasePeriod.<init>(BasePeriod.java:258)
	at org.joda.time.MutablePeriod.<init>(MutablePeriod.java:200)
	at org.joda.time.TestMutablePeriod_Updates.testMergePeriod_RP3(TestMutablePeriod_Updates.java:1417)

testAdd_long1(org.joda.time.TestMutablePeriod_Updates)  Time elapsed: 0.001 sec  <<< ERROR!
java.lang.ArrayIndexOutOfBoundsException: -1
	at org.joda.time.PeriodType.getFieldType(PeriodType.java:628)
	at org.joda.time.base.AbstractPeriod.getFieldType(AbstractPeriod.java:68)
	at org.joda.time.chrono.BaseChronology.get(BaseChronology.java:79)
	at org.joda.time.base.BasePeriod.<init>(BasePeriod.java:236)
	at org.joda.time.MutablePeriod.<init>(MutablePeriod.java:180)
	at org.joda.time.TestMutablePeriod_Updates.testAdd_long1(TestMutablePeriod_Updates.java:1092)

testAdd_RD1(org.joda.time.TestMutablePeriod_Updates)  Time elapsed: 0.001 sec  <<< ERROR!
java.lang.ArrayIndexOutOfBoundsException: -1
	at org.joda.time.PeriodType.getFieldType(PeriodType.java:628)
	at org.joda.time.base.AbstractPeriod.getFieldType(AbstractPeriod.java:68)
	at org.joda.time.chrono.BaseChronology.get(BaseChronology.java:79)
	at org.joda.time.base.BasePeriod.<init>(BasePeriod.java:236)
	at org.joda.time.MutablePeriod.<init>(MutablePeriod.java:180)
	at org.joda.time.TestMutablePeriod_Updates.testAdd_RD1(TestMutablePeriod_Updates.java:1190)

testSetInto_Object(org.joda.time.convert.TestReadableDurationConverter)  Time elapsed: 0 sec  <<< ERROR!
java.lang.ArrayIndexOutOfBoundsException: -1
	at org.joda.time.PeriodType.getFieldType(PeriodType.java:628)
	at org.joda.time.base.AbstractPeriod.getFieldType(AbstractPeriod.java:68)
	at org.joda.time.chrono.BaseChronology.get(BaseChronology.java:79)
	at org.joda.time.convert.ReadableDurationConverter.setInto(ReadableDurationConverter.java:75)
	at org.joda.time.convert.TestReadableDurationConverter.testSetInto_Object(TestReadableDurationConverter.java:112)

testGetPeriodType_Object(org.joda.time.convert.TestReadablePeriodConverter)  Time elapsed: 0 sec  <<< ERROR!
java.lang.ArrayIndexOutOfBoundsException: -1
	at org.joda.time.PeriodType.getFieldType(PeriodType.java:628)
	at org.joda.time.base.AbstractPeriod.getFieldType(AbstractPeriod.java:68)
	at org.joda.time.chrono.BaseChronology.get(BaseChronology.java:79)
	at org.joda.time.base.BasePeriod.<init>(BasePeriod.java:258)
	at org.joda.time.Period.<init>(Period.java:402)
	at org.joda.time.convert.TestReadablePeriodConverter.testGetPeriodType_Object(TestReadablePeriodConverter.java:90)


Results :

Tests in error: 
  org.joda.time.TestDuration_Basics#testToPeriod ArrayIndexOutOfBoundsException ...
  org.joda.time.TestDuration_Basics#testToPeriod_Chronology ArrayIndexOutOfBoundsException
  org.joda.time.TestDuration_Basics#testToPeriod_PeriodType ArrayIndexOutOfBoundsException
  org.joda.time.TestDuration_Basics#testToPeriod_PeriodType_Chronology ArrayIndexOutOfBoundsException
  org.joda.time.TestDuration_Basics#testToPeriod_fixedZone ArrayIndexOutOfBoundsException
  org.joda.time.TestInterval_Constructors#testConstructor_RI_RP4 ArrayIndexOutOfBoundsException
  org.joda.time.TestInterval_Constructors#testConstructor_RP_RI4 ArrayIndexOutOfBoundsException
  org.joda.time.TestMutableInterval_Constructors#testConstructor_RI_RP4 ArrayIndexOutOfBoundsException
  org.joda.time.TestMutableInterval_Constructors#testConstructor_RP_RI4 ArrayIndexOutOfBoundsException
  org.joda.time.TestMutableInterval_Updates#testSePeriodAfterStart_RI2 ArrayIndexOutOfBoundsException
  org.joda.time.TestMutableInterval_Updates#testSePeriodBeforeEnd_RI2 ArrayIndexOutOfBoundsException
  org.joda.time.TestMutableInterval_Updates#testSetPeriodAfterStart_RI1 ArrayIndexOutOfBoundsException
  org.joda.time.TestMutableInterval_Updates#testSetPeriodBeforeEnd_RI1 ArrayIndexOutOfBoundsException
  org.joda.time.TestMutablePeriod_Basics#testClone ArrayIndexOutOfBoundsException
  org.joda.time.TestMutablePeriod_Basics#testCopy ArrayIndexOutOfBoundsException
  org.joda.time.TestMutablePeriod_Basics#testEqualsHashCode ArrayIndexOutOfBoundsException
  org.joda.time.TestMutablePeriod_Basics#testSerialization ArrayIndexOutOfBoundsException
  org.joda.time.TestMutablePeriod_Basics#testToDurationFrom ArrayIndexOutOfBoundsException
  org.joda.time.TestMutablePeriod_Basics#testToMutablePeriod ArrayIndexOutOfBoundsException
  org.joda.time.TestMutablePeriod_Basics#testToPeriod ArrayIndexOutOfBoundsException
  org.joda.time.TestMutablePeriod_Basics#testToString ArrayIndexOutOfBoundsException
  org.joda.time.TestMutablePeriod_Constructors#testConstructor_Object_Chronology1 ArrayIndexOutOfBoundsException
  org.joda.time.TestMutablePeriod_Constructors#testConstructor_Object_Chronology2 ArrayIndexOutOfBoundsException
  org.joda.time.TestMutablePeriod_Constructors#testConstructor_long1 ArrayIndexOutOfBoundsException
  org.joda.time.TestMutablePeriod_Constructors#testConstructor_long2 ArrayIndexOutOfBoundsException
  org.joda.time.TestMutablePeriod_Constructors#testConstructor_long3 ArrayIndexOutOfBoundsException
  org.joda.time.TestMutablePeriod_Constructors#testConstructor_long_Chronology1 ArrayIndexOutOfBoundsException
  org.joda.time.TestMutablePeriod_Constructors#testConstructor_long_Chronology2 ArrayIndexOutOfBoundsException
  org.joda.time.TestMutablePeriod_Constructors#testConstructor_long_Chronology3 ArrayIndexOutOfBoundsException
  org.joda.time.TestMutablePeriod_Constructors#testConstructor_long_PeriodType1 ArrayIndexOutOfBoundsException
  org.joda.time.TestMutablePeriod_Constructors#testConstructor_long_PeriodType2 ArrayIndexOutOfBoundsException
  org.joda.time.TestMutablePeriod_Constructors#testConstructor_long_PeriodType3 ArrayIndexOutOfBoundsException
  org.joda.time.TestMutablePeriod_Constructors#testConstructor_long_PeriodType4 ArrayIndexOutOfBoundsException
  org.joda.time.TestMutablePeriod_Constructors#testConstructor_long_PeriodType_Chronology1 ArrayIndexOutOfBoundsException
  org.joda.time.TestMutablePeriod_Constructors#testConstructor_long_PeriodType_Chronology2 ArrayIndexOutOfBoundsException
  org.joda.time.TestMutablePeriod_Constructors#testConstructor_long_PeriodType_Chronology3 ArrayIndexOutOfBoundsException
  org.joda.time.TestMutablePeriod_Constructors#testConstructor_long_PeriodType_Chronology4 ArrayIndexOutOfBoundsException
  org.joda.time.TestMutablePeriod_Updates#testAdd_8ints1 ArrayIndexOutOfBoundsException
  org.joda.time.TestMutablePeriod_Updates#testAdd_8ints2 ArrayIndexOutOfBoundsException
  org.joda.time.TestMutablePeriod_Updates#testAdd_RD1 ArrayIndexOutOfBoundsException
  org.joda.time.TestMutablePeriod_Updates#testAdd_RD2 ArrayIndexOutOfBoundsException
  org.joda.time.TestMutablePeriod_Updates#testAdd_RInterval1 ArrayIndexOutOfBoundsException
  org.joda.time.TestMutablePeriod_Updates#testAdd_RInterval2 ArrayIndexOutOfBoundsException
  org.joda.time.TestMutablePeriod_Updates#testAdd_RInterval3 ArrayIndexOutOfBoundsException
  org.joda.time.TestMutablePeriod_Updates#testAdd_RInterval4 ArrayIndexOutOfBoundsException
  org.joda.time.TestMutablePeriod_Updates#testAdd_RP1 ArrayIndexOutOfBoundsException
  org.joda.time.TestMutablePeriod_Updates#testAdd_RP2 ArrayIndexOutOfBoundsException
  org.joda.time.TestMutablePeriod_Updates#testAdd_RP3 ArrayIndexOutOfBoundsException
  org.joda.time.TestMutablePeriod_Updates#testAdd_long1 ArrayIndexOutOfBoundsException
  org.joda.time.TestMutablePeriod_Updates#testAdd_long2 ArrayIndexOutOfBoundsException
  org.joda.time.TestMutablePeriod_Updates#testAdd_long3 ArrayIndexOutOfBoundsException
  org.joda.time.TestMutablePeriod_Updates#testAdd_long_Chronology1 ArrayIndexOutOfBoundsException
  org.joda.time.TestMutablePeriod_Updates#testAdd_long_Chronology2 ArrayIndexOutOfBoundsException
  org.joda.time.TestMutablePeriod_Updates#testAdd_long_Chronology3 ArrayIndexOutOfBoundsException
  org.joda.time.TestMutablePeriod_Updates#testMergePeriod_RP2 ArrayIndexOutOfBoundsException
  org.joda.time.TestMutablePeriod_Updates#testMergePeriod_RP3 ArrayIndexOutOfBoundsException
  org.joda.time.TestMutablePeriod_Updates#testSetPeriod_8ints2 ArrayIndexOutOfBoundsException
  org.joda.time.TestMutablePeriod_Updates#testSetPeriod_8ints3 ArrayIndexOutOfBoundsException
  org.joda.time.TestMutablePeriod_Updates#testSetPeriod_RD1 ArrayIndexOutOfBoundsException
  org.joda.time.TestMutablePeriod_Updates#testSetPeriod_RD2 ArrayIndexOutOfBoundsException
  org.joda.time.TestMutablePeriod_Updates#testSetPeriod_RP2 ArrayIndexOutOfBoundsException
  org.joda.time.TestMutablePeriod_Updates#testSetPeriod_RP3 ArrayIndexOutOfBoundsException
  org.joda.time.TestMutablePeriod_Updates#testSetPeriod_long1 ArrayIndexOutOfBoundsException
  org.joda.time.TestMutablePeriod_Updates#testSetPeriod_long2 ArrayIndexOutOfBoundsException
  org.joda.time.TestPeriod_Basics#testEqualsHashCode ArrayIndexOutOfBoundsException
  org.joda.time.TestPeriod_Basics#testNormalizedStandard_fullNegative ArrayIndexOutOfBoundsException
  org.joda.time.TestPeriod_Basics#testNormalizedStandard_negative ArrayIndexOutOfBoundsException
  org.joda.time.TestPeriod_Basics#testNormalizedStandard_periodType_monthsWeeks ArrayIndexOutOfBoundsException
  org.joda.time.TestPeriod_Basics#testNormalizedStandard_periodType_weekDay1 ArrayIndexOutOfBoundsException
  org.joda.time.TestPeriod_Basics#testNormalizedStandard_periodType_weekDay2 ArrayIndexOutOfBoundsException
  org.joda.time.TestPeriod_Basics#testNormalizedStandard_periodType_weekDay3 ArrayIndexOutOfBoundsException
  org.joda.time.TestPeriod_Basics#testNormalizedStandard_periodType_yearMonth3 ArrayIndexOutOfBoundsException
  org.joda.time.TestPeriod_Basics#testNormalizedStandard_periodType_yearMonthDay ArrayIndexOutOfBoundsException
  org.joda.time.TestPeriod_Basics#testNormalizedStandard_periodType_yearMonthWeekDay ArrayIndexOutOfBoundsException
  org.joda.time.TestPeriod_Basics#testNormalizedStandard_weekDay1 ArrayIndexOutOfBoundsException
  org.joda.time.TestPeriod_Basics#testNormalizedStandard_weekDay2 ArrayIndexOutOfBoundsException
  org.joda.time.TestPeriod_Basics#testNormalizedStandard_yearMonthDay ArrayIndexOutOfBoundsException
  org.joda.time.TestPeriod_Basics#testNormalizedStandard_yearMonthWeekDay ArrayIndexOutOfBoundsException
  org.joda.time.TestPeriod_Basics#testSerialization ArrayIndexOutOfBoundsException
  org.joda.time.TestPeriod_Basics#testToDurationFrom ArrayIndexOutOfBoundsException
  org.joda.time.TestPeriod_Basics#testToDurationTo ArrayIndexOutOfBoundsException
  org.joda.time.TestPeriod_Basics#testToMutablePeriod ArrayIndexOutOfBoundsException
  org.joda.time.TestPeriod_Basics#testToPeriod ArrayIndexOutOfBoundsException -1
  org.joda.time.TestPeriod_Basics#testToString ArrayIndexOutOfBoundsException -1
  org.joda.time.TestPeriod_Basics#testWithPeriodType1 ArrayIndexOutOfBoundsException
  org.joda.time.TestPeriod_Basics#testWithPeriodType2 ArrayIndexOutOfBoundsException
  org.joda.time.TestPeriod_Basics#testWithPeriodType4 ArrayIndexOutOfBoundsException
  org.joda.time.TestPeriod_Constructors#testConstructor_long1 ArrayIndexOutOfBoundsException
  org.joda.time.TestPeriod_Constructors#testConstructor_long2 ArrayIndexOutOfBoundsException
  org.joda.time.TestPeriod_Constructors#testConstructor_long3 ArrayIndexOutOfBoundsException
  org.joda.time.TestPeriod_Constructors#testConstructor_long_Chronology1 ArrayIndexOutOfBoundsException
  org.joda.time.TestPeriod_Constructors#testConstructor_long_Chronology2 ArrayIndexOutOfBoundsException
  org.joda.time.TestPeriod_Constructors#testConstructor_long_Chronology3 ArrayIndexOutOfBoundsException
  org.joda.time.TestPeriod_Constructors#testConstructor_long_PeriodType1 ArrayIndexOutOfBoundsException
  org.joda.time.TestPeriod_Constructors#testConstructor_long_PeriodType2 ArrayIndexOutOfBoundsException
  org.joda.time.TestPeriod_Constructors#testConstructor_long_PeriodType3 ArrayIndexOutOfBoundsException
  org.joda.time.TestPeriod_Constructors#testConstructor_long_PeriodType4 ArrayIndexOutOfBoundsException
  org.joda.time.TestPeriod_Constructors#testConstructor_long_PeriodType_Chronology1 ArrayIndexOutOfBoundsException
  org.joda.time.TestPeriod_Constructors#testConstructor_long_PeriodType_Chronology2 ArrayIndexOutOfBoundsException
  org.joda.time.TestPeriod_Constructors#testConstructor_long_PeriodType_Chronology3 ArrayIndexOutOfBoundsException
  org.joda.time.TestPeriod_Constructors#testConstructor_long_PeriodType_Chronology4 ArrayIndexOutOfBoundsException
  org.joda.time.TestPeriod_Constructors#testConstructor_long_fixedZone ArrayIndexOutOfBoundsException
  org.joda.time.convert.TestReadableDurationConverter#testSetInto_Object ArrayIndexOutOfBoundsException
  org.joda.time.convert.TestReadablePeriodConverter#testGetPeriodType_Object ArrayIndexOutOfBoundsException

Tests run: 4157, Failures: 0, Errors: 104, Skipped: 0

[INFO] ------------------------------------------------------------------------
[INFO] BUILD FAILURE
[INFO] ------------------------------------------------------------------------
[INFO] Total time: 20.443s
[INFO] Finished at: Wed Aug 05 21:47:02 BST 2015
[INFO] Final Memory: 9M/213M
[INFO] ------------------------------------------------------------------------
[ERROR] Failed to execute goal org.apache.maven.plugins:maven-surefire-plugin:2.18.1:test (default-test) on project joda-time: There are test failures.
[ERROR] 
[ERROR] Please refer to /home/perham/Study/LittleDarwin/Cases/joda-time-2.8.1/target/surefire-reports for the individual test results.
[ERROR] -> [Help 1]
[ERROR] 
[ERROR] To see the full stack trace of the errors, re-run Maven with the -e switch.
[ERROR] Re-run Maven using the -X switch to enable full debug logging.
[ERROR] 
[ERROR] For more information about the errors and possible solutions, please read the following articles:
[ERROR] [Help 1] http://cwiki.apache.org/confluence/display/MAVEN/MojoFailureException
