[INFO] Scanning for projects...
[INFO]                                                                         
[INFO] ------------------------------------------------------------------------
[INFO] Building Joda-Time 2.8.1
[INFO] ------------------------------------------------------------------------
[INFO] 
[INFO] --- maven-resources-plugin:2.7:resources (default-resources) @ joda-time ---
[INFO] Using 'UTF-8' encoding to copy filtered resources.
[INFO] Copying 2 resources to META-INF
[INFO] Copying 10 resources
[INFO] 
[INFO] --- maven-compiler-plugin:3.3:compile (default-compile) @ joda-time ---
[INFO] Changes detected - recompiling the module!
[INFO] Compiling 166 source files to /home/perham/Study/LittleDarwin/Cases/joda-time-2.8.1/target/classes
[INFO] 
[INFO] --- exec-maven-plugin:1.4.0:java (compile-tzdb) @ joda-time ---
Writing zoneinfo files
Writing ZoneInfoMap
[INFO] 
[INFO] --- maven-resources-plugin:2.7:testResources (default-testResources) @ joda-time ---
[INFO] Using 'UTF-8' encoding to copy filtered resources.
[INFO] Copying 34 resources
[INFO] 
[INFO] --- maven-compiler-plugin:3.3:testCompile (default-testCompile) @ joda-time ---
[INFO] Nothing to compile - all classes are up to date
[INFO] 
[INFO] --- maven-surefire-plugin:2.18.1:test (default-test) @ joda-time ---
[INFO] Surefire report directory: /home/perham/Study/LittleDarwin/Cases/joda-time-2.8.1/target/surefire-reports

-------------------------------------------------------
 T E S T S
-------------------------------------------------------
Running org.joda.time.TestAllPackages

TestBuddhistChronology.testCalendar

TestCopticChronology.testCalendar

TestEthiopicChronology.testCalendar

TestIslamicChronology.testCalendar

Testing Gregorian chronology over 1000 iterations
100% complete (i=1000)

Testing Julian chronology over 1000 iterations
100% complete (i=1000)
Writing zoneinfo files
Writing ZoneInfoMap
Tests run: 4157, Failures: 136, Errors: 40, Skipped: 0, Time elapsed: 6.191 sec <<< FAILURE! - in org.joda.time.TestAllPackages
testConstructor_nullObject(org.joda.time.TestLocalDateTime_Constructors)  Time elapsed: 0.013 sec  <<< ERROR!
org.joda.time.IllegalFieldValueException: Value 0 for monthOfYear must be in the range [1,12]
	at org.joda.time.field.FieldUtils.verifyValueBounds(FieldUtils.java:252)
	at org.joda.time.chrono.BasicChronology.getDateMidnightMillis(BasicChronology.java:612)
	at org.joda.time.chrono.BasicChronology.getDateTimeMillis(BasicChronology.java:159)
	at org.joda.time.chrono.GregorianChronology.getDateTimeMillis(GregorianChronology.java:44)
	at org.joda.time.chrono.AssembledChronology.getDateTimeMillis(AssembledChronology.java:120)
	at org.joda.time.LocalDateTime.<init>(LocalDateTime.java:415)
	at org.joda.time.LocalDateTime.<init>(LocalDateTime.java:358)
	at org.joda.time.TestLocalDateTime_Constructors.testConstructor_nullObject(TestLocalDateTime_Constructors.java:368)

testConstructor_ObjectString2(org.joda.time.TestLocalDateTime_Constructors)  Time elapsed: 0.001 sec  <<< ERROR!
org.joda.time.IllegalFieldValueException: Value 0 for monthOfYear must be in the range [1,12]
	at org.joda.time.field.FieldUtils.verifyValueBounds(FieldUtils.java:252)
	at org.joda.time.chrono.BasicChronology.getDateMidnightMillis(BasicChronology.java:612)
	at org.joda.time.chrono.BasicChronology.getDateTimeMillis(BasicChronology.java:159)
	at org.joda.time.chrono.GregorianChronology.getDateTimeMillis(GregorianChronology.java:44)
	at org.joda.time.chrono.AssembledChronology.getDateTimeMillis(AssembledChronology.java:120)
	at org.joda.time.LocalDateTime.<init>(LocalDateTime.java:415)
	at org.joda.time.LocalDateTime.<init>(LocalDateTime.java:358)
	at org.joda.time.TestLocalDateTime_Constructors.testConstructor_ObjectString2(TestLocalDateTime_Constructors.java:392)

testConstructor_ObjectString3(org.joda.time.TestLocalDateTime_Constructors)  Time elapsed: 0.003 sec  <<< ERROR!
org.joda.time.IllegalFieldValueException: Value 0 for monthOfYear must be in the range [1,12]
	at org.joda.time.field.FieldUtils.verifyValueBounds(FieldUtils.java:252)
	at org.joda.time.chrono.BasicChronology.getDateMidnightMillis(BasicChronology.java:612)
	at org.joda.time.chrono.BasicChronology.getDateTimeMillis(BasicChronology.java:159)
	at org.joda.time.chrono.GregorianChronology.getDateTimeMillis(GregorianChronology.java:44)
	at org.joda.time.chrono.AssembledChronology.getDateTimeMillis(AssembledChronology.java:120)
	at org.joda.time.LocalDateTime.<init>(LocalDateTime.java:415)
	at org.joda.time.LocalDateTime.<init>(LocalDateTime.java:358)
	at org.joda.time.TestLocalDateTime_Constructors.testConstructor_ObjectString3(TestLocalDateTime_Constructors.java:404)

testConstructor_ObjectString4(org.joda.time.TestLocalDateTime_Constructors)  Time elapsed: 0.003 sec  <<< ERROR!
org.joda.time.IllegalFieldValueException: Value 0 for monthOfYear must be in the range [1,12]
	at org.joda.time.field.FieldUtils.verifyValueBounds(FieldUtils.java:252)
	at org.joda.time.chrono.BasicChronology.getDateMidnightMillis(BasicChronology.java:612)
	at org.joda.time.chrono.BasicChronology.getDateTimeMillis(BasicChronology.java:159)
	at org.joda.time.chrono.GregorianChronology.getDateTimeMillis(GregorianChronology.java:44)
	at org.joda.time.chrono.AssembledChronology.getDateTimeMillis(AssembledChronology.java:120)
	at org.joda.time.LocalDateTime.<init>(LocalDateTime.java:415)
	at org.joda.time.LocalDateTime.<init>(LocalDateTime.java:358)
	at org.joda.time.TestLocalDateTime_Constructors.testConstructor_ObjectString4(TestLocalDateTime_Constructors.java:416)

testConstructor_Object_DateTimeZone(org.joda.time.TestLocalDateTime_Constructors)  Time elapsed: 0.003 sec  <<< ERROR!
org.joda.time.IllegalFieldValueException: Value 0 for monthOfYear must be in the range [1,12]
	at org.joda.time.field.FieldUtils.verifyValueBounds(FieldUtils.java:252)
	at org.joda.time.chrono.BasicChronology.getDateMidnightMillis(BasicChronology.java:612)
	at org.joda.time.chrono.BasicChronology.getDateTimeMillis(BasicChronology.java:159)
	at org.joda.time.chrono.GregorianChronology.getDateTimeMillis(GregorianChronology.java:44)
	at org.joda.time.chrono.AssembledChronology.getDateTimeMillis(AssembledChronology.java:120)
	at org.joda.time.LocalDateTime.<init>(LocalDateTime.java:385)
	at org.joda.time.TestLocalDateTime_Constructors.testConstructor_Object_DateTimeZone(TestLocalDateTime_Constructors.java:501)

testConstructor_nullObject_DateTimeZone(org.joda.time.TestLocalDateTime_Constructors)  Time elapsed: 0.003 sec  <<< ERROR!
org.joda.time.IllegalFieldValueException: Value 0 for monthOfYear must be in the range [1,12]
	at org.joda.time.field.FieldUtils.verifyValueBounds(FieldUtils.java:252)
	at org.joda.time.chrono.BasicChronology.getDateMidnightMillis(BasicChronology.java:612)
	at org.joda.time.chrono.BasicChronology.getDateTimeMillis(BasicChronology.java:159)
	at org.joda.time.chrono.GregorianChronology.getDateTimeMillis(GregorianChronology.java:44)
	at org.joda.time.chrono.AssembledChronology.getDateTimeMillis(AssembledChronology.java:120)
	at org.joda.time.LocalDateTime.<init>(LocalDateTime.java:385)
	at org.joda.time.TestLocalDateTime_Constructors.testConstructor_nullObject_DateTimeZone(TestLocalDateTime_Constructors.java:541)

testConstructor_Object_nullDateTimeZone(org.joda.time.TestLocalDateTime_Constructors)  Time elapsed: 0.003 sec  <<< ERROR!
org.joda.time.IllegalFieldValueException: Value 0 for monthOfYear must be in the range [1,12]
	at org.joda.time.field.FieldUtils.verifyValueBounds(FieldUtils.java:252)
	at org.joda.time.chrono.BasicChronology.getDateMidnightMillis(BasicChronology.java:612)
	at org.joda.time.chrono.BasicChronology.getDateTimeMillis(BasicChronology.java:159)
	at org.joda.time.chrono.GregorianChronology.getDateTimeMillis(GregorianChronology.java:44)
	at org.joda.time.chrono.AssembledChronology.getDateTimeMillis(AssembledChronology.java:120)
	at org.joda.time.LocalDateTime.<init>(LocalDateTime.java:385)
	at org.joda.time.TestLocalDateTime_Constructors.testConstructor_Object_nullDateTimeZone(TestLocalDateTime_Constructors.java:554)

testConstructor_nullObject_nullDateTimeZone(org.joda.time.TestLocalDateTime_Constructors)  Time elapsed: 0.001 sec  <<< ERROR!
org.joda.time.IllegalFieldValueException: Value 0 for monthOfYear must be in the range [1,12]
	at org.joda.time.field.FieldUtils.verifyValueBounds(FieldUtils.java:252)
	at org.joda.time.chrono.BasicChronology.getDateMidnightMillis(BasicChronology.java:612)
	at org.joda.time.chrono.BasicChronology.getDateTimeMillis(BasicChronology.java:159)
	at org.joda.time.chrono.GregorianChronology.getDateTimeMillis(GregorianChronology.java:44)
	at org.joda.time.chrono.AssembledChronology.getDateTimeMillis(AssembledChronology.java:120)
	at org.joda.time.LocalDateTime.<init>(LocalDateTime.java:385)
	at org.joda.time.TestLocalDateTime_Constructors.testConstructor_nullObject_nullDateTimeZone(TestLocalDateTime_Constructors.java:566)

testConstructor_Object_Chronology(org.joda.time.TestLocalDateTime_Constructors)  Time elapsed: 0.001 sec  <<< ERROR!
org.joda.time.IllegalFieldValueException: Value 0 for monthOfYear must be in the range [1,12]
	at org.joda.time.field.FieldUtils.verifyValueBounds(FieldUtils.java:252)
	at org.joda.time.chrono.BasicChronology.getDateMidnightMillis(BasicChronology.java:612)
	at org.joda.time.chrono.BasicChronology.getDateTimeMillis(BasicChronology.java:159)
	at org.joda.time.chrono.GregorianChronology.getDateTimeMillis(GregorianChronology.java:44)
	at org.joda.time.LocalDateTime.<init>(LocalDateTime.java:415)
	at org.joda.time.TestLocalDateTime_Constructors.testConstructor_Object_Chronology(TestLocalDateTime_Constructors.java:580)

testConstructor_nullObject_Chronology(org.joda.time.TestLocalDateTime_Constructors)  Time elapsed: 0.002 sec  <<< ERROR!
org.joda.time.IllegalFieldValueException: Value 0 for monthOfYear must be in the range [1,12]
	at org.joda.time.field.FieldUtils.verifyValueBounds(FieldUtils.java:252)
	at org.joda.time.chrono.BasicChronology.getDateMidnightMillis(BasicChronology.java:612)
	at org.joda.time.chrono.BasicChronology.getDateTimeMillis(BasicChronology.java:159)
	at org.joda.time.chrono.GregorianChronology.getDateTimeMillis(GregorianChronology.java:44)
	at org.joda.time.LocalDateTime.<init>(LocalDateTime.java:415)
	at org.joda.time.TestLocalDateTime_Constructors.testConstructor_nullObject_Chronology(TestLocalDateTime_Constructors.java:633)

testConstructor_Object_nullChronology(org.joda.time.TestLocalDateTime_Constructors)  Time elapsed: 0.002 sec  <<< ERROR!
org.joda.time.IllegalFieldValueException: Value 0 for monthOfYear must be in the range [1,12]
	at org.joda.time.field.FieldUtils.verifyValueBounds(FieldUtils.java:252)
	at org.joda.time.chrono.BasicChronology.getDateMidnightMillis(BasicChronology.java:612)
	at org.joda.time.chrono.BasicChronology.getDateTimeMillis(BasicChronology.java:159)
	at org.joda.time.chrono.GregorianChronology.getDateTimeMillis(GregorianChronology.java:44)
	at org.joda.time.chrono.AssembledChronology.getDateTimeMillis(AssembledChronology.java:120)
	at org.joda.time.LocalDateTime.<init>(LocalDateTime.java:415)
	at org.joda.time.TestLocalDateTime_Constructors.testConstructor_Object_nullChronology(TestLocalDateTime_Constructors.java:646)

testConstructor_nullObject_nullChronology(org.joda.time.TestLocalDateTime_Constructors)  Time elapsed: 0.001 sec  <<< ERROR!
org.joda.time.IllegalFieldValueException: Value 0 for monthOfYear must be in the range [1,12]
	at org.joda.time.field.FieldUtils.verifyValueBounds(FieldUtils.java:252)
	at org.joda.time.chrono.BasicChronology.getDateMidnightMillis(BasicChronology.java:612)
	at org.joda.time.chrono.BasicChronology.getDateTimeMillis(BasicChronology.java:159)
	at org.joda.time.chrono.GregorianChronology.getDateTimeMillis(GregorianChronology.java:44)
	at org.joda.time.chrono.AssembledChronology.getDateTimeMillis(AssembledChronology.java:120)
	at org.joda.time.LocalDateTime.<init>(LocalDateTime.java:415)
	at org.joda.time.TestLocalDateTime_Constructors.testConstructor_nullObject_nullChronology(TestLocalDateTime_Constructors.java:658)

testConstructor_Object1(org.joda.time.TestLocalDateTime_Constructors)  Time elapsed: 0.002 sec  <<< ERROR!
org.joda.time.IllegalFieldValueException: Value 0 for monthOfYear must be in the range [1,12]
	at org.joda.time.field.FieldUtils.verifyValueBounds(FieldUtils.java:252)
	at org.joda.time.chrono.BasicChronology.getDateMidnightMillis(BasicChronology.java:612)
	at org.joda.time.chrono.BasicChronology.getDateTimeMillis(BasicChronology.java:159)
	at org.joda.time.chrono.GregorianChronology.getDateTimeMillis(GregorianChronology.java:44)
	at org.joda.time.chrono.AssembledChronology.getDateTimeMillis(AssembledChronology.java:120)
	at org.joda.time.LocalDateTime.<init>(LocalDateTime.java:415)
	at org.joda.time.LocalDateTime.<init>(LocalDateTime.java:358)
	at org.joda.time.TestLocalDateTime_Constructors.testConstructor_Object1(TestLocalDateTime_Constructors.java:356)

testConstructor_ObjectString1(org.joda.time.TestLocalDateTime_Constructors)  Time elapsed: 0.002 sec  <<< ERROR!
org.joda.time.IllegalFieldValueException: Value 0 for monthOfYear must be in the range [1,12]
	at org.joda.time.field.FieldUtils.verifyValueBounds(FieldUtils.java:252)
	at org.joda.time.chrono.BasicChronology.getDateMidnightMillis(BasicChronology.java:612)
	at org.joda.time.chrono.BasicChronology.getDateTimeMillis(BasicChronology.java:159)
	at org.joda.time.chrono.GregorianChronology.getDateTimeMillis(GregorianChronology.java:44)
	at org.joda.time.chrono.AssembledChronology.getDateTimeMillis(AssembledChronology.java:120)
	at org.joda.time.LocalDateTime.<init>(LocalDateTime.java:415)
	at org.joda.time.LocalDateTime.<init>(LocalDateTime.java:358)
	at org.joda.time.TestLocalDateTime_Constructors.testConstructor_ObjectString1(TestLocalDateTime_Constructors.java:380)

testConstructor_Object_DateTimeZoneMoscow(org.joda.time.TestLocalDateTime_Constructors)  Time elapsed: 0.002 sec  <<< ERROR!
org.joda.time.IllegalFieldValueException: Value 0 for monthOfYear must be in the range [1,12]
	at org.joda.time.field.FieldUtils.verifyValueBounds(FieldUtils.java:252)
	at org.joda.time.chrono.BasicChronology.getDateMidnightMillis(BasicChronology.java:612)
	at org.joda.time.chrono.BasicChronology.getDateTimeMillis(BasicChronology.java:159)
	at org.joda.time.chrono.GregorianChronology.getDateTimeMillis(GregorianChronology.java:44)
	at org.joda.time.chrono.AssembledChronology.getDateTimeMillis(AssembledChronology.java:120)
	at org.joda.time.LocalDateTime.<init>(LocalDateTime.java:385)
	at org.joda.time.TestLocalDateTime_Constructors.testConstructor_Object_DateTimeZoneMoscow(TestLocalDateTime_Constructors.java:513)

testConstructor_Object_DateTimeZoneMoscowBadDateTime(org.joda.time.TestLocalDateTime_Constructors)  Time elapsed: 0.002 sec  <<< ERROR!
org.joda.time.IllegalFieldValueException: Value 0 for monthOfYear must be in the range [1,12]
	at org.joda.time.field.FieldUtils.verifyValueBounds(FieldUtils.java:252)
	at org.joda.time.chrono.BasicChronology.getDateMidnightMillis(BasicChronology.java:612)
	at org.joda.time.chrono.BasicChronology.getDateTimeMillis(BasicChronology.java:159)
	at org.joda.time.chrono.GregorianChronology.getDateTimeMillis(GregorianChronology.java:44)
	at org.joda.time.chrono.AssembledChronology.getDateTimeMillis(AssembledChronology.java:120)
	at org.joda.time.LocalDateTime.<init>(LocalDateTime.java:385)
	at org.joda.time.TestLocalDateTime_Constructors.testConstructor_Object_DateTimeZoneMoscowBadDateTime(TestLocalDateTime_Constructors.java:529)

testConstructor_Object_ChronologyMoscow(org.joda.time.TestLocalDateTime_Constructors)  Time elapsed: 0.002 sec  <<< ERROR!
org.joda.time.IllegalFieldValueException: Value 0 for monthOfYear must be in the range [1,12]
	at org.joda.time.field.FieldUtils.verifyValueBounds(FieldUtils.java:252)
	at org.joda.time.chrono.BasicChronology.getDateMidnightMillis(BasicChronology.java:612)
	at org.joda.time.chrono.BasicChronology.getDateTimeMillis(BasicChronology.java:159)
	at org.joda.time.chrono.GregorianChronology.getDateTimeMillis(GregorianChronology.java:44)
	at org.joda.time.LocalDateTime.<init>(LocalDateTime.java:415)
	at org.joda.time.TestLocalDateTime_Constructors.testConstructor_Object_ChronologyMoscow(TestLocalDateTime_Constructors.java:605)

testConstructor_Object_ChronologyMoscowBadDateTime(org.joda.time.TestLocalDateTime_Constructors)  Time elapsed: 0.002 sec  <<< ERROR!
org.joda.time.IllegalFieldValueException: Value 0 for monthOfYear must be in the range [1,12]
	at org.joda.time.field.FieldUtils.verifyValueBounds(FieldUtils.java:252)
	at org.joda.time.chrono.BasicChronology.getDateMidnightMillis(BasicChronology.java:612)
	at org.joda.time.chrono.BasicChronology.getDateTimeMillis(BasicChronology.java:159)
	at org.joda.time.chrono.GregorianChronology.getDateTimeMillis(GregorianChronology.java:44)
	at org.joda.time.LocalDateTime.<init>(LocalDateTime.java:415)
	at org.joda.time.TestLocalDateTime_Constructors.testConstructor_Object_ChronologyMoscowBadDateTime(TestLocalDateTime_Constructors.java:621)

testConstructor_nullObject(org.joda.time.TestLocalDate_Constructors)  Time elapsed: 0.001 sec  <<< ERROR!
org.joda.time.IllegalFieldValueException: Value 0 for monthOfYear must be in the range [1,12]
	at org.joda.time.field.FieldUtils.verifyValueBounds(FieldUtils.java:252)
	at org.joda.time.chrono.BasicChronology.getDateMidnightMillis(BasicChronology.java:612)
	at org.joda.time.chrono.BasicChronology.getDateTimeMillis(BasicChronology.java:159)
	at org.joda.time.chrono.GregorianChronology.getDateTimeMillis(GregorianChronology.java:44)
	at org.joda.time.chrono.AssembledChronology.getDateTimeMillis(AssembledChronology.java:120)
	at org.joda.time.LocalDate.<init>(LocalDate.java:420)
	at org.joda.time.LocalDate.<init>(LocalDate.java:363)
	at org.joda.time.TestLocalDate_Constructors.testConstructor_nullObject(TestLocalDate_Constructors.java:325)

testConstructor_ObjectString2(org.joda.time.TestLocalDate_Constructors)  Time elapsed: 0.002 sec  <<< ERROR!
org.joda.time.IllegalFieldValueException: Value 0 for monthOfYear must be in the range [1,12]
	at org.joda.time.field.FieldUtils.verifyValueBounds(FieldUtils.java:252)
	at org.joda.time.chrono.BasicChronology.getDateMidnightMillis(BasicChronology.java:612)
	at org.joda.time.chrono.BasicChronology.getDateTimeMillis(BasicChronology.java:159)
	at org.joda.time.chrono.GregorianChronology.getDateTimeMillis(GregorianChronology.java:44)
	at org.joda.time.chrono.AssembledChronology.getDateTimeMillis(AssembledChronology.java:120)
	at org.joda.time.LocalDate.<init>(LocalDate.java:420)
	at org.joda.time.LocalDate.<init>(LocalDate.java:363)
	at org.joda.time.TestLocalDate_Constructors.testConstructor_ObjectString2(TestLocalDate_Constructors.java:341)

testConstructor_ObjectString3(org.joda.time.TestLocalDate_Constructors)  Time elapsed: 0.001 sec  <<< ERROR!
org.joda.time.IllegalFieldValueException: Value 0 for monthOfYear must be in the range [1,12]
	at org.joda.time.field.FieldUtils.verifyValueBounds(FieldUtils.java:252)
	at org.joda.time.chrono.BasicChronology.getDateMidnightMillis(BasicChronology.java:612)
	at org.joda.time.chrono.BasicChronology.getDateTimeMillis(BasicChronology.java:159)
	at org.joda.time.chrono.GregorianChronology.getDateTimeMillis(GregorianChronology.java:44)
	at org.joda.time.chrono.AssembledChronology.getDateTimeMillis(AssembledChronology.java:120)
	at org.joda.time.LocalDate.<init>(LocalDate.java:420)
	at org.joda.time.LocalDate.<init>(LocalDate.java:363)
	at org.joda.time.TestLocalDate_Constructors.testConstructor_ObjectString3(TestLocalDate_Constructors.java:349)

testConstructor_Object_DateTimeZone(org.joda.time.TestLocalDate_Constructors)  Time elapsed: 0.002 sec  <<< ERROR!
org.joda.time.IllegalFieldValueException: Value 0 for monthOfYear must be in the range [1,12]
	at org.joda.time.field.FieldUtils.verifyValueBounds(FieldUtils.java:252)
	at org.joda.time.chrono.BasicChronology.getDateMidnightMillis(BasicChronology.java:612)
	at org.joda.time.chrono.BasicChronology.getDateTimeMillis(BasicChronology.java:159)
	at org.joda.time.chrono.GregorianChronology.getDateTimeMillis(GregorianChronology.java:44)
	at org.joda.time.chrono.AssembledChronology.getDateTimeMillis(AssembledChronology.java:120)
	at org.joda.time.LocalDate.<init>(LocalDate.java:390)
	at org.joda.time.TestLocalDate_Constructors.testConstructor_Object_DateTimeZone(TestLocalDate_Constructors.java:444)

testConstructor_nullObject_DateTimeZone(org.joda.time.TestLocalDate_Constructors)  Time elapsed: 0.001 sec  <<< ERROR!
org.joda.time.IllegalFieldValueException: Value 0 for monthOfYear must be in the range [1,12]
	at org.joda.time.field.FieldUtils.verifyValueBounds(FieldUtils.java:252)
	at org.joda.time.chrono.BasicChronology.getDateMidnightMillis(BasicChronology.java:612)
	at org.joda.time.chrono.BasicChronology.getDateTimeMillis(BasicChronology.java:159)
	at org.joda.time.chrono.GregorianChronology.getDateTimeMillis(GregorianChronology.java:44)
	at org.joda.time.chrono.AssembledChronology.getDateTimeMillis(AssembledChronology.java:120)
	at org.joda.time.LocalDate.<init>(LocalDate.java:390)
	at org.joda.time.TestLocalDate_Constructors.testConstructor_nullObject_DateTimeZone(TestLocalDate_Constructors.java:452)

testConstructor_Object_nullDateTimeZone(org.joda.time.TestLocalDate_Constructors)  Time elapsed: 0.001 sec  <<< ERROR!
org.joda.time.IllegalFieldValueException: Value 0 for monthOfYear must be in the range [1,12]
	at org.joda.time.field.FieldUtils.verifyValueBounds(FieldUtils.java:252)
	at org.joda.time.chrono.BasicChronology.getDateMidnightMillis(BasicChronology.java:612)
	at org.joda.time.chrono.BasicChronology.getDateTimeMillis(BasicChronology.java:159)
	at org.joda.time.chrono.GregorianChronology.getDateTimeMillis(GregorianChronology.java:44)
	at org.joda.time.chrono.AssembledChronology.getDateTimeMillis(AssembledChronology.java:120)
	at org.joda.time.LocalDate.<init>(LocalDate.java:390)
	at org.joda.time.TestLocalDate_Constructors.testConstructor_Object_nullDateTimeZone(TestLocalDate_Constructors.java:461)

testConstructor_nullObject_nullDateTimeZone(org.joda.time.TestLocalDate_Constructors)  Time elapsed: 0.001 sec  <<< ERROR!
org.joda.time.IllegalFieldValueException: Value 0 for monthOfYear must be in the range [1,12]
	at org.joda.time.field.FieldUtils.verifyValueBounds(FieldUtils.java:252)
	at org.joda.time.chrono.BasicChronology.getDateMidnightMillis(BasicChronology.java:612)
	at org.joda.time.chrono.BasicChronology.getDateTimeMillis(BasicChronology.java:159)
	at org.joda.time.chrono.GregorianChronology.getDateTimeMillis(GregorianChronology.java:44)
	at org.joda.time.chrono.AssembledChronology.getDateTimeMillis(AssembledChronology.java:120)
	at org.joda.time.LocalDate.<init>(LocalDate.java:390)
	at org.joda.time.TestLocalDate_Constructors.testConstructor_nullObject_nullDateTimeZone(TestLocalDate_Constructors.java:469)

testConstructor_Object_Chronology(org.joda.time.TestLocalDate_Constructors)  Time elapsed: 0.001 sec  <<< ERROR!
org.joda.time.IllegalFieldValueException: Value 0 for monthOfYear must be in the range [1,12]
	at org.joda.time.field.FieldUtils.verifyValueBounds(FieldUtils.java:252)
	at org.joda.time.chrono.BasicChronology.getDateMidnightMillis(BasicChronology.java:612)
	at org.joda.time.chrono.BasicChronology.getDateTimeMillis(BasicChronology.java:159)
	at org.joda.time.chrono.GregorianChronology.getDateTimeMillis(GregorianChronology.java:44)
	at org.joda.time.LocalDate.<init>(LocalDate.java:420)
	at org.joda.time.TestLocalDate_Constructors.testConstructor_Object_Chronology(TestLocalDate_Constructors.java:478)

testConstructor_nullObject_Chronology(org.joda.time.TestLocalDate_Constructors)  Time elapsed: 0.002 sec  <<< ERROR!
org.joda.time.IllegalFieldValueException: Value 0 for monthOfYear must be in the range [1,12]
	at org.joda.time.field.FieldUtils.verifyValueBounds(FieldUtils.java:252)
	at org.joda.time.chrono.BasicChronology.getDateMidnightMillis(BasicChronology.java:612)
	at org.joda.time.chrono.BasicChronology.getDateTimeMillis(BasicChronology.java:159)
	at org.joda.time.chrono.GregorianChronology.getDateTimeMillis(GregorianChronology.java:44)
	at org.joda.time.LocalDate.<init>(LocalDate.java:420)
	at org.joda.time.TestLocalDate_Constructors.testConstructor_nullObject_Chronology(TestLocalDate_Constructors.java:495)

testConstructor_Object_nullChronology(org.joda.time.TestLocalDate_Constructors)  Time elapsed: 0.001 sec  <<< ERROR!
org.joda.time.IllegalFieldValueException: Value 0 for monthOfYear must be in the range [1,12]
	at org.joda.time.field.FieldUtils.verifyValueBounds(FieldUtils.java:252)
	at org.joda.time.chrono.BasicChronology.getDateMidnightMillis(BasicChronology.java:612)
	at org.joda.time.chrono.BasicChronology.getDateTimeMillis(BasicChronology.java:159)
	at org.joda.time.chrono.GregorianChronology.getDateTimeMillis(GregorianChronology.java:44)
	at org.joda.time.chrono.AssembledChronology.getDateTimeMillis(AssembledChronology.java:120)
	at org.joda.time.LocalDate.<init>(LocalDate.java:420)
	at org.joda.time.TestLocalDate_Constructors.testConstructor_Object_nullChronology(TestLocalDate_Constructors.java:504)

testConstructor_nullObject_nullChronology(org.joda.time.TestLocalDate_Constructors)  Time elapsed: 0.001 sec  <<< ERROR!
org.joda.time.IllegalFieldValueException: Value 0 for monthOfYear must be in the range [1,12]
	at org.joda.time.field.FieldUtils.verifyValueBounds(FieldUtils.java:252)
	at org.joda.time.chrono.BasicChronology.getDateMidnightMillis(BasicChronology.java:612)
	at org.joda.time.chrono.BasicChronology.getDateTimeMillis(BasicChronology.java:159)
	at org.joda.time.chrono.GregorianChronology.getDateTimeMillis(GregorianChronology.java:44)
	at org.joda.time.chrono.AssembledChronology.getDateTimeMillis(AssembledChronology.java:120)
	at org.joda.time.LocalDate.<init>(LocalDate.java:420)
	at org.joda.time.TestLocalDate_Constructors.testConstructor_nullObject_nullChronology(TestLocalDate_Constructors.java:512)

testConstructor_Object1(org.joda.time.TestLocalDate_Constructors)  Time elapsed: 0.001 sec  <<< ERROR!
org.joda.time.IllegalFieldValueException: Value 0 for monthOfYear must be in the range [1,12]
	at org.joda.time.field.FieldUtils.verifyValueBounds(FieldUtils.java:252)
	at org.joda.time.chrono.BasicChronology.getDateMidnightMillis(BasicChronology.java:612)
	at org.joda.time.chrono.BasicChronology.getDateTimeMillis(BasicChronology.java:159)
	at org.joda.time.chrono.GregorianChronology.getDateTimeMillis(GregorianChronology.java:44)
	at org.joda.time.chrono.AssembledChronology.getDateTimeMillis(AssembledChronology.java:120)
	at org.joda.time.LocalDate.<init>(LocalDate.java:420)
	at org.joda.time.LocalDate.<init>(LocalDate.java:363)
	at org.joda.time.TestLocalDate_Constructors.testConstructor_Object1(TestLocalDate_Constructors.java:317)

testConstructor_ObjectString1(org.joda.time.TestLocalDate_Constructors)  Time elapsed: 0.001 sec  <<< ERROR!
org.joda.time.IllegalFieldValueException: Value 0 for monthOfYear must be in the range [1,12]
	at org.joda.time.field.FieldUtils.verifyValueBounds(FieldUtils.java:252)
	at org.joda.time.chrono.BasicChronology.getDateMidnightMillis(BasicChronology.java:612)
	at org.joda.time.chrono.BasicChronology.getDateTimeMillis(BasicChronology.java:159)
	at org.joda.time.chrono.GregorianChronology.getDateTimeMillis(GregorianChronology.java:44)
	at org.joda.time.chrono.AssembledChronology.getDateTimeMillis(AssembledChronology.java:120)
	at org.joda.time.LocalDate.<init>(LocalDate.java:420)
	at org.joda.time.LocalDate.<init>(LocalDate.java:363)
	at org.joda.time.TestLocalDate_Constructors.testConstructor_ObjectString1(TestLocalDate_Constructors.java:333)

testConstructor_nullObject(org.joda.time.TestLocalTime_Constructors)  Time elapsed: 0.001 sec  <<< FAILURE!
junit.framework.AssertionFailedError: expected:<11> but was:<0>
	at junit.framework.Assert.fail(Assert.java:47)
	at junit.framework.Assert.failNotEquals(Assert.java:280)
	at junit.framework.Assert.assertEquals(Assert.java:64)
	at junit.framework.Assert.assertEquals(Assert.java:198)
	at junit.framework.Assert.assertEquals(Assert.java:204)
	at org.joda.time.TestLocalTime_Constructors.testConstructor_nullObject(TestLocalTime_Constructors.java:356)

testConstructor_ObjectString2(org.joda.time.TestLocalTime_Constructors)  Time elapsed: 0.002 sec  <<< FAILURE!
junit.framework.AssertionFailedError: expected:<10> but was:<0>
	at junit.framework.Assert.fail(Assert.java:47)
	at junit.framework.Assert.failNotEquals(Assert.java:280)
	at junit.framework.Assert.assertEquals(Assert.java:64)
	at junit.framework.Assert.assertEquals(Assert.java:198)
	at junit.framework.Assert.assertEquals(Assert.java:204)
	at org.joda.time.TestLocalTime_Constructors.testConstructor_ObjectString2(TestLocalTime_Constructors.java:394)

testConstructor_ObjectString3(org.joda.time.TestLocalTime_Constructors)  Time elapsed: 0 sec  <<< FAILURE!
junit.framework.AssertionFailedError: expected:<10> but was:<0>
	at junit.framework.Assert.fail(Assert.java:47)
	at junit.framework.Assert.failNotEquals(Assert.java:280)
	at junit.framework.Assert.assertEquals(Assert.java:64)
	at junit.framework.Assert.assertEquals(Assert.java:198)
	at junit.framework.Assert.assertEquals(Assert.java:204)
	at org.joda.time.TestLocalTime_Constructors.testConstructor_ObjectString3(TestLocalTime_Constructors.java:403)

testConstructor_ObjectString4(org.joda.time.TestLocalTime_Constructors)  Time elapsed: 0.001 sec  <<< FAILURE!
junit.framework.AssertionFailedError: expected:<10> but was:<0>
	at junit.framework.Assert.fail(Assert.java:47)
	at junit.framework.Assert.failNotEquals(Assert.java:280)
	at junit.framework.Assert.assertEquals(Assert.java:64)
	at junit.framework.Assert.assertEquals(Assert.java:198)
	at junit.framework.Assert.assertEquals(Assert.java:204)
	at org.joda.time.TestLocalTime_Constructors.testConstructor_ObjectString4(TestLocalTime_Constructors.java:412)

testConstructor_nullObject_DateTimeZone(org.joda.time.TestLocalTime_Constructors)  Time elapsed: 0.001 sec  <<< FAILURE!
junit.framework.AssertionFailedError: expected:<11> but was:<0>
	at junit.framework.Assert.fail(Assert.java:47)
	at junit.framework.Assert.failNotEquals(Assert.java:280)
	at junit.framework.Assert.assertEquals(Assert.java:64)
	at junit.framework.Assert.assertEquals(Assert.java:198)
	at junit.framework.Assert.assertEquals(Assert.java:204)
	at org.joda.time.TestLocalTime_Constructors.testConstructor_nullObject_DateTimeZone(TestLocalTime_Constructors.java:533)

testConstructor_Object_nullDateTimeZone(org.joda.time.TestLocalTime_Constructors)  Time elapsed: 0.002 sec  <<< FAILURE!
junit.framework.AssertionFailedError: expected:<2> but was:<0>
	at junit.framework.Assert.fail(Assert.java:47)
	at junit.framework.Assert.failNotEquals(Assert.java:280)
	at junit.framework.Assert.assertEquals(Assert.java:64)
	at junit.framework.Assert.assertEquals(Assert.java:198)
	at junit.framework.Assert.assertEquals(Assert.java:204)
	at org.joda.time.TestLocalTime_Constructors.testConstructor_Object_nullDateTimeZone(TestLocalTime_Constructors.java:543)

testConstructor_nullObject_nullDateTimeZone(org.joda.time.TestLocalTime_Constructors)  Time elapsed: 0.001 sec  <<< FAILURE!
junit.framework.AssertionFailedError: expected:<11> but was:<0>
	at junit.framework.Assert.fail(Assert.java:47)
	at junit.framework.Assert.failNotEquals(Assert.java:280)
	at junit.framework.Assert.assertEquals(Assert.java:64)
	at junit.framework.Assert.assertEquals(Assert.java:198)
	at junit.framework.Assert.assertEquals(Assert.java:204)
	at org.joda.time.TestLocalTime_Constructors.testConstructor_nullObject_nullDateTimeZone(TestLocalTime_Constructors.java:552)

testConstructor_nullObject_Chronology(org.joda.time.TestLocalTime_Constructors)  Time elapsed: 0.001 sec  <<< FAILURE!
junit.framework.AssertionFailedError: expected:<11> but was:<0>
	at junit.framework.Assert.fail(Assert.java:47)
	at junit.framework.Assert.failNotEquals(Assert.java:280)
	at junit.framework.Assert.assertEquals(Assert.java:64)
	at junit.framework.Assert.assertEquals(Assert.java:198)
	at junit.framework.Assert.assertEquals(Assert.java:204)
	at org.joda.time.TestLocalTime_Constructors.testConstructor_nullObject_Chronology(TestLocalTime_Constructors.java:585)

testConstructor_Object_nullChronology(org.joda.time.TestLocalTime_Constructors)  Time elapsed: 0.002 sec  <<< FAILURE!
junit.framework.AssertionFailedError: expected:<2> but was:<0>
	at junit.framework.Assert.fail(Assert.java:47)
	at junit.framework.Assert.failNotEquals(Assert.java:280)
	at junit.framework.Assert.assertEquals(Assert.java:64)
	at junit.framework.Assert.assertEquals(Assert.java:198)
	at junit.framework.Assert.assertEquals(Assert.java:204)
	at org.joda.time.TestLocalTime_Constructors.testConstructor_Object_nullChronology(TestLocalTime_Constructors.java:595)

testConstructor_nullObject_nullChronology(org.joda.time.TestLocalTime_Constructors)  Time elapsed: 0.001 sec  <<< FAILURE!
junit.framework.AssertionFailedError: expected:<11> but was:<0>
	at junit.framework.Assert.fail(Assert.java:47)
	at junit.framework.Assert.failNotEquals(Assert.java:280)
	at junit.framework.Assert.assertEquals(Assert.java:64)
	at junit.framework.Assert.assertEquals(Assert.java:198)
	at junit.framework.Assert.assertEquals(Assert.java:204)
	at org.joda.time.TestLocalTime_Constructors.testConstructor_nullObject_nullChronology(TestLocalTime_Constructors.java:604)

testConstructor_Object1(org.joda.time.TestLocalTime_Constructors)  Time elapsed: 0.002 sec  <<< FAILURE!
junit.framework.AssertionFailedError: expected:<2> but was:<0>
	at junit.framework.Assert.fail(Assert.java:47)
	at junit.framework.Assert.failNotEquals(Assert.java:280)
	at junit.framework.Assert.assertEquals(Assert.java:64)
	at junit.framework.Assert.assertEquals(Assert.java:198)
	at junit.framework.Assert.assertEquals(Assert.java:204)
	at org.joda.time.TestLocalTime_Constructors.testConstructor_Object1(TestLocalTime_Constructors.java:336)

testConstructor_Object2(org.joda.time.TestLocalTime_Constructors)  Time elapsed: 0.001 sec  <<< FAILURE!
junit.framework.AssertionFailedError: expected:<2> but was:<0>
	at junit.framework.Assert.fail(Assert.java:47)
	at junit.framework.Assert.failNotEquals(Assert.java:280)
	at junit.framework.Assert.assertEquals(Assert.java:64)
	at junit.framework.Assert.assertEquals(Assert.java:198)
	at junit.framework.Assert.assertEquals(Assert.java:204)
	at org.joda.time.TestLocalTime_Constructors.testConstructor_Object2(TestLocalTime_Constructors.java:347)

testConstructor_ObjectString1(org.joda.time.TestLocalTime_Constructors)  Time elapsed: 0.002 sec  <<< FAILURE!
junit.framework.AssertionFailedError: expected:<10> but was:<0>
	at junit.framework.Assert.fail(Assert.java:47)
	at junit.framework.Assert.failNotEquals(Assert.java:280)
	at junit.framework.Assert.assertEquals(Assert.java:64)
	at junit.framework.Assert.assertEquals(Assert.java:198)
	at junit.framework.Assert.assertEquals(Assert.java:204)
	at org.joda.time.TestLocalTime_Constructors.testConstructor_ObjectString1(TestLocalTime_Constructors.java:365)

testConstructor_ObjectString1Tokyo(org.joda.time.TestLocalTime_Constructors)  Time elapsed: 0.002 sec  <<< FAILURE!
junit.framework.AssertionFailedError: expected:<10> but was:<0>
	at junit.framework.Assert.fail(Assert.java:47)
	at junit.framework.Assert.failNotEquals(Assert.java:280)
	at junit.framework.Assert.assertEquals(Assert.java:64)
	at junit.framework.Assert.assertEquals(Assert.java:198)
	at junit.framework.Assert.assertEquals(Assert.java:204)
	at org.joda.time.TestLocalTime_Constructors.testConstructor_ObjectString1Tokyo(TestLocalTime_Constructors.java:375)

testConstructor_ObjectString1NewYork(org.joda.time.TestLocalTime_Constructors)  Time elapsed: 0.001 sec  <<< FAILURE!
junit.framework.AssertionFailedError: expected:<10> but was:<0>
	at junit.framework.Assert.fail(Assert.java:47)
	at junit.framework.Assert.failNotEquals(Assert.java:280)
	at junit.framework.Assert.assertEquals(Assert.java:64)
	at junit.framework.Assert.assertEquals(Assert.java:198)
	at junit.framework.Assert.assertEquals(Assert.java:204)
	at org.joda.time.TestLocalTime_Constructors.testConstructor_ObjectString1NewYork(TestLocalTime_Constructors.java:385)

testConstructor_Object1_DateTimeZone(org.joda.time.TestLocalTime_Constructors)  Time elapsed: 0.001 sec  <<< FAILURE!
junit.framework.AssertionFailedError: expected:<2> but was:<0>
	at junit.framework.Assert.fail(Assert.java:47)
	at junit.framework.Assert.failNotEquals(Assert.java:280)
	at junit.framework.Assert.assertEquals(Assert.java:64)
	at junit.framework.Assert.assertEquals(Assert.java:198)
	at junit.framework.Assert.assertEquals(Assert.java:204)
	at org.joda.time.TestLocalTime_Constructors.testConstructor_Object1_DateTimeZone(TestLocalTime_Constructors.java:504)

testConstructor_ObjectString_DateTimeZoneLondon(org.joda.time.TestLocalTime_Constructors)  Time elapsed: 0.002 sec  <<< FAILURE!
junit.framework.AssertionFailedError: expected:<4> but was:<0>
	at junit.framework.Assert.fail(Assert.java:47)
	at junit.framework.Assert.failNotEquals(Assert.java:280)
	at junit.framework.Assert.assertEquals(Assert.java:64)
	at junit.framework.Assert.assertEquals(Assert.java:198)
	at junit.framework.Assert.assertEquals(Assert.java:204)
	at org.joda.time.TestLocalTime_Constructors.testConstructor_ObjectString_DateTimeZoneLondon(TestLocalTime_Constructors.java:512)

testConstructor_ObjectString_DateTimeZoneTokyo(org.joda.time.TestLocalTime_Constructors)  Time elapsed: 0.001 sec  <<< FAILURE!
junit.framework.AssertionFailedError: expected:<4> but was:<0>
	at junit.framework.Assert.fail(Assert.java:47)
	at junit.framework.Assert.failNotEquals(Assert.java:280)
	at junit.framework.Assert.assertEquals(Assert.java:64)
	at junit.framework.Assert.assertEquals(Assert.java:198)
	at junit.framework.Assert.assertEquals(Assert.java:204)
	at org.joda.time.TestLocalTime_Constructors.testConstructor_ObjectString_DateTimeZoneTokyo(TestLocalTime_Constructors.java:519)

testConstructor_ObjectString_DateTimeZoneNewYork(org.joda.time.TestLocalTime_Constructors)  Time elapsed: 0.002 sec  <<< FAILURE!
junit.framework.AssertionFailedError: expected:<4> but was:<0>
	at junit.framework.Assert.fail(Assert.java:47)
	at junit.framework.Assert.failNotEquals(Assert.java:280)
	at junit.framework.Assert.assertEquals(Assert.java:64)
	at junit.framework.Assert.assertEquals(Assert.java:198)
	at junit.framework.Assert.assertEquals(Assert.java:204)
	at org.joda.time.TestLocalTime_Constructors.testConstructor_ObjectString_DateTimeZoneNewYork(TestLocalTime_Constructors.java:526)

testConstructor_Object1_Chronology(org.joda.time.TestLocalTime_Constructors)  Time elapsed: 0.001 sec  <<< FAILURE!
junit.framework.AssertionFailedError: expected:<2> but was:<0>
	at junit.framework.Assert.fail(Assert.java:47)
	at junit.framework.Assert.failNotEquals(Assert.java:280)
	at junit.framework.Assert.assertEquals(Assert.java:64)
	at junit.framework.Assert.assertEquals(Assert.java:198)
	at junit.framework.Assert.assertEquals(Assert.java:204)
	at org.joda.time.TestLocalTime_Constructors.testConstructor_Object1_Chronology(TestLocalTime_Constructors.java:563)

testConstructor_Object2_Chronology(org.joda.time.TestLocalTime_Constructors)  Time elapsed: 0.002 sec  <<< FAILURE!
junit.framework.AssertionFailedError: expected:<10> but was:<0>
	at junit.framework.Assert.fail(Assert.java:47)
	at junit.framework.Assert.failNotEquals(Assert.java:280)
	at junit.framework.Assert.assertEquals(Assert.java:64)
	at junit.framework.Assert.assertEquals(Assert.java:198)
	at junit.framework.Assert.assertEquals(Assert.java:204)
	at org.joda.time.TestLocalTime_Constructors.testConstructor_Object2_Chronology(TestLocalTime_Constructors.java:571)

testGet(org.joda.time.TestTimeOfDay_Basics)  Time elapsed: 0 sec  <<< FAILURE!
junit.framework.AssertionFailedError: expected:<11> but was:<0>
	at junit.framework.Assert.fail(Assert.java:47)
	at junit.framework.Assert.failNotEquals(Assert.java:280)
	at junit.framework.Assert.assertEquals(Assert.java:64)
	at junit.framework.Assert.assertEquals(Assert.java:198)
	at junit.framework.Assert.assertEquals(Assert.java:204)
	at org.joda.time.TestTimeOfDay_Basics.testGet(TestTimeOfDay_Basics.java:97)

testConstructor(org.joda.time.TestTimeOfDay_Constructors)  Time elapsed: 0 sec  <<< FAILURE!
junit.framework.AssertionFailedError: expected:<11> but was:<0>
	at junit.framework.Assert.fail(Assert.java:47)
	at junit.framework.Assert.failNotEquals(Assert.java:280)
	at junit.framework.Assert.assertEquals(Assert.java:64)
	at junit.framework.Assert.assertEquals(Assert.java:198)
	at junit.framework.Assert.assertEquals(Assert.java:204)
	at org.joda.time.TestTimeOfDay_Constructors.testConstructor(TestTimeOfDay_Constructors.java:181)

testConstructor_long1(org.joda.time.TestTimeOfDay_Constructors)  Time elapsed: 0.001 sec  <<< FAILURE!
junit.framework.AssertionFailedError: expected:<2> but was:<0>
	at junit.framework.Assert.fail(Assert.java:47)
	at junit.framework.Assert.failNotEquals(Assert.java:280)
	at junit.framework.Assert.assertEquals(Assert.java:64)
	at junit.framework.Assert.assertEquals(Assert.java:198)
	at junit.framework.Assert.assertEquals(Assert.java:204)
	at org.joda.time.TestTimeOfDay_Constructors.testConstructor_long1(TestTimeOfDay_Constructors.java:257)

testConstructor_long2(org.joda.time.TestTimeOfDay_Constructors)  Time elapsed: 0 sec  <<< FAILURE!
junit.framework.AssertionFailedError: expected:<6> but was:<0>
	at junit.framework.Assert.fail(Assert.java:47)
	at junit.framework.Assert.failNotEquals(Assert.java:280)
	at junit.framework.Assert.assertEquals(Assert.java:64)
	at junit.framework.Assert.assertEquals(Assert.java:198)
	at junit.framework.Assert.assertEquals(Assert.java:204)
	at org.joda.time.TestTimeOfDay_Constructors.testConstructor_long2(TestTimeOfDay_Constructors.java:269)

testConstructor_nullObject(org.joda.time.TestTimeOfDay_Constructors)  Time elapsed: 0.001 sec  <<< FAILURE!
junit.framework.AssertionFailedError: expected:<11> but was:<0>
	at junit.framework.Assert.fail(Assert.java:47)
	at junit.framework.Assert.failNotEquals(Assert.java:280)
	at junit.framework.Assert.assertEquals(Assert.java:64)
	at junit.framework.Assert.assertEquals(Assert.java:198)
	at junit.framework.Assert.assertEquals(Assert.java:204)
	at org.joda.time.TestTimeOfDay_Constructors.testConstructor_nullObject(TestTimeOfDay_Constructors.java:345)

testConstructor_ObjectString2(org.joda.time.TestTimeOfDay_Constructors)  Time elapsed: 0 sec  <<< FAILURE!
junit.framework.AssertionFailedError: expected:<7> but was:<0>
	at junit.framework.Assert.fail(Assert.java:47)
	at junit.framework.Assert.failNotEquals(Assert.java:280)
	at junit.framework.Assert.assertEquals(Assert.java:64)
	at junit.framework.Assert.assertEquals(Assert.java:198)
	at junit.framework.Assert.assertEquals(Assert.java:204)
	at org.joda.time.TestTimeOfDay_Constructors.testConstructor_ObjectString2(TestTimeOfDay_Constructors.java:376)

testConstructor_ObjectString3(org.joda.time.TestTimeOfDay_Constructors)  Time elapsed: 0 sec  <<< FAILURE!
junit.framework.AssertionFailedError: expected:<10> but was:<0>
	at junit.framework.Assert.fail(Assert.java:47)
	at junit.framework.Assert.failNotEquals(Assert.java:280)
	at junit.framework.Assert.assertEquals(Assert.java:64)
	at junit.framework.Assert.assertEquals(Assert.java:198)
	at junit.framework.Assert.assertEquals(Assert.java:204)
	at org.joda.time.TestTimeOfDay_Constructors.testConstructor_ObjectString3(TestTimeOfDay_Constructors.java:385)

testConstructor_ObjectString4(org.joda.time.TestTimeOfDay_Constructors)  Time elapsed: 0.001 sec  <<< FAILURE!
junit.framework.AssertionFailedError: expected:<7> but was:<0>
	at junit.framework.Assert.fail(Assert.java:47)
	at junit.framework.Assert.failNotEquals(Assert.java:280)
	at junit.framework.Assert.assertEquals(Assert.java:64)
	at junit.framework.Assert.assertEquals(Assert.java:198)
	at junit.framework.Assert.assertEquals(Assert.java:204)
	at org.joda.time.TestTimeOfDay_Constructors.testConstructor_ObjectString4(TestTimeOfDay_Constructors.java:394)

testConstructor_ObjectString5(org.joda.time.TestTimeOfDay_Constructors)  Time elapsed: 0 sec  <<< FAILURE!
junit.framework.AssertionFailedError: expected:<10> but was:<0>
	at junit.framework.Assert.fail(Assert.java:47)
	at junit.framework.Assert.failNotEquals(Assert.java:280)
	at junit.framework.Assert.assertEquals(Assert.java:64)
	at junit.framework.Assert.assertEquals(Assert.java:198)
	at junit.framework.Assert.assertEquals(Assert.java:204)
	at org.joda.time.TestTimeOfDay_Constructors.testConstructor_ObjectString5(TestTimeOfDay_Constructors.java:403)

testConstructor_ObjectString6(org.joda.time.TestTimeOfDay_Constructors)  Time elapsed: 0.001 sec  <<< FAILURE!
junit.framework.AssertionFailedError: expected:<10> but was:<0>
	at junit.framework.Assert.fail(Assert.java:47)
	at junit.framework.Assert.failNotEquals(Assert.java:280)
	at junit.framework.Assert.assertEquals(Assert.java:64)
	at junit.framework.Assert.assertEquals(Assert.java:198)
	at junit.framework.Assert.assertEquals(Assert.java:204)
	at org.joda.time.TestTimeOfDay_Constructors.testConstructor_ObjectString6(TestTimeOfDay_Constructors.java:412)

testConstructor_Object_Chronology(org.joda.time.TestTimeOfDay_Constructors)  Time elapsed: 0.001 sec  <<< FAILURE!
junit.framework.AssertionFailedError: expected:<2> but was:<0>
	at junit.framework.Assert.fail(Assert.java:47)
	at junit.framework.Assert.failNotEquals(Assert.java:280)
	at junit.framework.Assert.assertEquals(Assert.java:64)
	at junit.framework.Assert.assertEquals(Assert.java:198)
	at junit.framework.Assert.assertEquals(Assert.java:204)
	at org.joda.time.TestTimeOfDay_Constructors.testConstructor_Object_Chronology(TestTimeOfDay_Constructors.java:454)

testConstructor_nullObject_Chronology(org.joda.time.TestTimeOfDay_Constructors)  Time elapsed: 0 sec  <<< FAILURE!
junit.framework.AssertionFailedError: expected:<11> but was:<0>
	at junit.framework.Assert.fail(Assert.java:47)
	at junit.framework.Assert.failNotEquals(Assert.java:280)
	at junit.framework.Assert.assertEquals(Assert.java:64)
	at junit.framework.Assert.assertEquals(Assert.java:198)
	at junit.framework.Assert.assertEquals(Assert.java:204)
	at org.joda.time.TestTimeOfDay_Constructors.testConstructor_nullObject_Chronology(TestTimeOfDay_Constructors.java:482)

testConstructor_Object_nullChronology(org.joda.time.TestTimeOfDay_Constructors)  Time elapsed: 0.001 sec  <<< FAILURE!
junit.framework.AssertionFailedError: expected:<2> but was:<0>
	at junit.framework.Assert.fail(Assert.java:47)
	at junit.framework.Assert.failNotEquals(Assert.java:280)
	at junit.framework.Assert.assertEquals(Assert.java:64)
	at junit.framework.Assert.assertEquals(Assert.java:198)
	at junit.framework.Assert.assertEquals(Assert.java:204)
	at org.joda.time.TestTimeOfDay_Constructors.testConstructor_Object_nullChronology(TestTimeOfDay_Constructors.java:495)

testConstructor_nullObject_nullChronology(org.joda.time.TestTimeOfDay_Constructors)  Time elapsed: 0 sec  <<< FAILURE!
junit.framework.AssertionFailedError: expected:<11> but was:<0>
	at junit.framework.Assert.fail(Assert.java:47)
	at junit.framework.Assert.failNotEquals(Assert.java:280)
	at junit.framework.Assert.assertEquals(Assert.java:64)
	at junit.framework.Assert.assertEquals(Assert.java:198)
	at junit.framework.Assert.assertEquals(Assert.java:204)
	at org.joda.time.TestTimeOfDay_Constructors.testConstructor_nullObject_nullChronology(TestTimeOfDay_Constructors.java:507)

testConstructor_DateTimeZone(org.joda.time.TestTimeOfDay_Constructors)  Time elapsed: 0.001 sec  <<< FAILURE!
junit.framework.AssertionFailedError: expected:<23> but was:<0>
	at junit.framework.Assert.fail(Assert.java:47)
	at junit.framework.Assert.failNotEquals(Assert.java:280)
	at junit.framework.Assert.assertEquals(Assert.java:64)
	at junit.framework.Assert.assertEquals(Assert.java:198)
	at junit.framework.Assert.assertEquals(Assert.java:204)
	at org.joda.time.TestTimeOfDay_Constructors.testConstructor_DateTimeZone(TestTimeOfDay_Constructors.java:197)

testConstructor_Object1(org.joda.time.TestTimeOfDay_Constructors)  Time elapsed: 0.001 sec  <<< FAILURE!
junit.framework.AssertionFailedError: expected:<2> but was:<0>
	at junit.framework.Assert.fail(Assert.java:47)
	at junit.framework.Assert.failNotEquals(Assert.java:280)
	at junit.framework.Assert.assertEquals(Assert.java:64)
	at junit.framework.Assert.assertEquals(Assert.java:198)
	at junit.framework.Assert.assertEquals(Assert.java:204)
	at org.joda.time.TestTimeOfDay_Constructors.testConstructor_Object1(TestTimeOfDay_Constructors.java:319)

testConstructor_Object2(org.joda.time.TestTimeOfDay_Constructors)  Time elapsed: 0 sec  <<< FAILURE!
junit.framework.AssertionFailedError: expected:<2> but was:<0>
	at junit.framework.Assert.fail(Assert.java:47)
	at junit.framework.Assert.failNotEquals(Assert.java:280)
	at junit.framework.Assert.assertEquals(Assert.java:64)
	at junit.framework.Assert.assertEquals(Assert.java:198)
	at junit.framework.Assert.assertEquals(Assert.java:204)
	at org.joda.time.TestTimeOfDay_Constructors.testConstructor_Object2(TestTimeOfDay_Constructors.java:333)

testConstructor_nullDateTimeZone(org.joda.time.TestTimeOfDay_Constructors)  Time elapsed: 0.001 sec  <<< FAILURE!
junit.framework.AssertionFailedError: expected:<23> but was:<0>
	at junit.framework.Assert.fail(Assert.java:47)
	at junit.framework.Assert.failNotEquals(Assert.java:280)
	at junit.framework.Assert.assertEquals(Assert.java:64)
	at junit.framework.Assert.assertEquals(Assert.java:198)
	at junit.framework.Assert.assertEquals(Assert.java:204)
	at org.joda.time.TestTimeOfDay_Constructors.testConstructor_nullDateTimeZone(TestTimeOfDay_Constructors.java:220)

testConstructor_Chronology(org.joda.time.TestTimeOfDay_Constructors)  Time elapsed: 0 sec  <<< FAILURE!
junit.framework.AssertionFailedError: expected:<11> but was:<0>
	at junit.framework.Assert.fail(Assert.java:47)
	at junit.framework.Assert.failNotEquals(Assert.java:280)
	at junit.framework.Assert.assertEquals(Assert.java:64)
	at junit.framework.Assert.assertEquals(Assert.java:198)
	at junit.framework.Assert.assertEquals(Assert.java:204)
	at org.joda.time.TestTimeOfDay_Constructors.testConstructor_Chronology(TestTimeOfDay_Constructors.java:232)

testConstructor_nullChronology(org.joda.time.TestTimeOfDay_Constructors)  Time elapsed: 0.001 sec  <<< FAILURE!
junit.framework.AssertionFailedError: expected:<11> but was:<0>
	at junit.framework.Assert.fail(Assert.java:47)
	at junit.framework.Assert.failNotEquals(Assert.java:280)
	at junit.framework.Assert.assertEquals(Assert.java:64)
	at junit.framework.Assert.assertEquals(Assert.java:198)
	at junit.framework.Assert.assertEquals(Assert.java:204)
	at org.joda.time.TestTimeOfDay_Constructors.testConstructor_nullChronology(TestTimeOfDay_Constructors.java:244)

testConstructor_long1_Chronology(org.joda.time.TestTimeOfDay_Constructors)  Time elapsed: 0 sec  <<< FAILURE!
junit.framework.AssertionFailedError: expected:<2> but was:<0>
	at junit.framework.Assert.fail(Assert.java:47)
	at junit.framework.Assert.failNotEquals(Assert.java:280)
	at junit.framework.Assert.assertEquals(Assert.java:64)
	at junit.framework.Assert.assertEquals(Assert.java:198)
	at junit.framework.Assert.assertEquals(Assert.java:204)
	at org.joda.time.TestTimeOfDay_Constructors.testConstructor_long1_Chronology(TestTimeOfDay_Constructors.java:281)

testConstructor_long2_Chronology(org.joda.time.TestTimeOfDay_Constructors)  Time elapsed: 0.001 sec  <<< FAILURE!
junit.framework.AssertionFailedError: expected:<6> but was:<0>
	at junit.framework.Assert.fail(Assert.java:47)
	at junit.framework.Assert.failNotEquals(Assert.java:280)
	at junit.framework.Assert.assertEquals(Assert.java:64)
	at junit.framework.Assert.assertEquals(Assert.java:198)
	at junit.framework.Assert.assertEquals(Assert.java:204)
	at org.joda.time.TestTimeOfDay_Constructors.testConstructor_long2_Chronology(TestTimeOfDay_Constructors.java:293)

testConstructor_long_nullChronology(org.joda.time.TestTimeOfDay_Constructors)  Time elapsed: 0 sec  <<< FAILURE!
junit.framework.AssertionFailedError: expected:<2> but was:<0>
	at junit.framework.Assert.fail(Assert.java:47)
	at junit.framework.Assert.failNotEquals(Assert.java:280)
	at junit.framework.Assert.assertEquals(Assert.java:64)
	at junit.framework.Assert.assertEquals(Assert.java:198)
	at junit.framework.Assert.assertEquals(Assert.java:204)
	at org.joda.time.TestTimeOfDay_Constructors.testConstructor_long_nullChronology(TestTimeOfDay_Constructors.java:305)

testConstructor_ObjectString1(org.joda.time.TestTimeOfDay_Constructors)  Time elapsed: 0.001 sec  <<< FAILURE!
junit.framework.AssertionFailedError: expected:<10> but was:<0>
	at junit.framework.Assert.fail(Assert.java:47)
	at junit.framework.Assert.failNotEquals(Assert.java:280)
	at junit.framework.Assert.assertEquals(Assert.java:64)
	at junit.framework.Assert.assertEquals(Assert.java:198)
	at junit.framework.Assert.assertEquals(Assert.java:204)
	at org.joda.time.TestTimeOfDay_Constructors.testConstructor_ObjectString1(TestTimeOfDay_Constructors.java:367)

testFactoryMillisOfDay_long1(org.joda.time.TestTimeOfDay_Constructors)  Time elapsed: 0.001 sec  <<< FAILURE!
junit.framework.AssertionFailedError: expected:<1> but was:<0>
	at junit.framework.Assert.fail(Assert.java:47)
	at junit.framework.Assert.failNotEquals(Assert.java:280)
	at junit.framework.Assert.assertEquals(Assert.java:64)
	at junit.framework.Assert.assertEquals(Assert.java:198)
	at junit.framework.Assert.assertEquals(Assert.java:204)
	at org.joda.time.TestTimeOfDay_Constructors.testFactoryMillisOfDay_long1(TestTimeOfDay_Constructors.java:144)

testFactoryMillisOfDay_long1_Chronology(org.joda.time.TestTimeOfDay_Constructors)  Time elapsed: 0 sec  <<< FAILURE!
junit.framework.AssertionFailedError: expected:<1> but was:<0>
	at junit.framework.Assert.fail(Assert.java:47)
	at junit.framework.Assert.failNotEquals(Assert.java:280)
	at junit.framework.Assert.assertEquals(Assert.java:64)
	at junit.framework.Assert.assertEquals(Assert.java:198)
	at junit.framework.Assert.assertEquals(Assert.java:204)
	at org.joda.time.TestTimeOfDay_Constructors.testFactoryMillisOfDay_long1_Chronology(TestTimeOfDay_Constructors.java:156)

testConstructor2_Object_Chronology(org.joda.time.TestTimeOfDay_Constructors)  Time elapsed: 0.001 sec  <<< FAILURE!
junit.framework.AssertionFailedError: expected:<10> but was:<0>
	at junit.framework.Assert.fail(Assert.java:47)
	at junit.framework.Assert.failNotEquals(Assert.java:280)
	at junit.framework.Assert.assertEquals(Assert.java:64)
	at junit.framework.Assert.assertEquals(Assert.java:198)
	at junit.framework.Assert.assertEquals(Assert.java:204)
	at org.joda.time.TestTimeOfDay_Constructors.testConstructor2_Object_Chronology(TestTimeOfDay_Constructors.java:465)

testFactoryMillisOfDay_long_nullChronology(org.joda.time.TestTimeOfDay_Constructors)  Time elapsed: 0.001 sec  <<< FAILURE!
junit.framework.AssertionFailedError: expected:<1> but was:<0>
	at junit.framework.Assert.fail(Assert.java:47)
	at junit.framework.Assert.failNotEquals(Assert.java:280)
	at junit.framework.Assert.assertEquals(Assert.java:64)
	at junit.framework.Assert.assertEquals(Assert.java:198)
	at junit.framework.Assert.assertEquals(Assert.java:204)
	at org.joda.time.TestTimeOfDay_Constructors.testFactoryMillisOfDay_long_nullChronology(TestTimeOfDay_Constructors.java:168)

testPropertyCompareToHour(org.joda.time.TestTimeOfDay_Properties)  Time elapsed: 0 sec  <<< FAILURE!
junit.framework.AssertionFailedError: expected:<true> but was:<false>
	at junit.framework.Assert.fail(Assert.java:47)
	at junit.framework.Assert.failNotEquals(Assert.java:280)
	at junit.framework.Assert.assertEquals(Assert.java:64)
	at junit.framework.Assert.assertEquals(Assert.java:146)
	at junit.framework.Assert.assertEquals(Assert.java:152)
	at org.joda.time.TestTimeOfDay_Properties.testPropertyCompareToHour(TestTimeOfDay_Properties.java:212)

testPropertyCompareToMinute(org.joda.time.TestTimeOfDay_Properties)  Time elapsed: 0 sec  <<< FAILURE!
junit.framework.AssertionFailedError: expected:<true> but was:<false>
	at junit.framework.Assert.fail(Assert.java:47)
	at junit.framework.Assert.failNotEquals(Assert.java:280)
	at junit.framework.Assert.assertEquals(Assert.java:64)
	at junit.framework.Assert.assertEquals(Assert.java:146)
	at junit.framework.Assert.assertEquals(Assert.java:152)
	at org.joda.time.TestTimeOfDay_Properties.testPropertyCompareToMinute(TestTimeOfDay_Properties.java:384)

testPropertyCompareToSecond(org.joda.time.TestTimeOfDay_Properties)  Time elapsed: 0 sec  <<< FAILURE!
junit.framework.AssertionFailedError: expected:<true> but was:<false>
	at junit.framework.Assert.fail(Assert.java:47)
	at junit.framework.Assert.failNotEquals(Assert.java:280)
	at junit.framework.Assert.assertEquals(Assert.java:64)
	at junit.framework.Assert.assertEquals(Assert.java:146)
	at junit.framework.Assert.assertEquals(Assert.java:152)
	at org.joda.time.TestTimeOfDay_Properties.testPropertyCompareToSecond(TestTimeOfDay_Properties.java:550)

testPropertyCompareToMilli(org.joda.time.TestTimeOfDay_Properties)  Time elapsed: 0 sec  <<< FAILURE!
junit.framework.AssertionFailedError: expected:<true> but was:<false>
	at junit.framework.Assert.fail(Assert.java:47)
	at junit.framework.Assert.failNotEquals(Assert.java:280)
	at junit.framework.Assert.assertEquals(Assert.java:64)
	at junit.framework.Assert.assertEquals(Assert.java:146)
	at junit.framework.Assert.assertEquals(Assert.java:152)
	at org.joda.time.TestTimeOfDay_Properties.testPropertyCompareToMilli(TestTimeOfDay_Properties.java:710)

testGetValues(org.joda.time.TestYearMonthDay_Basics)  Time elapsed: 0 sec  <<< FAILURE!
junit.framework.AssertionFailedError: expected:<1970> but was:<0>
	at junit.framework.Assert.fail(Assert.java:47)
	at junit.framework.Assert.failNotEquals(Assert.java:280)
	at junit.framework.Assert.assertEquals(Assert.java:64)
	at junit.framework.Assert.assertEquals(Assert.java:198)
	at junit.framework.Assert.assertEquals(Assert.java:204)
	at org.joda.time.TestYearMonthDay_Basics.testGetValues(TestYearMonthDay_Basics.java:164)

testGetValue(org.joda.time.TestYearMonthDay_Basics)  Time elapsed: 0 sec  <<< FAILURE!
junit.framework.AssertionFailedError: expected:<1970> but was:<0>
	at junit.framework.Assert.fail(Assert.java:47)
	at junit.framework.Assert.failNotEquals(Assert.java:280)
	at junit.framework.Assert.assertEquals(Assert.java:64)
	at junit.framework.Assert.assertEquals(Assert.java:198)
	at junit.framework.Assert.assertEquals(Assert.java:204)
	at org.joda.time.TestYearMonthDay_Basics.testGetValue(TestYearMonthDay_Basics.java:150)

testGet(org.joda.time.TestYearMonthDay_Basics)  Time elapsed: 0 sec  <<< FAILURE!
junit.framework.AssertionFailedError: expected:<1970> but was:<0>
	at junit.framework.Assert.fail(Assert.java:47)
	at junit.framework.Assert.failNotEquals(Assert.java:280)
	at junit.framework.Assert.assertEquals(Assert.java:64)
	at junit.framework.Assert.assertEquals(Assert.java:198)
	at junit.framework.Assert.assertEquals(Assert.java:204)
	at org.joda.time.TestYearMonthDay_Basics.testGet(TestYearMonthDay_Basics.java:86)

testConstructor(org.joda.time.TestYearMonthDay_Constructors)  Time elapsed: 0 sec  <<< FAILURE!
junit.framework.AssertionFailedError: expected:<1970> but was:<0>
	at junit.framework.Assert.fail(Assert.java:47)
	at junit.framework.Assert.failNotEquals(Assert.java:280)
	at junit.framework.Assert.assertEquals(Assert.java:64)
	at junit.framework.Assert.assertEquals(Assert.java:198)
	at junit.framework.Assert.assertEquals(Assert.java:204)
	at org.joda.time.TestYearMonthDay_Constructors.testConstructor(TestYearMonthDay_Constructors.java:112)

testConstructor_long1(org.joda.time.TestYearMonthDay_Constructors)  Time elapsed: 0 sec  <<< FAILURE!
junit.framework.AssertionFailedError: expected:<1970> but was:<0>
	at junit.framework.Assert.fail(Assert.java:47)
	at junit.framework.Assert.failNotEquals(Assert.java:280)
	at junit.framework.Assert.assertEquals(Assert.java:64)
	at junit.framework.Assert.assertEquals(Assert.java:198)
	at junit.framework.Assert.assertEquals(Assert.java:204)
	at org.joda.time.TestYearMonthDay_Constructors.testConstructor_long1(TestYearMonthDay_Constructors.java:182)

testConstructor_long2(org.joda.time.TestYearMonthDay_Constructors)  Time elapsed: 0 sec  <<< FAILURE!
junit.framework.AssertionFailedError: expected:<1971> but was:<0>
	at junit.framework.Assert.fail(Assert.java:47)
	at junit.framework.Assert.failNotEquals(Assert.java:280)
	at junit.framework.Assert.assertEquals(Assert.java:64)
	at junit.framework.Assert.assertEquals(Assert.java:198)
	at junit.framework.Assert.assertEquals(Assert.java:204)
	at org.joda.time.TestYearMonthDay_Constructors.testConstructor_long2(TestYearMonthDay_Constructors.java:193)

testConstructor_Object(org.joda.time.TestYearMonthDay_Constructors)  Time elapsed: 0 sec  <<< FAILURE!
junit.framework.AssertionFailedError: expected:<1970> but was:<0>
	at junit.framework.Assert.fail(Assert.java:47)
	at junit.framework.Assert.failNotEquals(Assert.java:280)
	at junit.framework.Assert.assertEquals(Assert.java:64)
	at junit.framework.Assert.assertEquals(Assert.java:198)
	at junit.framework.Assert.assertEquals(Assert.java:204)
	at org.joda.time.TestYearMonthDay_Constructors.testConstructor_Object(TestYearMonthDay_Constructors.java:236)

testConstructor_nullObject(org.joda.time.TestYearMonthDay_Constructors)  Time elapsed: 0.001 sec  <<< FAILURE!
junit.framework.AssertionFailedError: expected:<1970> but was:<0>
	at junit.framework.Assert.fail(Assert.java:47)
	at junit.framework.Assert.failNotEquals(Assert.java:280)
	at junit.framework.Assert.assertEquals(Assert.java:64)
	at junit.framework.Assert.assertEquals(Assert.java:198)
	at junit.framework.Assert.assertEquals(Assert.java:204)
	at org.joda.time.TestYearMonthDay_Constructors.testConstructor_nullObject(TestYearMonthDay_Constructors.java:244)

testConstructor_ObjectString2(org.joda.time.TestYearMonthDay_Constructors)  Time elapsed: 0 sec  <<< FAILURE!
junit.framework.AssertionFailedError: expected:<1972> but was:<0>
	at junit.framework.Assert.fail(Assert.java:47)
	at junit.framework.Assert.failNotEquals(Assert.java:280)
	at junit.framework.Assert.assertEquals(Assert.java:64)
	at junit.framework.Assert.assertEquals(Assert.java:198)
	at junit.framework.Assert.assertEquals(Assert.java:204)
	at org.joda.time.TestYearMonthDay_Constructors.testConstructor_ObjectString2(TestYearMonthDay_Constructors.java:260)

testConstructor_ObjectString3(org.joda.time.TestYearMonthDay_Constructors)  Time elapsed: 0.001 sec  <<< FAILURE!
junit.framework.AssertionFailedError: expected:<1972> but was:<0>
	at junit.framework.Assert.fail(Assert.java:47)
	at junit.framework.Assert.failNotEquals(Assert.java:280)
	at junit.framework.Assert.assertEquals(Assert.java:64)
	at junit.framework.Assert.assertEquals(Assert.java:198)
	at junit.framework.Assert.assertEquals(Assert.java:204)
	at org.joda.time.TestYearMonthDay_Constructors.testConstructor_ObjectString3(TestYearMonthDay_Constructors.java:268)

testConstructor_ObjectString4(org.joda.time.TestYearMonthDay_Constructors)  Time elapsed: 0 sec  <<< FAILURE!
junit.framework.AssertionFailedError: expected:<1972> but was:<0>
	at junit.framework.Assert.fail(Assert.java:47)
	at junit.framework.Assert.failNotEquals(Assert.java:280)
	at junit.framework.Assert.assertEquals(Assert.java:64)
	at junit.framework.Assert.assertEquals(Assert.java:198)
	at junit.framework.Assert.assertEquals(Assert.java:204)
	at org.joda.time.TestYearMonthDay_Constructors.testConstructor_ObjectString4(TestYearMonthDay_Constructors.java:276)

testConstructor_ObjectString5(org.joda.time.TestYearMonthDay_Constructors)  Time elapsed: 0.001 sec  <<< FAILURE!
junit.framework.AssertionFailedError: expected:<10> but was:<0>
	at junit.framework.Assert.fail(Assert.java:47)
	at junit.framework.Assert.failNotEquals(Assert.java:280)
	at junit.framework.Assert.assertEquals(Assert.java:64)
	at junit.framework.Assert.assertEquals(Assert.java:198)
	at junit.framework.Assert.assertEquals(Assert.java:204)
	at org.joda.time.TestYearMonthDay_Constructors.testConstructor_ObjectString5(TestYearMonthDay_Constructors.java:284)

testConstructor_Object_Chronology(org.joda.time.TestYearMonthDay_Constructors)  Time elapsed: 0 sec  <<< FAILURE!
junit.framework.AssertionFailedError: expected:<1970> but was:<0>
	at junit.framework.Assert.fail(Assert.java:47)
	at junit.framework.Assert.failNotEquals(Assert.java:280)
	at junit.framework.Assert.assertEquals(Assert.java:64)
	at junit.framework.Assert.assertEquals(Assert.java:198)
	at junit.framework.Assert.assertEquals(Assert.java:204)
	at org.joda.time.TestYearMonthDay_Constructors.testConstructor_Object_Chronology(TestYearMonthDay_Constructors.java:333)

testConstructor_nullObject_Chronology(org.joda.time.TestYearMonthDay_Constructors)  Time elapsed: 0.001 sec  <<< FAILURE!
junit.framework.AssertionFailedError: expected:<1970> but was:<0>
	at junit.framework.Assert.fail(Assert.java:47)
	at junit.framework.Assert.failNotEquals(Assert.java:280)
	at junit.framework.Assert.assertEquals(Assert.java:64)
	at junit.framework.Assert.assertEquals(Assert.java:198)
	at junit.framework.Assert.assertEquals(Assert.java:204)
	at org.joda.time.TestYearMonthDay_Constructors.testConstructor_nullObject_Chronology(TestYearMonthDay_Constructors.java:344)

testConstructor_Object_nullChronology(org.joda.time.TestYearMonthDay_Constructors)  Time elapsed: 0 sec  <<< FAILURE!
junit.framework.AssertionFailedError: expected:<1970> but was:<0>
	at junit.framework.Assert.fail(Assert.java:47)
	at junit.framework.Assert.failNotEquals(Assert.java:280)
	at junit.framework.Assert.assertEquals(Assert.java:64)
	at junit.framework.Assert.assertEquals(Assert.java:198)
	at junit.framework.Assert.assertEquals(Assert.java:204)
	at org.joda.time.TestYearMonthDay_Constructors.testConstructor_Object_nullChronology(TestYearMonthDay_Constructors.java:356)

testConstructor_nullObject_nullChronology(org.joda.time.TestYearMonthDay_Constructors)  Time elapsed: 0.001 sec  <<< FAILURE!
junit.framework.AssertionFailedError: expected:<1970> but was:<0>
	at junit.framework.Assert.fail(Assert.java:47)
	at junit.framework.Assert.failNotEquals(Assert.java:280)
	at junit.framework.Assert.assertEquals(Assert.java:64)
	at junit.framework.Assert.assertEquals(Assert.java:198)
	at junit.framework.Assert.assertEquals(Assert.java:204)
	at org.joda.time.TestYearMonthDay_Constructors.testConstructor_nullObject_nullChronology(TestYearMonthDay_Constructors.java:367)

testConstructor_DateTimeZone(org.joda.time.TestYearMonthDay_Constructors)  Time elapsed: 0 sec  <<< FAILURE!
junit.framework.AssertionFailedError: expected:<2005> but was:<0>
	at junit.framework.Assert.fail(Assert.java:47)
	at junit.framework.Assert.failNotEquals(Assert.java:280)
	at junit.framework.Assert.assertEquals(Assert.java:64)
	at junit.framework.Assert.assertEquals(Assert.java:198)
	at junit.framework.Assert.assertEquals(Assert.java:204)
	at org.joda.time.TestYearMonthDay_Constructors.testConstructor_DateTimeZone(TestYearMonthDay_Constructors.java:127)

testConstructor_nullDateTimeZone(org.joda.time.TestYearMonthDay_Constructors)  Time elapsed: 0 sec  <<< FAILURE!
junit.framework.AssertionFailedError: expected:<2005> but was:<0>
	at junit.framework.Assert.fail(Assert.java:47)
	at junit.framework.Assert.failNotEquals(Assert.java:280)
	at junit.framework.Assert.assertEquals(Assert.java:64)
	at junit.framework.Assert.assertEquals(Assert.java:198)
	at junit.framework.Assert.assertEquals(Assert.java:204)
	at org.joda.time.TestYearMonthDay_Constructors.testConstructor_nullDateTimeZone(TestYearMonthDay_Constructors.java:148)

testConstructor_Chronology(org.joda.time.TestYearMonthDay_Constructors)  Time elapsed: 0.001 sec  <<< FAILURE!
junit.framework.AssertionFailedError: expected:<1970> but was:<0>
	at junit.framework.Assert.fail(Assert.java:47)
	at junit.framework.Assert.failNotEquals(Assert.java:280)
	at junit.framework.Assert.assertEquals(Assert.java:64)
	at junit.framework.Assert.assertEquals(Assert.java:198)
	at junit.framework.Assert.assertEquals(Assert.java:204)
	at org.joda.time.TestYearMonthDay_Constructors.testConstructor_Chronology(TestYearMonthDay_Constructors.java:159)

testConstructor_nullChronology(org.joda.time.TestYearMonthDay_Constructors)  Time elapsed: 0.001 sec  <<< FAILURE!
junit.framework.AssertionFailedError: expected:<1970> but was:<0>
	at junit.framework.Assert.fail(Assert.java:47)
	at junit.framework.Assert.failNotEquals(Assert.java:280)
	at junit.framework.Assert.assertEquals(Assert.java:64)
	at junit.framework.Assert.assertEquals(Assert.java:198)
	at junit.framework.Assert.assertEquals(Assert.java:204)
	at org.joda.time.TestYearMonthDay_Constructors.testConstructor_nullChronology(TestYearMonthDay_Constructors.java:170)

testConstructor_long1_Chronology(org.joda.time.TestYearMonthDay_Constructors)  Time elapsed: 0 sec  <<< FAILURE!
junit.framework.AssertionFailedError: expected:<1970> but was:<0>
	at junit.framework.Assert.fail(Assert.java:47)
	at junit.framework.Assert.failNotEquals(Assert.java:280)
	at junit.framework.Assert.assertEquals(Assert.java:64)
	at junit.framework.Assert.assertEquals(Assert.java:198)
	at junit.framework.Assert.assertEquals(Assert.java:204)
	at org.joda.time.TestYearMonthDay_Constructors.testConstructor_long1_Chronology(TestYearMonthDay_Constructors.java:204)

testConstructor_long2_Chronology(org.joda.time.TestYearMonthDay_Constructors)  Time elapsed: 0 sec  <<< FAILURE!
junit.framework.AssertionFailedError: expected:<1971> but was:<0>
	at junit.framework.Assert.fail(Assert.java:47)
	at junit.framework.Assert.failNotEquals(Assert.java:280)
	at junit.framework.Assert.assertEquals(Assert.java:64)
	at junit.framework.Assert.assertEquals(Assert.java:198)
	at junit.framework.Assert.assertEquals(Assert.java:204)
	at org.joda.time.TestYearMonthDay_Constructors.testConstructor_long2_Chronology(TestYearMonthDay_Constructors.java:215)

testConstructor_long_nullChronology(org.joda.time.TestYearMonthDay_Constructors)  Time elapsed: 0 sec  <<< FAILURE!
junit.framework.AssertionFailedError: expected:<1970> but was:<0>
	at junit.framework.Assert.fail(Assert.java:47)
	at junit.framework.Assert.failNotEquals(Assert.java:280)
	at junit.framework.Assert.assertEquals(Assert.java:64)
	at junit.framework.Assert.assertEquals(Assert.java:198)
	at junit.framework.Assert.assertEquals(Assert.java:204)
	at org.joda.time.TestYearMonthDay_Constructors.testConstructor_long_nullChronology(TestYearMonthDay_Constructors.java:226)

testConstructor_ObjectString1(org.joda.time.TestYearMonthDay_Constructors)  Time elapsed: 0.001 sec  <<< FAILURE!
junit.framework.AssertionFailedError: expected:<1972> but was:<0>
	at junit.framework.Assert.fail(Assert.java:47)
	at junit.framework.Assert.failNotEquals(Assert.java:280)
	at junit.framework.Assert.assertEquals(Assert.java:64)
	at junit.framework.Assert.assertEquals(Assert.java:198)
	at junit.framework.Assert.assertEquals(Assert.java:204)
	at org.joda.time.TestYearMonthDay_Constructors.testConstructor_ObjectString1(TestYearMonthDay_Constructors.java:252)

testPropertyCompareToYear(org.joda.time.TestYearMonthDay_Properties)  Time elapsed: 0 sec  <<< FAILURE!
junit.framework.AssertionFailedError: expected:<true> but was:<false>
	at junit.framework.Assert.fail(Assert.java:47)
	at junit.framework.Assert.failNotEquals(Assert.java:280)
	at junit.framework.Assert.assertEquals(Assert.java:64)
	at junit.framework.Assert.assertEquals(Assert.java:146)
	at junit.framework.Assert.assertEquals(Assert.java:152)
	at org.joda.time.TestYearMonthDay_Properties.testPropertyCompareToYear(TestYearMonthDay_Properties.java:175)

testPropertyAddMonth(org.joda.time.TestYearMonthDay_Properties)  Time elapsed: 0 sec  <<< FAILURE!
junit.framework.AssertionFailedError: expected:<1972> but was:<0>
	at junit.framework.Assert.fail(Assert.java:47)
	at junit.framework.Assert.failNotEquals(Assert.java:280)
	at junit.framework.Assert.assertEquals(Assert.java:64)
	at junit.framework.Assert.assertEquals(Assert.java:198)
	at junit.framework.Assert.assertEquals(Assert.java:204)
	at org.joda.time.TestYearMonthDay_Properties.check(TestYearMonthDay_Properties.java:555)
	at org.joda.time.TestYearMonthDay_Properties.testPropertyAddMonth(TestYearMonthDay_Properties.java:229)

testPropertyAddDay(org.joda.time.TestYearMonthDay_Properties)  Time elapsed: 0.001 sec  <<< ERROR!
java.lang.ArrayIndexOutOfBoundsException: -1
	at org.joda.time.chrono.BasicGJChronology.getDaysInYearMonth(BasicGJChronology.java:126)
	at org.joda.time.chrono.BasicDayOfMonthDateTimeField.getMaximumValue(BasicDayOfMonthDateTimeField.java:87)
	at org.joda.time.field.BaseDateTimeField.set(BaseDateTimeField.java:585)
	at org.joda.time.field.BaseDateTimeField.add(BaseDateTimeField.java:348)
	at org.joda.time.YearMonthDay$Property.addToCopy(YearMonthDay.java:1011)
	at org.joda.time.TestYearMonthDay_Properties.testPropertyAddDay(TestYearMonthDay_Properties.java:382)

testPropertyCompareToMonth(org.joda.time.TestYearMonthDay_Properties)  Time elapsed: 0 sec  <<< FAILURE!
junit.framework.AssertionFailedError: expected:<true> but was:<false>
	at junit.framework.Assert.fail(Assert.java:47)
	at junit.framework.Assert.failNotEquals(Assert.java:280)
	at junit.framework.Assert.assertEquals(Assert.java:64)
	at junit.framework.Assert.assertEquals(Assert.java:146)
	at junit.framework.Assert.assertEquals(Assert.java:152)
	at org.joda.time.TestYearMonthDay_Properties.testPropertyCompareToMonth(TestYearMonthDay_Properties.java:320)

testPropertyCompareToDay(org.joda.time.TestYearMonthDay_Properties)  Time elapsed: 0.001 sec  <<< FAILURE!
junit.framework.AssertionFailedError: expected:<true> but was:<false>
	at junit.framework.Assert.fail(Assert.java:47)
	at junit.framework.Assert.failNotEquals(Assert.java:280)
	at junit.framework.Assert.assertEquals(Assert.java:64)
	at junit.framework.Assert.assertEquals(Assert.java:146)
	at junit.framework.Assert.assertEquals(Assert.java:152)
	at org.joda.time.TestYearMonthDay_Properties.testPropertyCompareToDay(TestYearMonthDay_Properties.java:476)

testGetValues(org.joda.time.TestYearMonth_Basics)  Time elapsed: 0.001 sec  <<< FAILURE!
junit.framework.AssertionFailedError: expected:<1970> but was:<0>
	at junit.framework.Assert.fail(Assert.java:47)
	at junit.framework.Assert.failNotEquals(Assert.java:280)
	at junit.framework.Assert.assertEquals(Assert.java:64)
	at junit.framework.Assert.assertEquals(Assert.java:198)
	at junit.framework.Assert.assertEquals(Assert.java:204)
	at org.joda.time.TestYearMonth_Basics.testGetValues(TestYearMonth_Basics.java:165)

testGetValue(org.joda.time.TestYearMonth_Basics)  Time elapsed: 0 sec  <<< FAILURE!
junit.framework.AssertionFailedError: expected:<1970> but was:<0>
	at junit.framework.Assert.fail(Assert.java:47)
	at junit.framework.Assert.failNotEquals(Assert.java:280)
	at junit.framework.Assert.assertEquals(Assert.java:64)
	at junit.framework.Assert.assertEquals(Assert.java:198)
	at junit.framework.Assert.assertEquals(Assert.java:204)
	at org.joda.time.TestYearMonth_Basics.testGetValue(TestYearMonth_Basics.java:151)

testGet(org.joda.time.TestYearMonth_Basics)  Time elapsed: 0.001 sec  <<< FAILURE!
junit.framework.AssertionFailedError: expected:<1970> but was:<0>
	at junit.framework.Assert.fail(Assert.java:47)
	at junit.framework.Assert.failNotEquals(Assert.java:280)
	at junit.framework.Assert.assertEquals(Assert.java:64)
	at junit.framework.Assert.assertEquals(Assert.java:198)
	at junit.framework.Assert.assertEquals(Assert.java:204)
	at org.joda.time.TestYearMonth_Basics.testGet(TestYearMonth_Basics.java:90)

testConstructor(org.joda.time.TestYearMonth_Constructors)  Time elapsed: 0.001 sec  <<< FAILURE!
junit.framework.AssertionFailedError: expected:<1970> but was:<0>
	at junit.framework.Assert.fail(Assert.java:47)
	at junit.framework.Assert.failNotEquals(Assert.java:280)
	at junit.framework.Assert.assertEquals(Assert.java:64)
	at junit.framework.Assert.assertEquals(Assert.java:198)
	at junit.framework.Assert.assertEquals(Assert.java:204)
	at org.joda.time.TestYearMonth_Constructors.testConstructor(TestYearMonth_Constructors.java:124)

testConstructor_long1(org.joda.time.TestYearMonth_Constructors)  Time elapsed: 0.001 sec  <<< FAILURE!
junit.framework.AssertionFailedError: expected:<1970> but was:<0>
	at junit.framework.Assert.fail(Assert.java:47)
	at junit.framework.Assert.failNotEquals(Assert.java:280)
	at junit.framework.Assert.assertEquals(Assert.java:64)
	at junit.framework.Assert.assertEquals(Assert.java:198)
	at junit.framework.Assert.assertEquals(Assert.java:204)
	at org.joda.time.TestYearMonth_Constructors.testConstructor_long1(TestYearMonth_Constructors.java:192)

testConstructor_long2(org.joda.time.TestYearMonth_Constructors)  Time elapsed: 0 sec  <<< FAILURE!
junit.framework.AssertionFailedError: expected:<1971> but was:<0>
	at junit.framework.Assert.fail(Assert.java:47)
	at junit.framework.Assert.failNotEquals(Assert.java:280)
	at junit.framework.Assert.assertEquals(Assert.java:64)
	at junit.framework.Assert.assertEquals(Assert.java:198)
	at junit.framework.Assert.assertEquals(Assert.java:204)
	at org.joda.time.TestYearMonth_Constructors.testConstructor_long2(TestYearMonth_Constructors.java:202)

testConstructor_Object(org.joda.time.TestYearMonth_Constructors)  Time elapsed: 0 sec  <<< FAILURE!
junit.framework.AssertionFailedError: expected:<1970> but was:<0>
	at junit.framework.Assert.fail(Assert.java:47)
	at junit.framework.Assert.failNotEquals(Assert.java:280)
	at junit.framework.Assert.assertEquals(Assert.java:64)
	at junit.framework.Assert.assertEquals(Assert.java:198)
	at junit.framework.Assert.assertEquals(Assert.java:204)
	at org.joda.time.TestYearMonth_Constructors.testConstructor_Object(TestYearMonth_Constructors.java:241)

testConstructor_nullObject(org.joda.time.TestYearMonth_Constructors)  Time elapsed: 0 sec  <<< FAILURE!
junit.framework.AssertionFailedError: expected:<1970> but was:<0>
	at junit.framework.Assert.fail(Assert.java:47)
	at junit.framework.Assert.failNotEquals(Assert.java:280)
	at junit.framework.Assert.assertEquals(Assert.java:64)
	at junit.framework.Assert.assertEquals(Assert.java:198)
	at junit.framework.Assert.assertEquals(Assert.java:204)
	at org.joda.time.TestYearMonth_Constructors.testConstructor_nullObject(TestYearMonth_Constructors.java:248)

testConstructor_ObjectString5(org.joda.time.TestYearMonth_Constructors)  Time elapsed: 0 sec  <<< FAILURE!
junit.framework.AssertionFailedError: expected:<10> but was:<0>
	at junit.framework.Assert.fail(Assert.java:47)
	at junit.framework.Assert.failNotEquals(Assert.java:280)
	at junit.framework.Assert.assertEquals(Assert.java:64)
	at junit.framework.Assert.assertEquals(Assert.java:198)
	at junit.framework.Assert.assertEquals(Assert.java:204)
	at org.joda.time.TestYearMonth_Constructors.testConstructor_ObjectString5(TestYearMonth_Constructors.java:262)

testConstructor_Object_Chronology(org.joda.time.TestYearMonth_Constructors)  Time elapsed: 0 sec  <<< FAILURE!
junit.framework.AssertionFailedError: expected:<1970> but was:<0>
	at junit.framework.Assert.fail(Assert.java:47)
	at junit.framework.Assert.failNotEquals(Assert.java:280)
	at junit.framework.Assert.assertEquals(Assert.java:64)
	at junit.framework.Assert.assertEquals(Assert.java:198)
	at junit.framework.Assert.assertEquals(Assert.java:204)
	at org.joda.time.TestYearMonth_Constructors.testConstructor_Object_Chronology(TestYearMonth_Constructors.java:310)

testConstructor_nullObject_Chronology(org.joda.time.TestYearMonth_Constructors)  Time elapsed: 0 sec  <<< FAILURE!
junit.framework.AssertionFailedError: expected:<1970> but was:<0>
	at junit.framework.Assert.fail(Assert.java:47)
	at junit.framework.Assert.failNotEquals(Assert.java:280)
	at junit.framework.Assert.assertEquals(Assert.java:64)
	at junit.framework.Assert.assertEquals(Assert.java:198)
	at junit.framework.Assert.assertEquals(Assert.java:204)
	at org.joda.time.TestYearMonth_Constructors.testConstructor_nullObject_Chronology(TestYearMonth_Constructors.java:320)

testConstructor_Object_nullChronology(org.joda.time.TestYearMonth_Constructors)  Time elapsed: 0 sec  <<< FAILURE!
junit.framework.AssertionFailedError: expected:<1970> but was:<0>
	at junit.framework.Assert.fail(Assert.java:47)
	at junit.framework.Assert.failNotEquals(Assert.java:280)
	at junit.framework.Assert.assertEquals(Assert.java:64)
	at junit.framework.Assert.assertEquals(Assert.java:198)
	at junit.framework.Assert.assertEquals(Assert.java:204)
	at org.joda.time.TestYearMonth_Constructors.testConstructor_Object_nullChronology(TestYearMonth_Constructors.java:331)

testConstructor_nullObject_nullChronology(org.joda.time.TestYearMonth_Constructors)  Time elapsed: 0 sec  <<< FAILURE!
junit.framework.AssertionFailedError: expected:<1970> but was:<0>
	at junit.framework.Assert.fail(Assert.java:47)
	at junit.framework.Assert.failNotEquals(Assert.java:280)
	at junit.framework.Assert.assertEquals(Assert.java:64)
	at junit.framework.Assert.assertEquals(Assert.java:198)
	at junit.framework.Assert.assertEquals(Assert.java:204)
	at org.joda.time.TestYearMonth_Constructors.testConstructor_nullObject_nullChronology(TestYearMonth_Constructors.java:341)

testConstructor_DateTimeZone(org.joda.time.TestYearMonth_Constructors)  Time elapsed: 0.001 sec  <<< FAILURE!
junit.framework.AssertionFailedError: expected:<2005> but was:<0>
	at junit.framework.Assert.fail(Assert.java:47)
	at junit.framework.Assert.failNotEquals(Assert.java:280)
	at junit.framework.Assert.assertEquals(Assert.java:64)
	at junit.framework.Assert.assertEquals(Assert.java:198)
	at junit.framework.Assert.assertEquals(Assert.java:204)
	at org.joda.time.TestYearMonth_Constructors.testConstructor_DateTimeZone(TestYearMonth_Constructors.java:139)

testConstructor_nullDateTimeZone(org.joda.time.TestYearMonth_Constructors)  Time elapsed: 0 sec  <<< FAILURE!
junit.framework.AssertionFailedError: expected:<2005> but was:<0>
	at junit.framework.Assert.fail(Assert.java:47)
	at junit.framework.Assert.failNotEquals(Assert.java:280)
	at junit.framework.Assert.assertEquals(Assert.java:64)
	at junit.framework.Assert.assertEquals(Assert.java:198)
	at junit.framework.Assert.assertEquals(Assert.java:204)
	at org.joda.time.TestYearMonth_Constructors.testConstructor_nullDateTimeZone(TestYearMonth_Constructors.java:160)

testConstructor_Chronology(org.joda.time.TestYearMonth_Constructors)  Time elapsed: 0.001 sec  <<< FAILURE!
junit.framework.AssertionFailedError: expected:<1970> but was:<0>
	at junit.framework.Assert.fail(Assert.java:47)
	at junit.framework.Assert.failNotEquals(Assert.java:280)
	at junit.framework.Assert.assertEquals(Assert.java:64)
	at junit.framework.Assert.assertEquals(Assert.java:198)
	at junit.framework.Assert.assertEquals(Assert.java:204)
	at org.joda.time.TestYearMonth_Constructors.testConstructor_Chronology(TestYearMonth_Constructors.java:170)

testConstructor_nullChronology(org.joda.time.TestYearMonth_Constructors)  Time elapsed: 0 sec  <<< FAILURE!
junit.framework.AssertionFailedError: expected:<1970> but was:<0>
	at junit.framework.Assert.fail(Assert.java:47)
	at junit.framework.Assert.failNotEquals(Assert.java:280)
	at junit.framework.Assert.assertEquals(Assert.java:64)
	at junit.framework.Assert.assertEquals(Assert.java:198)
	at junit.framework.Assert.assertEquals(Assert.java:204)
	at org.joda.time.TestYearMonth_Constructors.testConstructor_nullChronology(TestYearMonth_Constructors.java:181)

testConstructor_long1_Chronology(org.joda.time.TestYearMonth_Constructors)  Time elapsed: 0 sec  <<< FAILURE!
junit.framework.AssertionFailedError: expected:<1970> but was:<0>
	at junit.framework.Assert.fail(Assert.java:47)
	at junit.framework.Assert.failNotEquals(Assert.java:280)
	at junit.framework.Assert.assertEquals(Assert.java:64)
	at junit.framework.Assert.assertEquals(Assert.java:198)
	at junit.framework.Assert.assertEquals(Assert.java:204)
	at org.joda.time.TestYearMonth_Constructors.testConstructor_long1_Chronology(TestYearMonth_Constructors.java:212)

testConstructor_long2_Chronology(org.joda.time.TestYearMonth_Constructors)  Time elapsed: 0.001 sec  <<< FAILURE!
junit.framework.AssertionFailedError: expected:<1971> but was:<0>
	at junit.framework.Assert.fail(Assert.java:47)
	at junit.framework.Assert.failNotEquals(Assert.java:280)
	at junit.framework.Assert.assertEquals(Assert.java:64)
	at junit.framework.Assert.assertEquals(Assert.java:198)
	at junit.framework.Assert.assertEquals(Assert.java:204)
	at org.joda.time.TestYearMonth_Constructors.testConstructor_long2_Chronology(TestYearMonth_Constructors.java:222)

testConstructor_long_nullChronology(org.joda.time.TestYearMonth_Constructors)  Time elapsed: 0 sec  <<< FAILURE!
junit.framework.AssertionFailedError: expected:<1970> but was:<0>
	at junit.framework.Assert.fail(Assert.java:47)
	at junit.framework.Assert.failNotEquals(Assert.java:280)
	at junit.framework.Assert.assertEquals(Assert.java:64)
	at junit.framework.Assert.assertEquals(Assert.java:198)
	at junit.framework.Assert.assertEquals(Assert.java:204)
	at org.joda.time.TestYearMonth_Constructors.testConstructor_long_nullChronology(TestYearMonth_Constructors.java:232)

testConstructor_ObjectString1(org.joda.time.TestYearMonth_Constructors)  Time elapsed: 0 sec  <<< FAILURE!
junit.framework.AssertionFailedError: expected:<1972> but was:<0>
	at junit.framework.Assert.fail(Assert.java:47)
	at junit.framework.Assert.failNotEquals(Assert.java:280)
	at junit.framework.Assert.assertEquals(Assert.java:64)
	at junit.framework.Assert.assertEquals(Assert.java:198)
	at junit.framework.Assert.assertEquals(Assert.java:204)
	at org.joda.time.TestYearMonth_Constructors.testConstructor_ObjectString1(TestYearMonth_Constructors.java:255)

testPropertyCompareToYear(org.joda.time.TestYearMonth_Properties)  Time elapsed: 0 sec  <<< FAILURE!
junit.framework.AssertionFailedError: expected:<true> but was:<false>
	at junit.framework.Assert.fail(Assert.java:47)
	at junit.framework.Assert.failNotEquals(Assert.java:280)
	at junit.framework.Assert.assertEquals(Assert.java:64)
	at junit.framework.Assert.assertEquals(Assert.java:146)
	at junit.framework.Assert.assertEquals(Assert.java:152)
	at org.joda.time.TestYearMonth_Properties.testPropertyCompareToYear(TestYearMonth_Properties.java:174)

testPropertyAddMonth(org.joda.time.TestYearMonth_Properties)  Time elapsed: 0.001 sec  <<< FAILURE!
junit.framework.AssertionFailedError: expected:<1972> but was:<0>
	at junit.framework.Assert.fail(Assert.java:47)
	at junit.framework.Assert.failNotEquals(Assert.java:280)
	at junit.framework.Assert.assertEquals(Assert.java:64)
	at junit.framework.Assert.assertEquals(Assert.java:198)
	at junit.framework.Assert.assertEquals(Assert.java:204)
	at org.joda.time.TestYearMonth_Properties.check(TestYearMonth_Properties.java:363)
	at org.joda.time.TestYearMonth_Properties.testPropertyAddMonth(TestYearMonth_Properties.java:228)

testPropertyCompareToMonth(org.joda.time.TestYearMonth_Properties)  Time elapsed: 0 sec  <<< FAILURE!
junit.framework.AssertionFailedError: expected:<true> but was:<false>
	at junit.framework.Assert.fail(Assert.java:47)
	at junit.framework.Assert.failNotEquals(Assert.java:280)
	at junit.framework.Assert.assertEquals(Assert.java:64)
	at junit.framework.Assert.assertEquals(Assert.java:146)
	at junit.framework.Assert.assertEquals(Assert.java:152)
	at org.joda.time.TestYearMonth_Properties.testPropertyCompareToMonth(TestYearMonth_Properties.java:287)

testGetValues(org.joda.time.TestMonthDay_Basics)  Time elapsed: 0 sec  <<< FAILURE!
junit.framework.AssertionFailedError: expected:<6> but was:<0>
	at junit.framework.Assert.fail(Assert.java:47)
	at junit.framework.Assert.failNotEquals(Assert.java:280)
	at junit.framework.Assert.assertEquals(Assert.java:64)
	at junit.framework.Assert.assertEquals(Assert.java:198)
	at junit.framework.Assert.assertEquals(Assert.java:204)
	at org.joda.time.TestMonthDay_Basics.testGetValues(TestMonthDay_Basics.java:164)

testGetValue(org.joda.time.TestMonthDay_Basics)  Time elapsed: 0.001 sec  <<< FAILURE!
junit.framework.AssertionFailedError: expected:<6> but was:<0>
	at junit.framework.Assert.fail(Assert.java:47)
	at junit.framework.Assert.failNotEquals(Assert.java:280)
	at junit.framework.Assert.assertEquals(Assert.java:64)
	at junit.framework.Assert.assertEquals(Assert.java:198)
	at junit.framework.Assert.assertEquals(Assert.java:204)
	at org.joda.time.TestMonthDay_Basics.testGetValue(TestMonthDay_Basics.java:150)

testGet(org.joda.time.TestMonthDay_Basics)  Time elapsed: 0.001 sec  <<< FAILURE!
junit.framework.AssertionFailedError: expected:<6> but was:<0>
	at junit.framework.Assert.fail(Assert.java:47)
	at junit.framework.Assert.failNotEquals(Assert.java:280)
	at junit.framework.Assert.assertEquals(Assert.java:64)
	at junit.framework.Assert.assertEquals(Assert.java:198)
	at junit.framework.Assert.assertEquals(Assert.java:204)
	at org.joda.time.TestMonthDay_Basics.testGet(TestMonthDay_Basics.java:88)

testConstructor(org.joda.time.TestMonthDay_Constructors)  Time elapsed: 0.001 sec  <<< FAILURE!
junit.framework.AssertionFailedError: expected:<6> but was:<0>
	at junit.framework.Assert.fail(Assert.java:47)
	at junit.framework.Assert.failNotEquals(Assert.java:280)
	at junit.framework.Assert.assertEquals(Assert.java:64)
	at junit.framework.Assert.assertEquals(Assert.java:198)
	at junit.framework.Assert.assertEquals(Assert.java:204)
	at org.joda.time.TestMonthDay_Constructors.testConstructor(TestMonthDay_Constructors.java:124)

testConstructor_long1(org.joda.time.TestMonthDay_Constructors)  Time elapsed: 0.004 sec  <<< FAILURE!
junit.framework.AssertionFailedError: expected:<4> but was:<0>
	at junit.framework.Assert.fail(Assert.java:47)
	at junit.framework.Assert.failNotEquals(Assert.java:280)
	at junit.framework.Assert.assertEquals(Assert.java:64)
	at junit.framework.Assert.assertEquals(Assert.java:198)
	at junit.framework.Assert.assertEquals(Assert.java:204)
	at org.joda.time.TestMonthDay_Constructors.testConstructor_long1(TestMonthDay_Constructors.java:192)

testConstructor_long2(org.joda.time.TestMonthDay_Constructors)  Time elapsed: 0 sec  <<< FAILURE!
junit.framework.AssertionFailedError: expected:<5> but was:<0>
	at junit.framework.Assert.fail(Assert.java:47)
	at junit.framework.Assert.failNotEquals(Assert.java:280)
	at junit.framework.Assert.assertEquals(Assert.java:64)
	at junit.framework.Assert.assertEquals(Assert.java:198)
	at junit.framework.Assert.assertEquals(Assert.java:204)
	at org.joda.time.TestMonthDay_Constructors.testConstructor_long2(TestMonthDay_Constructors.java:202)

testConstructor_Object(org.joda.time.TestMonthDay_Constructors)  Time elapsed: 0 sec  <<< FAILURE!
junit.framework.AssertionFailedError: expected:<4> but was:<0>
	at junit.framework.Assert.fail(Assert.java:47)
	at junit.framework.Assert.failNotEquals(Assert.java:280)
	at junit.framework.Assert.assertEquals(Assert.java:64)
	at junit.framework.Assert.assertEquals(Assert.java:198)
	at junit.framework.Assert.assertEquals(Assert.java:204)
	at org.joda.time.TestMonthDay_Constructors.testConstructor_Object(TestMonthDay_Constructors.java:241)

testConstructor_nullObject(org.joda.time.TestMonthDay_Constructors)  Time elapsed: 0 sec  <<< FAILURE!
junit.framework.AssertionFailedError: expected:<6> but was:<0>
	at junit.framework.Assert.fail(Assert.java:47)
	at junit.framework.Assert.failNotEquals(Assert.java:280)
	at junit.framework.Assert.assertEquals(Assert.java:64)
	at junit.framework.Assert.assertEquals(Assert.java:198)
	at junit.framework.Assert.assertEquals(Assert.java:204)
	at org.joda.time.TestMonthDay_Constructors.testConstructor_nullObject(TestMonthDay_Constructors.java:248)

testConstructor_ObjectString5(org.joda.time.TestMonthDay_Constructors)  Time elapsed: 0 sec  <<< FAILURE!
junit.framework.AssertionFailedError: expected:<1> but was:<0>
	at junit.framework.Assert.fail(Assert.java:47)
	at junit.framework.Assert.failNotEquals(Assert.java:280)
	at junit.framework.Assert.assertEquals(Assert.java:64)
	at junit.framework.Assert.assertEquals(Assert.java:198)
	at junit.framework.Assert.assertEquals(Assert.java:204)
	at org.joda.time.TestMonthDay_Constructors.testConstructor_ObjectString5(TestMonthDay_Constructors.java:262)

testConstructor_Object_Chronology(org.joda.time.TestMonthDay_Constructors)  Time elapsed: 0 sec  <<< FAILURE!
junit.framework.AssertionFailedError: expected:<4> but was:<0>
	at junit.framework.Assert.fail(Assert.java:47)
	at junit.framework.Assert.failNotEquals(Assert.java:280)
	at junit.framework.Assert.assertEquals(Assert.java:64)
	at junit.framework.Assert.assertEquals(Assert.java:198)
	at junit.framework.Assert.assertEquals(Assert.java:204)
	at org.joda.time.TestMonthDay_Constructors.testConstructor_Object_Chronology(TestMonthDay_Constructors.java:310)

testConstructor_nullObject_Chronology(org.joda.time.TestMonthDay_Constructors)  Time elapsed: 0 sec  <<< FAILURE!
junit.framework.AssertionFailedError: expected:<6> but was:<0>
	at junit.framework.Assert.fail(Assert.java:47)
	at junit.framework.Assert.failNotEquals(Assert.java:280)
	at junit.framework.Assert.assertEquals(Assert.java:64)
	at junit.framework.Assert.assertEquals(Assert.java:198)
	at junit.framework.Assert.assertEquals(Assert.java:204)
	at org.joda.time.TestMonthDay_Constructors.testConstructor_nullObject_Chronology(TestMonthDay_Constructors.java:320)

testConstructor_Object_nullChronology(org.joda.time.TestMonthDay_Constructors)  Time elapsed: 0.004 sec  <<< FAILURE!
junit.framework.AssertionFailedError: expected:<4> but was:<0>
	at junit.framework.Assert.fail(Assert.java:47)
	at junit.framework.Assert.failNotEquals(Assert.java:280)
	at junit.framework.Assert.assertEquals(Assert.java:64)
	at junit.framework.Assert.assertEquals(Assert.java:198)
	at junit.framework.Assert.assertEquals(Assert.java:204)
	at org.joda.time.TestMonthDay_Constructors.testConstructor_Object_nullChronology(TestMonthDay_Constructors.java:331)

testConstructor_nullObject_nullChronology(org.joda.time.TestMonthDay_Constructors)  Time elapsed: 0 sec  <<< FAILURE!
junit.framework.AssertionFailedError: expected:<6> but was:<0>
	at junit.framework.Assert.fail(Assert.java:47)
	at junit.framework.Assert.failNotEquals(Assert.java:280)
	at junit.framework.Assert.assertEquals(Assert.java:64)
	at junit.framework.Assert.assertEquals(Assert.java:198)
	at junit.framework.Assert.assertEquals(Assert.java:204)
	at org.joda.time.TestMonthDay_Constructors.testConstructor_nullObject_nullChronology(TestMonthDay_Constructors.java:341)

testConstructor_DateTimeZone(org.joda.time.TestMonthDay_Constructors)  Time elapsed: 0 sec  <<< FAILURE!
junit.framework.AssertionFailedError: expected:<6> but was:<0>
	at junit.framework.Assert.fail(Assert.java:47)
	at junit.framework.Assert.failNotEquals(Assert.java:280)
	at junit.framework.Assert.assertEquals(Assert.java:64)
	at junit.framework.Assert.assertEquals(Assert.java:198)
	at junit.framework.Assert.assertEquals(Assert.java:204)
	at org.joda.time.TestMonthDay_Constructors.testConstructor_DateTimeZone(TestMonthDay_Constructors.java:139)

testConstructor_nullDateTimeZone(org.joda.time.TestMonthDay_Constructors)  Time elapsed: 0 sec  <<< FAILURE!
junit.framework.AssertionFailedError: expected:<6> but was:<0>
	at junit.framework.Assert.fail(Assert.java:47)
	at junit.framework.Assert.failNotEquals(Assert.java:280)
	at junit.framework.Assert.assertEquals(Assert.java:64)
	at junit.framework.Assert.assertEquals(Assert.java:198)
	at junit.framework.Assert.assertEquals(Assert.java:204)
	at org.joda.time.TestMonthDay_Constructors.testConstructor_nullDateTimeZone(TestMonthDay_Constructors.java:160)

testConstructor_Chronology(org.joda.time.TestMonthDay_Constructors)  Time elapsed: 0 sec  <<< FAILURE!
junit.framework.AssertionFailedError: expected:<6> but was:<0>
	at junit.framework.Assert.fail(Assert.java:47)
	at junit.framework.Assert.failNotEquals(Assert.java:280)
	at junit.framework.Assert.assertEquals(Assert.java:64)
	at junit.framework.Assert.assertEquals(Assert.java:198)
	at junit.framework.Assert.assertEquals(Assert.java:204)
	at org.joda.time.TestMonthDay_Constructors.testConstructor_Chronology(TestMonthDay_Constructors.java:170)

testConstructor_nullChronology(org.joda.time.TestMonthDay_Constructors)  Time elapsed: 0 sec  <<< FAILURE!
junit.framework.AssertionFailedError: expected:<6> but was:<0>
	at junit.framework.Assert.fail(Assert.java:47)
	at junit.framework.Assert.failNotEquals(Assert.java:280)
	at junit.framework.Assert.assertEquals(Assert.java:64)
	at junit.framework.Assert.assertEquals(Assert.java:198)
	at junit.framework.Assert.assertEquals(Assert.java:204)
	at org.joda.time.TestMonthDay_Constructors.testConstructor_nullChronology(TestMonthDay_Constructors.java:181)

testConstructor_long1_Chronology(org.joda.time.TestMonthDay_Constructors)  Time elapsed: 0 sec  <<< FAILURE!
junit.framework.AssertionFailedError: expected:<4> but was:<0>
	at junit.framework.Assert.fail(Assert.java:47)
	at junit.framework.Assert.failNotEquals(Assert.java:280)
	at junit.framework.Assert.assertEquals(Assert.java:64)
	at junit.framework.Assert.assertEquals(Assert.java:198)
	at junit.framework.Assert.assertEquals(Assert.java:204)
	at org.joda.time.TestMonthDay_Constructors.testConstructor_long1_Chronology(TestMonthDay_Constructors.java:212)

testConstructor_long2_Chronology(org.joda.time.TestMonthDay_Constructors)  Time elapsed: 0.001 sec  <<< FAILURE!
junit.framework.AssertionFailedError: expected:<5> but was:<0>
	at junit.framework.Assert.fail(Assert.java:47)
	at junit.framework.Assert.failNotEquals(Assert.java:280)
	at junit.framework.Assert.assertEquals(Assert.java:64)
	at junit.framework.Assert.assertEquals(Assert.java:198)
	at junit.framework.Assert.assertEquals(Assert.java:204)
	at org.joda.time.TestMonthDay_Constructors.testConstructor_long2_Chronology(TestMonthDay_Constructors.java:222)

testConstructor_long_nullChronology(org.joda.time.TestMonthDay_Constructors)  Time elapsed: 0.001 sec  <<< FAILURE!
junit.framework.AssertionFailedError: expected:<4> but was:<0>
	at junit.framework.Assert.fail(Assert.java:47)
	at junit.framework.Assert.failNotEquals(Assert.java:280)
	at junit.framework.Assert.assertEquals(Assert.java:64)
	at junit.framework.Assert.assertEquals(Assert.java:198)
	at junit.framework.Assert.assertEquals(Assert.java:204)
	at org.joda.time.TestMonthDay_Constructors.testConstructor_long_nullChronology(TestMonthDay_Constructors.java:232)

testConstructor_ObjectString1(org.joda.time.TestMonthDay_Constructors)  Time elapsed: 0.001 sec  <<< FAILURE!
junit.framework.AssertionFailedError: expected:<12> but was:<0>
	at junit.framework.Assert.fail(Assert.java:47)
	at junit.framework.Assert.failNotEquals(Assert.java:280)
	at junit.framework.Assert.assertEquals(Assert.java:64)
	at junit.framework.Assert.assertEquals(Assert.java:198)
	at junit.framework.Assert.assertEquals(Assert.java:204)
	at org.joda.time.TestMonthDay_Constructors.testConstructor_ObjectString1(TestMonthDay_Constructors.java:255)

testPropertyCompareToDayOfMonth(org.joda.time.TestMonthDay_Properties)  Time elapsed: 0 sec  <<< FAILURE!
junit.framework.AssertionFailedError: expected:<true> but was:<false>
	at junit.framework.Assert.fail(Assert.java:47)
	at junit.framework.Assert.failNotEquals(Assert.java:280)
	at junit.framework.Assert.assertEquals(Assert.java:64)
	at junit.framework.Assert.assertEquals(Assert.java:146)
	at junit.framework.Assert.assertEquals(Assert.java:152)
	at org.joda.time.TestMonthDay_Properties.testPropertyCompareToDayOfMonth(TestMonthDay_Properties.java:269)

testPropertyCompareToMonthOfYear(org.joda.time.TestMonthDay_Properties)  Time elapsed: 0 sec  <<< FAILURE!
junit.framework.AssertionFailedError: expected:<true> but was:<false>
	at junit.framework.Assert.fail(Assert.java:47)
	at junit.framework.Assert.failNotEquals(Assert.java:280)
	at junit.framework.Assert.assertEquals(Assert.java:64)
	at junit.framework.Assert.assertEquals(Assert.java:146)
	at junit.framework.Assert.assertEquals(Assert.java:152)
	at org.joda.time.TestMonthDay_Properties.testPropertyCompareToMonthOfYear(TestMonthDay_Properties.java:156)

testSerializedYearMonthDay(org.joda.time.TestSerialization)  Time elapsed: 0.001 sec  <<< FAILURE!
junit.framework.AssertionFailedError: expected:<0000-00-00> but was:<2002-06-09>
	at junit.framework.Assert.fail(Assert.java:47)
	at junit.framework.Assert.failNotEquals(Assert.java:280)
	at junit.framework.Assert.assertEquals(Assert.java:64)
	at junit.framework.Assert.assertEquals(Assert.java:71)
	at org.joda.time.TestSerialization.loadAndCompare(TestSerialization.java:300)
	at org.joda.time.TestSerialization.testSerializedYearMonthDay(TestSerialization.java:199)

testSerializedTimeOfDay(org.joda.time.TestSerialization)  Time elapsed: 0.001 sec  <<< FAILURE!
junit.framework.AssertionFailedError: expected:<T00:00:00.000> but was:<T01:00:00.000>
	at junit.framework.Assert.fail(Assert.java:47)
	at junit.framework.Assert.failNotEquals(Assert.java:280)
	at junit.framework.Assert.assertEquals(Assert.java:64)
	at junit.framework.Assert.assertEquals(Assert.java:71)
	at org.joda.time.TestSerialization.loadAndCompare(TestSerialization.java:300)
	at org.joda.time.TestSerialization.testSerializedTimeOfDay(TestSerialization.java:206)

testMaximumValue(org.joda.time.chrono.TestGJChronology)  Time elapsed: 0.001 sec  <<< ERROR!
org.joda.time.IllegalFieldValueException: Value 0 for year is not supported
	at org.joda.time.chrono.JulianChronology.adjustYearForSet(JulianChronology.java:79)
	at org.joda.time.chrono.JulianChronology.getDateMidnightMillis(JulianChronology.java:212)
	at org.joda.time.chrono.BasicChronology.getDateTimeMillis(BasicChronology.java:159)
	at org.joda.time.chrono.JulianChronology.getDateTimeMillis(JulianChronology.java:49)
	at org.joda.time.chrono.GJChronology.convertByYear(GJChronology.java:82)
	at org.joda.time.chrono.GJChronology.gregorianToJulianByYear(GJChronology.java:581)
	at org.joda.time.chrono.GJChronology$CutoverField.gregorianToJulian(GJChronology.java:931)
	at org.joda.time.chrono.GJChronology$CutoverField.set(GJChronology.java:731)
	at org.joda.time.chrono.BaseChronology.set(BaseChronology.java:63)
	at org.joda.time.chrono.GJChronology$CutoverField.getMaximumValue(GJChronology.java:863)
	at org.joda.time.field.AbstractPartialFieldProperty.getMaximumValue(AbstractPartialFieldProperty.java:230)
	at org.joda.time.chrono.TestGJChronology.testMaximumValue(TestGJChronology.java:515)

testPartialGetAsText(org.joda.time.chrono.TestGJChronology)  Time elapsed: 0.001 sec  <<< FAILURE!
junit.framework.ComparisonFailure: expected:<January> but was:<null>
	at junit.framework.Assert.assertEquals(Assert.java:81)
	at junit.framework.Assert.assertEquals(Assert.java:87)
	at org.joda.time.chrono.TestGJChronology.testPartialGetAsText(TestGJChronology.java:523)

testCutoverAddYears(org.joda.time.chrono.TestGJChronology)  Time elapsed: 0.001 sec  <<< ERROR!
org.joda.time.IllegalFieldValueException: Value 0 for year is not supported
	at org.joda.time.chrono.JulianChronology.adjustYearForSet(JulianChronology.java:79)
	at org.joda.time.chrono.JulianChronology.getDateMidnightMillis(JulianChronology.java:212)
	at org.joda.time.chrono.BasicChronology.getDateTimeMillis(BasicChronology.java:159)
	at org.joda.time.chrono.JulianChronology.getDateTimeMillis(JulianChronology.java:49)
	at org.joda.time.chrono.GJChronology.convertByYear(GJChronology.java:82)
	at org.joda.time.chrono.GJChronology.gregorianToJulianByYear(GJChronology.java:581)
	at org.joda.time.chrono.GJChronology$CutoverField.gregorianToJulian(GJChronology.java:931)
	at org.joda.time.chrono.GJChronology$CutoverField.set(GJChronology.java:731)
	at org.joda.time.chrono.GJChronology$CutoverField.add(GJChronology.java:708)
	at org.joda.time.YearMonthDay.withFieldAdded(YearMonthDay.java:444)
	at org.joda.time.chrono.TestGJChronology.testAdd(TestGJChronology.java:496)
	at org.joda.time.chrono.TestGJChronology.testCutoverAddYears(TestGJChronology.java:381)

testCutoverAddMonths(org.joda.time.chrono.TestGJChronology)  Time elapsed: 0.001 sec  <<< ERROR!
org.joda.time.IllegalFieldValueException: Value 0 for year is not supported
	at org.joda.time.chrono.JulianChronology.adjustYearForSet(JulianChronology.java:79)
	at org.joda.time.chrono.JulianChronology.getDateMidnightMillis(JulianChronology.java:212)
	at org.joda.time.chrono.BasicChronology.getDateTimeMillis(BasicChronology.java:159)
	at org.joda.time.chrono.JulianChronology.getDateTimeMillis(JulianChronology.java:49)
	at org.joda.time.chrono.GJChronology.convertByYear(GJChronology.java:82)
	at org.joda.time.chrono.GJChronology.gregorianToJulianByYear(GJChronology.java:581)
	at org.joda.time.chrono.GJChronology$CutoverField.gregorianToJulian(GJChronology.java:931)
	at org.joda.time.chrono.GJChronology$CutoverField.set(GJChronology.java:731)
	at org.joda.time.chrono.GJChronology$CutoverField.add(GJChronology.java:708)
	at org.joda.time.YearMonthDay.withFieldAdded(YearMonthDay.java:444)
	at org.joda.time.chrono.TestGJChronology.testAdd(TestGJChronology.java:496)
	at org.joda.time.chrono.TestGJChronology.testCutoverAddMonths(TestGJChronology.java:422)

testCutoverAddDays(org.joda.time.chrono.TestGJChronology)  Time elapsed: 0.001 sec  <<< ERROR!
org.joda.time.IllegalFieldValueException: Value 0 for year is not supported
	at org.joda.time.chrono.JulianChronology.adjustYearForSet(JulianChronology.java:79)
	at org.joda.time.chrono.JulianChronology.getDateMidnightMillis(JulianChronology.java:212)
	at org.joda.time.chrono.BasicChronology.getDateTimeMillis(BasicChronology.java:159)
	at org.joda.time.chrono.JulianChronology.getDateTimeMillis(JulianChronology.java:49)
	at org.joda.time.chrono.GJChronology.convertByYear(GJChronology.java:82)
	at org.joda.time.chrono.GJChronology.gregorianToJulianByYear(GJChronology.java:581)
	at org.joda.time.chrono.GJChronology$CutoverField.gregorianToJulian(GJChronology.java:931)
	at org.joda.time.chrono.GJChronology$CutoverField.set(GJChronology.java:731)
	at org.joda.time.chrono.GJChronology$CutoverField.add(GJChronology.java:708)
	at org.joda.time.YearMonthDay.withFieldAdded(YearMonthDay.java:444)
	at org.joda.time.chrono.TestGJChronology.testAdd(TestGJChronology.java:496)
	at org.joda.time.chrono.TestGJChronology.testCutoverAddDays(TestGJChronology.java:452)

testYearEndAddDays(org.joda.time.chrono.TestGJChronology)  Time elapsed: 0.001 sec  <<< ERROR!
org.joda.time.IllegalFieldValueException: Value 0 for year is not supported
	at org.joda.time.chrono.JulianChronology.adjustYearForSet(JulianChronology.java:79)
	at org.joda.time.chrono.JulianChronology.getDateMidnightMillis(JulianChronology.java:212)
	at org.joda.time.chrono.BasicChronology.getDateTimeMillis(BasicChronology.java:159)
	at org.joda.time.chrono.JulianChronology.getDateTimeMillis(JulianChronology.java:49)
	at org.joda.time.chrono.GJChronology.convertByYear(GJChronology.java:82)
	at org.joda.time.chrono.GJChronology.gregorianToJulianByYear(GJChronology.java:581)
	at org.joda.time.chrono.GJChronology$CutoverField.gregorianToJulian(GJChronology.java:931)
	at org.joda.time.chrono.GJChronology$CutoverField.set(GJChronology.java:731)
	at org.joda.time.chrono.GJChronology$CutoverField.add(GJChronology.java:708)
	at org.joda.time.YearMonthDay.withFieldAdded(YearMonthDay.java:444)
	at org.joda.time.chrono.TestGJChronology.testAdd(TestGJChronology.java:496)
	at org.joda.time.chrono.TestGJChronology.testYearEndAddDays(TestGJChronology.java:462)

testSubtractDays(org.joda.time.chrono.TestGJChronology)  Time elapsed: 0.001 sec  <<< ERROR!
org.joda.time.IllegalFieldValueException: Value 0 for monthOfYear must be in the range [1,12]
	at org.joda.time.field.FieldUtils.verifyValueBounds(FieldUtils.java:252)
	at org.joda.time.chrono.BasicChronology.getDateMidnightMillis(BasicChronology.java:612)
	at org.joda.time.chrono.BasicChronology.getDateTimeMillis(BasicChronology.java:177)
	at org.joda.time.chrono.GregorianChronology.getDateTimeMillis(GregorianChronology.java:44)
	at org.joda.time.chrono.GJChronology.getDateTimeMillis(GJChronology.java:356)
	at org.joda.time.chrono.ZonedChronology.getDateTimeMillis(ZonedChronology.java:118)
	at org.joda.time.chrono.GJChronology.getDateTimeMillis(GJChronology.java:348)
	at org.joda.time.base.BaseDateTime.<init>(BaseDateTime.java:258)
	at org.joda.time.DateTime.<init>(DateTime.java:532)
	at org.joda.time.YearMonthDay.toDateTimeAtMidnight(YearMonthDay.java:685)
	at org.joda.time.YearMonthDay.toDateTimeAtMidnight(YearMonthDay.java:670)
	at org.joda.time.chrono.TestGJChronology.testSubtractDays(TestGJChronology.java:476)

testAddMonths(org.joda.time.chrono.TestISOChronology)  Time elapsed: 0.001 sec  <<< ERROR!
org.joda.time.IllegalFieldValueException: Value 0 for monthOfYear must be in the range [1,12]
	at org.joda.time.field.FieldUtils.verifyValueBounds(FieldUtils.java:234)
	at org.joda.time.chrono.BasicMonthOfYearDateTimeField.set(BasicMonthOfYearDateTimeField.java:299)
	at org.joda.time.chrono.BasicMonthOfYearDateTimeField.add(BasicMonthOfYearDateTimeField.java:219)
	at org.joda.time.YearMonthDay.withFieldAdded(YearMonthDay.java:444)
	at org.joda.time.chrono.TestISOChronology.testAdd(TestISOChronology.java:425)
	at org.joda.time.chrono.TestISOChronology.testAddMonths(TestISOChronology.java:394)

testMaximumValue(org.joda.time.chrono.TestISOChronology)  Time elapsed: 0 sec  <<< ERROR!
java.lang.ArrayIndexOutOfBoundsException: -1
	at org.joda.time.chrono.BasicGJChronology.getDaysInYearMonth(BasicGJChronology.java:126)
	at org.joda.time.chrono.BasicDayOfMonthDateTimeField.getMaximumValue(BasicDayOfMonthDateTimeField.java:72)
	at org.joda.time.field.AbstractPartialFieldProperty.getMaximumValue(AbstractPartialFieldProperty.java:230)
	at org.joda.time.chrono.TestISOChronology.testMaximumValue(TestISOChronology.java:453)

testCutoverAddYears(org.joda.time.chrono.TestISOChronology)  Time elapsed: 0.001 sec  <<< FAILURE!
junit.framework.AssertionFailedError: expected:<0000-00-00> but was:<0001-01-01>
	at junit.framework.Assert.fail(Assert.java:47)
	at junit.framework.Assert.failNotEquals(Assert.java:280)
	at junit.framework.Assert.assertEquals(Assert.java:64)
	at junit.framework.Assert.assertEquals(Assert.java:71)
	at org.joda.time.chrono.TestISOChronology.testAdd(TestISOChronology.java:425)
	at org.joda.time.chrono.TestISOChronology.testCutoverAddYears(TestISOChronology.java:376)

testGetPartialValues(org.joda.time.convert.TestNullConverter)  Time elapsed: 0.001 sec  <<< FAILURE!
junit.framework.AssertionFailedError: expected:<true> but was:<false>
	at junit.framework.Assert.fail(Assert.java:47)
	at junit.framework.Assert.failNotEquals(Assert.java:280)
	at junit.framework.Assert.assertEquals(Assert.java:64)
	at junit.framework.Assert.assertEquals(Assert.java:146)
	at junit.framework.Assert.assertEquals(Assert.java:152)
	at org.joda.time.convert.TestNullConverter.testGetPartialValues(TestNullConverter.java:145)

testGetPartialValues(org.joda.time.convert.TestStringConverter)  Time elapsed: 0 sec  <<< FAILURE!
junit.framework.AssertionFailedError: expected:<true> but was:<false>
	at junit.framework.Assert.fail(Assert.java:47)
	at junit.framework.Assert.failNotEquals(Assert.java:280)
	at junit.framework.Assert.assertEquals(Assert.java:64)
	at junit.framework.Assert.assertEquals(Assert.java:146)
	at junit.framework.Assert.assertEquals(Assert.java:152)
	at org.joda.time.convert.TestStringConverter.testGetPartialValues(TestStringConverter.java:206)

testPrint_bufferMethods(org.joda.time.format.TestDateTimeFormatter)  Time elapsed: 0 sec  <<< FAILURE!
junit.framework.ComparisonFailure: expected:<[2004-06-09]> but was:<[0000-00-00]>
	at junit.framework.Assert.assertEquals(Assert.java:81)
	at junit.framework.Assert.assertEquals(Assert.java:87)
	at org.joda.time.format.TestDateTimeFormatter.testPrint_bufferMethods(TestDateTimeFormatter.java:172)

testPrint_writerMethods(org.joda.time.format.TestDateTimeFormatter)  Time elapsed: 0.001 sec  <<< FAILURE!
junit.framework.ComparisonFailure: expected:<[2004-06-09]> but was:<[0000-00-00]>
	at junit.framework.Assert.assertEquals(Assert.java:81)
	at junit.framework.Assert.assertEquals(Assert.java:87)
	at org.joda.time.format.TestDateTimeFormatter.testPrint_writerMethods(TestDateTimeFormatter.java:194)


Results :

Failed tests: 
  org.joda.time.TestLocalTime_Constructors#testConstructor_Object1 AssertionFailedError
  org.joda.time.TestLocalTime_Constructors#testConstructor_Object1_Chronology AssertionFailedError
  org.joda.time.TestLocalTime_Constructors#testConstructor_Object1_DateTimeZone AssertionFailedError
  org.joda.time.TestLocalTime_Constructors#testConstructor_Object2 AssertionFailedError
  org.joda.time.TestLocalTime_Constructors#testConstructor_Object2_Chronology AssertionFailedError
  org.joda.time.TestLocalTime_Constructors#testConstructor_ObjectString1 AssertionFailedError
  org.joda.time.TestLocalTime_Constructors#testConstructor_ObjectString1NewYork AssertionFailedError
  org.joda.time.TestLocalTime_Constructors#testConstructor_ObjectString1Tokyo AssertionFailedError
  org.joda.time.TestLocalTime_Constructors#testConstructor_ObjectString2 AssertionFailedError
  org.joda.time.TestLocalTime_Constructors#testConstructor_ObjectString3 AssertionFailedError
  org.joda.time.TestLocalTime_Constructors#testConstructor_ObjectString4 AssertionFailedError
  org.joda.time.TestLocalTime_Constructors#testConstructor_ObjectString_DateTimeZoneLondon AssertionFailedError
  org.joda.time.TestLocalTime_Constructors#testConstructor_ObjectString_DateTimeZoneNewYork AssertionFailedError
  org.joda.time.TestLocalTime_Constructors#testConstructor_ObjectString_DateTimeZoneTokyo AssertionFailedError
  org.joda.time.TestLocalTime_Constructors#testConstructor_Object_nullChronology AssertionFailedError
  org.joda.time.TestLocalTime_Constructors#testConstructor_Object_nullDateTimeZone AssertionFailedError
  org.joda.time.TestLocalTime_Constructors#testConstructor_nullObject AssertionFailedError
  org.joda.time.TestLocalTime_Constructors#testConstructor_nullObject_Chronology AssertionFailedError
  org.joda.time.TestLocalTime_Constructors#testConstructor_nullObject_DateTimeZone AssertionFailedError
  org.joda.time.TestLocalTime_Constructors#testConstructor_nullObject_nullChronology AssertionFailedError
  org.joda.time.TestLocalTime_Constructors#testConstructor_nullObject_nullDateTimeZone AssertionFailedError
  org.joda.time.TestMonthDay_Basics#testGet AssertionFailedError expected:<6> bu...
  org.joda.time.TestMonthDay_Basics#testGetValue AssertionFailedError expected:<...
  org.joda.time.TestMonthDay_Basics#testGetValues AssertionFailedError expected:...
  org.joda.time.TestMonthDay_Constructors#testConstructor AssertionFailedError e...
  org.joda.time.TestMonthDay_Constructors#testConstructor_Chronology AssertionFailedError
  org.joda.time.TestMonthDay_Constructors#testConstructor_DateTimeZone AssertionFailedError
  org.joda.time.TestMonthDay_Constructors#testConstructor_Object AssertionFailedError
  org.joda.time.TestMonthDay_Constructors#testConstructor_ObjectString1 AssertionFailedError
  org.joda.time.TestMonthDay_Constructors#testConstructor_ObjectString5 AssertionFailedError
  org.joda.time.TestMonthDay_Constructors#testConstructor_Object_Chronology AssertionFailedError
  org.joda.time.TestMonthDay_Constructors#testConstructor_Object_nullChronology AssertionFailedError
  org.joda.time.TestMonthDay_Constructors#testConstructor_long1 AssertionFailedError
  org.joda.time.TestMonthDay_Constructors#testConstructor_long1_Chronology AssertionFailedError
  org.joda.time.TestMonthDay_Constructors#testConstructor_long2 AssertionFailedError
  org.joda.time.TestMonthDay_Constructors#testConstructor_long2_Chronology AssertionFailedError
  org.joda.time.TestMonthDay_Constructors#testConstructor_long_nullChronology AssertionFailedError
  org.joda.time.TestMonthDay_Constructors#testConstructor_nullChronology AssertionFailedError
  org.joda.time.TestMonthDay_Constructors#testConstructor_nullDateTimeZone AssertionFailedError
  org.joda.time.TestMonthDay_Constructors#testConstructor_nullObject AssertionFailedError
  org.joda.time.TestMonthDay_Constructors#testConstructor_nullObject_Chronology AssertionFailedError
  org.joda.time.TestMonthDay_Constructors#testConstructor_nullObject_nullChronology AssertionFailedError
  org.joda.time.TestMonthDay_Properties#testPropertyCompareToDayOfMonth AssertionFailedError
  org.joda.time.TestMonthDay_Properties#testPropertyCompareToMonthOfYear AssertionFailedError
  org.joda.time.TestSerialization#testSerializedTimeOfDay AssertionFailedError e...
  org.joda.time.TestSerialization#testSerializedYearMonthDay AssertionFailedError
  org.joda.time.TestTimeOfDay_Basics#testGet AssertionFailedError expected:<11> ...
  org.joda.time.TestTimeOfDay_Constructors#testConstructor AssertionFailedError ...
  org.joda.time.TestTimeOfDay_Constructors#testConstructor2_Object_Chronology AssertionFailedError
  org.joda.time.TestTimeOfDay_Constructors#testConstructor_Chronology AssertionFailedError
  org.joda.time.TestTimeOfDay_Constructors#testConstructor_DateTimeZone AssertionFailedError
  org.joda.time.TestTimeOfDay_Constructors#testConstructor_Object1 AssertionFailedError
  org.joda.time.TestTimeOfDay_Constructors#testConstructor_Object2 AssertionFailedError
  org.joda.time.TestTimeOfDay_Constructors#testConstructor_ObjectString1 AssertionFailedError
  org.joda.time.TestTimeOfDay_Constructors#testConstructor_ObjectString2 AssertionFailedError
  org.joda.time.TestTimeOfDay_Constructors#testConstructor_ObjectString3 AssertionFailedError
  org.joda.time.TestTimeOfDay_Constructors#testConstructor_ObjectString4 AssertionFailedError
  org.joda.time.TestTimeOfDay_Constructors#testConstructor_ObjectString5 AssertionFailedError
  org.joda.time.TestTimeOfDay_Constructors#testConstructor_ObjectString6 AssertionFailedError
  org.joda.time.TestTimeOfDay_Constructors#testConstructor_Object_Chronology AssertionFailedError
  org.joda.time.TestTimeOfDay_Constructors#testConstructor_Object_nullChronology AssertionFailedError
  org.joda.time.TestTimeOfDay_Constructors#testConstructor_long1 AssertionFailedError
  org.joda.time.TestTimeOfDay_Constructors#testConstructor_long1_Chronology AssertionFailedError
  org.joda.time.TestTimeOfDay_Constructors#testConstructor_long2 AssertionFailedError
  org.joda.time.TestTimeOfDay_Constructors#testConstructor_long2_Chronology AssertionFailedError
  org.joda.time.TestTimeOfDay_Constructors#testConstructor_long_nullChronology AssertionFailedError
  org.joda.time.TestTimeOfDay_Constructors#testConstructor_nullChronology AssertionFailedError
  org.joda.time.TestTimeOfDay_Constructors#testConstructor_nullDateTimeZone AssertionFailedError
  org.joda.time.TestTimeOfDay_Constructors#testConstructor_nullObject AssertionFailedError
  org.joda.time.TestTimeOfDay_Constructors#testConstructor_nullObject_Chronology AssertionFailedError
  org.joda.time.TestTimeOfDay_Constructors#testConstructor_nullObject_nullChronology AssertionFailedError
  org.joda.time.TestTimeOfDay_Constructors#testFactoryMillisOfDay_long1 AssertionFailedError
  org.joda.time.TestTimeOfDay_Constructors#testFactoryMillisOfDay_long1_Chronology AssertionFailedError
  org.joda.time.TestTimeOfDay_Constructors#testFactoryMillisOfDay_long_nullChronology AssertionFailedError
  org.joda.time.TestTimeOfDay_Properties#testPropertyCompareToHour AssertionFailedError
  org.joda.time.TestTimeOfDay_Properties#testPropertyCompareToMilli AssertionFailedError
  org.joda.time.TestTimeOfDay_Properties#testPropertyCompareToMinute AssertionFailedError
  org.joda.time.TestTimeOfDay_Properties#testPropertyCompareToSecond AssertionFailedError
  org.joda.time.TestYearMonthDay_Basics#testGet AssertionFailedError expected:<1...
  org.joda.time.TestYearMonthDay_Basics#testGetValue AssertionFailedError expect...
  org.joda.time.TestYearMonthDay_Basics#testGetValues AssertionFailedError expec...
  org.joda.time.TestYearMonthDay_Constructors#testConstructor AssertionFailedError
  org.joda.time.TestYearMonthDay_Constructors#testConstructor_Chronology AssertionFailedError
  org.joda.time.TestYearMonthDay_Constructors#testConstructor_DateTimeZone AssertionFailedError
  org.joda.time.TestYearMonthDay_Constructors#testConstructor_Object AssertionFailedError
  org.joda.time.TestYearMonthDay_Constructors#testConstructor_ObjectString1 AssertionFailedError
  org.joda.time.TestYearMonthDay_Constructors#testConstructor_ObjectString2 AssertionFailedError
  org.joda.time.TestYearMonthDay_Constructors#testConstructor_ObjectString3 AssertionFailedError
  org.joda.time.TestYearMonthDay_Constructors#testConstructor_ObjectString4 AssertionFailedError
  org.joda.time.TestYearMonthDay_Constructors#testConstructor_ObjectString5 AssertionFailedError
  org.joda.time.TestYearMonthDay_Constructors#testConstructor_Object_Chronology AssertionFailedError
  org.joda.time.TestYearMonthDay_Constructors#testConstructor_Object_nullChronology AssertionFailedError
  org.joda.time.TestYearMonthDay_Constructors#testConstructor_long1 AssertionFailedError
  org.joda.time.TestYearMonthDay_Constructors#testConstructor_long1_Chronology AssertionFailedError
  org.joda.time.TestYearMonthDay_Constructors#testConstructor_long2 AssertionFailedError
  org.joda.time.TestYearMonthDay_Constructors#testConstructor_long2_Chronology AssertionFailedError
  org.joda.time.TestYearMonthDay_Constructors#testConstructor_long_nullChronology AssertionFailedError
  org.joda.time.TestYearMonthDay_Constructors#testConstructor_nullChronology AssertionFailedError
  org.joda.time.TestYearMonthDay_Constructors#testConstructor_nullDateTimeZone AssertionFailedError
  org.joda.time.TestYearMonthDay_Constructors#testConstructor_nullObject AssertionFailedError
  org.joda.time.TestYearMonthDay_Constructors#testConstructor_nullObject_Chronology AssertionFailedError
  org.joda.time.TestYearMonthDay_Constructors#testConstructor_nullObject_nullChronology AssertionFailedError
  org.joda.time.TestYearMonthDay_Properties#testPropertyAddMonth AssertionFailedError
  org.joda.time.TestYearMonthDay_Properties#testPropertyCompareToDay AssertionFailedError
  org.joda.time.TestYearMonthDay_Properties#testPropertyCompareToMonth AssertionFailedError
  org.joda.time.TestYearMonthDay_Properties#testPropertyCompareToYear AssertionFailedError
  org.joda.time.TestYearMonth_Basics#testGet AssertionFailedError expected:<1970...
  org.joda.time.TestYearMonth_Basics#testGetValue AssertionFailedError expected:...
  org.joda.time.TestYearMonth_Basics#testGetValues AssertionFailedError expected...
  org.joda.time.TestYearMonth_Constructors#testConstructor AssertionFailedError ...
  org.joda.time.TestYearMonth_Constructors#testConstructor_Chronology AssertionFailedError
  org.joda.time.TestYearMonth_Constructors#testConstructor_DateTimeZone AssertionFailedError
  org.joda.time.TestYearMonth_Constructors#testConstructor_Object AssertionFailedError
  org.joda.time.TestYearMonth_Constructors#testConstructor_ObjectString1 AssertionFailedError
  org.joda.time.TestYearMonth_Constructors#testConstructor_ObjectString5 AssertionFailedError
  org.joda.time.TestYearMonth_Constructors#testConstructor_Object_Chronology AssertionFailedError
  org.joda.time.TestYearMonth_Constructors#testConstructor_Object_nullChronology AssertionFailedError
  org.joda.time.TestYearMonth_Constructors#testConstructor_long1 AssertionFailedError
  org.joda.time.TestYearMonth_Constructors#testConstructor_long1_Chronology AssertionFailedError
  org.joda.time.TestYearMonth_Constructors#testConstructor_long2 AssertionFailedError
  org.joda.time.TestYearMonth_Constructors#testConstructor_long2_Chronology AssertionFailedError
  org.joda.time.TestYearMonth_Constructors#testConstructor_long_nullChronology AssertionFailedError
  org.joda.time.TestYearMonth_Constructors#testConstructor_nullChronology AssertionFailedError
  org.joda.time.TestYearMonth_Constructors#testConstructor_nullDateTimeZone AssertionFailedError
  org.joda.time.TestYearMonth_Constructors#testConstructor_nullObject AssertionFailedError
  org.joda.time.TestYearMonth_Constructors#testConstructor_nullObject_Chronology AssertionFailedError
  org.joda.time.TestYearMonth_Constructors#testConstructor_nullObject_nullChronology AssertionFailedError
  org.joda.time.TestYearMonth_Properties#testPropertyAddMonth AssertionFailedError
  org.joda.time.TestYearMonth_Properties#testPropertyCompareToMonth AssertionFailedError
  org.joda.time.TestYearMonth_Properties#testPropertyCompareToYear AssertionFailedError
  org.joda.time.chrono.TestGJChronology#testPartialGetAsText ComparisonFailure e...
  org.joda.time.chrono.TestISOChronology#testCutoverAddYears AssertionFailedError
  org.joda.time.convert.TestNullConverter#testGetPartialValues AssertionFailedError
  org.joda.time.convert.TestStringConverter#testGetPartialValues AssertionFailedError
  org.joda.time.format.TestDateTimeFormatter#testPrint_bufferMethods ComparisonFailure
  org.joda.time.format.TestDateTimeFormatter#testPrint_writerMethods ComparisonFailure
Tests in error: 
  org.joda.time.TestLocalDateTime_Constructors#testConstructor_Object1 IllegalFieldValueException
  org.joda.time.TestLocalDateTime_Constructors#testConstructor_ObjectString1 IllegalFieldValueException
  org.joda.time.TestLocalDateTime_Constructors#testConstructor_ObjectString2 IllegalFieldValueException
  org.joda.time.TestLocalDateTime_Constructors#testConstructor_ObjectString3 IllegalFieldValueException
  org.joda.time.TestLocalDateTime_Constructors#testConstructor_ObjectString4 IllegalFieldValueException
  org.joda.time.TestLocalDateTime_Constructors#testConstructor_Object_Chronology IllegalFieldValueException
  org.joda.time.TestLocalDateTime_Constructors#testConstructor_Object_ChronologyMoscow IllegalFieldValueException
  org.joda.time.TestLocalDateTime_Constructors#testConstructor_Object_ChronologyMoscowBadDateTime IllegalFieldValueException
  org.joda.time.TestLocalDateTime_Constructors#testConstructor_Object_DateTimeZone IllegalFieldValueException
  org.joda.time.TestLocalDateTime_Constructors#testConstructor_Object_DateTimeZoneMoscow IllegalFieldValueException
  org.joda.time.TestLocalDateTime_Constructors#testConstructor_Object_DateTimeZoneMoscowBadDateTime IllegalFieldValueException
  org.joda.time.TestLocalDateTime_Constructors#testConstructor_Object_nullChronology IllegalFieldValueException
  org.joda.time.TestLocalDateTime_Constructors#testConstructor_Object_nullDateTimeZone IllegalFieldValueException
  org.joda.time.TestLocalDateTime_Constructors#testConstructor_nullObject IllegalFieldValueException
  org.joda.time.TestLocalDateTime_Constructors#testConstructor_nullObject_Chronology IllegalFieldValueException
  org.joda.time.TestLocalDateTime_Constructors#testConstructor_nullObject_DateTimeZone IllegalFieldValueException
  org.joda.time.TestLocalDateTime_Constructors#testConstructor_nullObject_nullChronology IllegalFieldValueException
  org.joda.time.TestLocalDateTime_Constructors#testConstructor_nullObject_nullDateTimeZone IllegalFieldValueException
  org.joda.time.TestLocalDate_Constructors#testConstructor_Object1 IllegalFieldValueException
  org.joda.time.TestLocalDate_Constructors#testConstructor_ObjectString1 IllegalFieldValueException
  org.joda.time.TestLocalDate_Constructors#testConstructor_ObjectString2 IllegalFieldValueException
  org.joda.time.TestLocalDate_Constructors#testConstructor_ObjectString3 IllegalFieldValueException
  org.joda.time.TestLocalDate_Constructors#testConstructor_Object_Chronology IllegalFieldValueException
  org.joda.time.TestLocalDate_Constructors#testConstructor_Object_DateTimeZone IllegalFieldValueException
  org.joda.time.TestLocalDate_Constructors#testConstructor_Object_nullChronology IllegalFieldValueException
  org.joda.time.TestLocalDate_Constructors#testConstructor_Object_nullDateTimeZone IllegalFieldValueException
  org.joda.time.TestLocalDate_Constructors#testConstructor_nullObject IllegalFieldValueException
  org.joda.time.TestLocalDate_Constructors#testConstructor_nullObject_Chronology IllegalFieldValueException
  org.joda.time.TestLocalDate_Constructors#testConstructor_nullObject_DateTimeZone IllegalFieldValueException
  org.joda.time.TestLocalDate_Constructors#testConstructor_nullObject_nullChronology IllegalFieldValueException
  org.joda.time.TestLocalDate_Constructors#testConstructor_nullObject_nullDateTimeZone IllegalFieldValueException
  org.joda.time.TestYearMonthDay_Properties#testPropertyAddDay ArrayIndexOutOfBoundsException
  org.joda.time.chrono.TestGJChronology#testCutoverAddDays IllegalFieldValueException
  org.joda.time.chrono.TestGJChronology#testCutoverAddMonths IllegalFieldValueException
  org.joda.time.chrono.TestGJChronology#testCutoverAddYears IllegalFieldValueException
  org.joda.time.chrono.TestGJChronology#testMaximumValue IllegalFieldValueException
  org.joda.time.chrono.TestGJChronology#testSubtractDays IllegalFieldValueException
  org.joda.time.chrono.TestGJChronology#testYearEndAddDays IllegalFieldValueException
  org.joda.time.chrono.TestISOChronology#testAddMonths IllegalFieldValueException
  org.joda.time.chrono.TestISOChronology#testMaximumValue ArrayIndexOutOfBoundsException

Tests run: 4157, Failures: 136, Errors: 40, Skipped: 0

[INFO] ------------------------------------------------------------------------
[INFO] BUILD FAILURE
[INFO] ------------------------------------------------------------------------
[INFO] Total time: 17.775s
[INFO] Finished at: Wed Aug 05 21:52:46 BST 2015
[INFO] Final Memory: 9M/213M
[INFO] ------------------------------------------------------------------------
[ERROR] Failed to execute goal org.apache.maven.plugins:maven-surefire-plugin:2.18.1:test (default-test) on project joda-time: There are test failures.
[ERROR] 
[ERROR] Please refer to /home/perham/Study/LittleDarwin/Cases/joda-time-2.8.1/target/surefire-reports for the individual test results.
[ERROR] -> [Help 1]
[ERROR] 
[ERROR] To see the full stack trace of the errors, re-run Maven with the -e switch.
[ERROR] Re-run Maven using the -X switch to enable full debug logging.
[ERROR] 
[ERROR] For more information about the errors and possible solutions, please read the following articles:
[ERROR] [Help 1] http://cwiki.apache.org/confluence/display/MAVEN/MojoFailureException
