[INFO] Scanning for projects...
[INFO]                                                                         
[INFO] ------------------------------------------------------------------------
[INFO] Building Joda-Time 2.8.1
[INFO] ------------------------------------------------------------------------
[INFO] 
[INFO] --- maven-resources-plugin:2.7:resources (default-resources) @ joda-time ---
[INFO] Using 'UTF-8' encoding to copy filtered resources.
[INFO] Copying 2 resources to META-INF
[INFO] Copying 10 resources
[INFO] 
[INFO] --- maven-compiler-plugin:3.3:compile (default-compile) @ joda-time ---
[INFO] Changes detected - recompiling the module!
[INFO] Compiling 166 source files to /home/perham/Study/LittleDarwin/Cases/joda-time-2.8.1/target/classes
[INFO] 
[INFO] --- exec-maven-plugin:1.4.0:java (compile-tzdb) @ joda-time ---
Writing zoneinfo files
Writing ZoneInfoMap
[INFO] 
[INFO] --- maven-resources-plugin:2.7:testResources (default-testResources) @ joda-time ---
[INFO] Using 'UTF-8' encoding to copy filtered resources.
[INFO] Copying 34 resources
[INFO] 
[INFO] --- maven-compiler-plugin:3.3:testCompile (default-testCompile) @ joda-time ---
[INFO] Nothing to compile - all classes are up to date
[INFO] 
[INFO] --- maven-surefire-plugin:2.18.1:test (default-test) @ joda-time ---
[INFO] Surefire report directory: /home/perham/Study/LittleDarwin/Cases/joda-time-2.8.1/target/surefire-reports

-------------------------------------------------------
 T E S T S
-------------------------------------------------------
Running org.joda.time.TestAllPackages

TestBuddhistChronology.testCalendar

TestCopticChronology.testCalendar

TestEthiopicChronology.testCalendar

TestIslamicChronology.testCalendar

Testing Gregorian chronology over 1000 iterations
100% complete (i=1000)

Testing Julian chronology over 1000 iterations
100% complete (i=1000)
Writing zoneinfo files
Writing ZoneInfoMap
Tests run: 4157, Failures: 0, Errors: 64, Skipped: 0, Time elapsed: 5.532 sec <<< FAILURE! - in org.joda.time.TestAllPackages
testWithDurationAdded_RP_int(org.joda.time.TestDateTime_Basics)  Time elapsed: 0.005 sec  <<< ERROR!
java.lang.ArrayIndexOutOfBoundsException: -1
	at org.joda.time.base.BasePeriod.getValue(BasePeriod.java:329)
	at org.joda.time.chrono.BaseChronology.add(BaseChronology.java:86)
	at org.joda.time.DateTime.withPeriodAdded(DateTime.java:941)
	at org.joda.time.TestDateTime_Basics.testWithDurationAdded_RP_int(TestDateTime_Basics.java:1018)

testPlus_RP(org.joda.time.TestDateTime_Basics)  Time elapsed: 0 sec  <<< ERROR!
java.lang.ArrayIndexOutOfBoundsException: -1
	at org.joda.time.base.BasePeriod.getValue(BasePeriod.java:329)
	at org.joda.time.chrono.BaseChronology.add(BaseChronology.java:86)
	at org.joda.time.DateTime.withPeriodAdded(DateTime.java:941)
	at org.joda.time.DateTime.plus(DateTime.java:997)
	at org.joda.time.TestDateTime_Basics.testPlus_RP(TestDateTime_Basics.java:1057)

testMinus_RP(org.joda.time.TestDateTime_Basics)  Time elapsed: 0 sec  <<< ERROR!
java.lang.ArrayIndexOutOfBoundsException: -1
	at org.joda.time.base.BasePeriod.getValue(BasePeriod.java:329)
	at org.joda.time.chrono.BaseChronology.add(BaseChronology.java:86)
	at org.joda.time.DateTime.withPeriodAdded(DateTime.java:941)
	at org.joda.time.DateTime.minus(DateTime.java:1286)
	at org.joda.time.TestDateTime_Basics.testMinus_RP(TestDateTime_Basics.java:1165)

testAdd_RP_int1(org.joda.time.TestMutableDateTime_Adds)  Time elapsed: 0.001 sec  <<< ERROR!
java.lang.ArrayIndexOutOfBoundsException: -1
	at org.joda.time.base.BasePeriod.getValue(BasePeriod.java:329)
	at org.joda.time.chrono.BaseChronology.add(BaseChronology.java:86)
	at org.joda.time.MutableDateTime.add(MutableDateTime.java:549)
	at org.joda.time.TestMutableDateTime_Adds.testAdd_RP_int1(TestMutableDateTime_Adds.java:158)

testAdd_RP1(org.joda.time.TestMutableDateTime_Adds)  Time elapsed: 0 sec  <<< ERROR!
java.lang.ArrayIndexOutOfBoundsException: -1
	at org.joda.time.base.BasePeriod.getValue(BasePeriod.java:329)
	at org.joda.time.chrono.BaseChronology.add(BaseChronology.java:86)
	at org.joda.time.MutableDateTime.add(MutableDateTime.java:549)
	at org.joda.time.MutableDateTime.add(MutableDateTime.java:535)
	at org.joda.time.TestMutableDateTime_Adds.testAdd_RP1(TestMutableDateTime_Adds.java:144)

testWithDurationAdded_RP_int(org.joda.time.TestDateMidnight_Basics)  Time elapsed: 0.001 sec  <<< ERROR!
java.lang.ArrayIndexOutOfBoundsException: -1
	at org.joda.time.base.BasePeriod.getValue(BasePeriod.java:329)
	at org.joda.time.chrono.BaseChronology.add(BaseChronology.java:86)
	at org.joda.time.DateMidnight.withPeriodAdded(DateMidnight.java:556)
	at org.joda.time.TestDateMidnight_Basics.testWithDurationAdded_RP_int(TestDateMidnight_Basics.java:831)

testPlus_RP(org.joda.time.TestDateMidnight_Basics)  Time elapsed: 0 sec  <<< ERROR!
java.lang.ArrayIndexOutOfBoundsException: -1
	at org.joda.time.base.BasePeriod.getValue(BasePeriod.java:329)
	at org.joda.time.chrono.BaseChronology.add(BaseChronology.java:86)
	at org.joda.time.DateMidnight.withPeriodAdded(DateMidnight.java:556)
	at org.joda.time.DateMidnight.plus(DateMidnight.java:601)
	at org.joda.time.TestDateMidnight_Basics.testPlus_RP(TestDateMidnight_Basics.java:870)

testMinus_RP(org.joda.time.TestDateMidnight_Basics)  Time elapsed: 0.001 sec  <<< ERROR!
java.lang.ArrayIndexOutOfBoundsException: -1
	at org.joda.time.base.BasePeriod.getValue(BasePeriod.java:329)
	at org.joda.time.chrono.BaseChronology.add(BaseChronology.java:86)
	at org.joda.time.DateMidnight.withPeriodAdded(DateMidnight.java:556)
	at org.joda.time.DateMidnight.minus(DateMidnight.java:742)
	at org.joda.time.TestDateMidnight_Basics.testMinus_RP(TestDateMidnight_Basics.java:938)

testToInterval(org.joda.time.TestDateMidnight_Basics)  Time elapsed: 0.001 sec  <<< ERROR!
java.lang.ArrayIndexOutOfBoundsException: -1
	at org.joda.time.base.BasePeriod.getValue(BasePeriod.java:329)
	at org.joda.time.chrono.BaseChronology.add(BaseChronology.java:86)
	at org.joda.time.DateMidnight.withPeriodAdded(DateMidnight.java:556)
	at org.joda.time.DateMidnight.plus(DateMidnight.java:601)
	at org.joda.time.TestDateMidnight_Basics.testToInterval(TestDateMidnight_Basics.java:656)

testParse_noFormatter(org.joda.time.TestInterval_Constructors)  Time elapsed: 0.002 sec  <<< ERROR!
java.lang.ArrayIndexOutOfBoundsException: -1
	at org.joda.time.base.BasePeriod.getValue(BasePeriod.java:329)
	at org.joda.time.chrono.BaseChronology.add(BaseChronology.java:86)
	at org.joda.time.convert.StringConverter.setInto(StringConverter.java:225)
	at org.joda.time.base.BaseInterval.<init>(BaseInterval.java:200)
	at org.joda.time.Interval.<init>(Interval.java:193)
	at org.joda.time.Interval.parse(Interval.java:69)
	at org.joda.time.TestInterval_Constructors.testParse_noFormatter(TestInterval_Constructors.java:109)

testConstructor_RI_RP1(org.joda.time.TestInterval_Constructors)  Time elapsed: 0 sec  <<< ERROR!
java.lang.ArrayIndexOutOfBoundsException: -1
	at org.joda.time.base.BasePeriod.getValue(BasePeriod.java:329)
	at org.joda.time.chrono.BaseChronology.add(BaseChronology.java:86)
	at org.joda.time.base.BaseInterval.<init>(BaseInterval.java:151)
	at org.joda.time.Interval.<init>(Interval.java:161)
	at org.joda.time.TestInterval_Constructors.testConstructor_RI_RP1(TestInterval_Constructors.java:275)

testConstructor_RI_RP2(org.joda.time.TestInterval_Constructors)  Time elapsed: 0.001 sec  <<< ERROR!
java.lang.ArrayIndexOutOfBoundsException: -1
	at org.joda.time.base.BasePeriod.getValue(BasePeriod.java:329)
	at org.joda.time.chrono.BaseChronology.add(BaseChronology.java:86)
	at org.joda.time.base.BaseInterval.<init>(BaseInterval.java:151)
	at org.joda.time.Interval.<init>(Interval.java:161)
	at org.joda.time.TestInterval_Constructors.testConstructor_RI_RP2(TestInterval_Constructors.java:288)

testConstructor_RI_RP3(org.joda.time.TestInterval_Constructors)  Time elapsed: 0.001 sec  <<< ERROR!
java.lang.ArrayIndexOutOfBoundsException: -1
	at org.joda.time.base.BasePeriod.getValue(BasePeriod.java:329)
	at org.joda.time.chrono.BaseChronology.add(BaseChronology.java:86)
	at org.joda.time.base.BaseInterval.<init>(BaseInterval.java:151)
	at org.joda.time.Interval.<init>(Interval.java:161)
	at org.joda.time.TestInterval_Constructors.testConstructor_RI_RP3(TestInterval_Constructors.java:301)

testConstructor_RI_RP4(org.joda.time.TestInterval_Constructors)  Time elapsed: 0 sec  <<< ERROR!
java.lang.ArrayIndexOutOfBoundsException: -1
	at org.joda.time.base.BasePeriod.getValue(BasePeriod.java:329)
	at org.joda.time.chrono.BaseChronology.add(BaseChronology.java:86)
	at org.joda.time.base.BaseInterval.<init>(BaseInterval.java:151)
	at org.joda.time.Interval.<init>(Interval.java:161)
	at org.joda.time.TestInterval_Constructors.testConstructor_RI_RP4(TestInterval_Constructors.java:313)

testConstructor_RI_RP7(org.joda.time.TestInterval_Constructors)  Time elapsed: 0.001 sec  <<< ERROR!
java.lang.ArrayIndexOutOfBoundsException: -1
	at org.joda.time.base.BasePeriod.getValue(BasePeriod.java:329)
	at org.joda.time.chrono.BaseChronology.add(BaseChronology.java:86)
	at org.joda.time.base.BaseInterval.<init>(BaseInterval.java:151)
	at org.joda.time.Interval.<init>(Interval.java:161)
	at org.joda.time.TestInterval_Constructors.testConstructor_RI_RP7(TestInterval_Constructors.java:337)

testConstructor_RI_RP8(org.joda.time.TestInterval_Constructors)  Time elapsed: 0 sec  <<< ERROR!
java.lang.ArrayIndexOutOfBoundsException: -1
	at org.joda.time.base.BasePeriod.getValue(BasePeriod.java:329)
	at org.joda.time.chrono.BaseChronology.add(BaseChronology.java:86)
	at org.joda.time.base.BaseInterval.<init>(BaseInterval.java:151)
	at org.joda.time.Interval.<init>(Interval.java:161)
	at org.joda.time.TestInterval_Constructors.testConstructor_RI_RP8(TestInterval_Constructors.java:346)

testConstructor_RP_RI1(org.joda.time.TestInterval_Constructors)  Time elapsed: 0.001 sec  <<< ERROR!
java.lang.ArrayIndexOutOfBoundsException: -1
	at org.joda.time.base.BasePeriod.getValue(BasePeriod.java:329)
	at org.joda.time.chrono.BaseChronology.add(BaseChronology.java:86)
	at org.joda.time.base.BaseInterval.<init>(BaseInterval.java:175)
	at org.joda.time.Interval.<init>(Interval.java:176)
	at org.joda.time.TestInterval_Constructors.testConstructor_RP_RI1(TestInterval_Constructors.java:359)

testConstructor_RP_RI2(org.joda.time.TestInterval_Constructors)  Time elapsed: 0.001 sec  <<< ERROR!
java.lang.ArrayIndexOutOfBoundsException: -1
	at org.joda.time.base.BasePeriod.getValue(BasePeriod.java:329)
	at org.joda.time.chrono.BaseChronology.add(BaseChronology.java:86)
	at org.joda.time.base.BaseInterval.<init>(BaseInterval.java:175)
	at org.joda.time.Interval.<init>(Interval.java:176)
	at org.joda.time.TestInterval_Constructors.testConstructor_RP_RI2(TestInterval_Constructors.java:372)

testConstructor_RP_RI3(org.joda.time.TestInterval_Constructors)  Time elapsed: 0 sec  <<< ERROR!
java.lang.ArrayIndexOutOfBoundsException: -1
	at org.joda.time.base.BasePeriod.getValue(BasePeriod.java:329)
	at org.joda.time.chrono.BaseChronology.add(BaseChronology.java:86)
	at org.joda.time.base.BaseInterval.<init>(BaseInterval.java:175)
	at org.joda.time.Interval.<init>(Interval.java:176)
	at org.joda.time.TestInterval_Constructors.testConstructor_RP_RI3(TestInterval_Constructors.java:385)

testConstructor_RP_RI4(org.joda.time.TestInterval_Constructors)  Time elapsed: 0.001 sec  <<< ERROR!
java.lang.ArrayIndexOutOfBoundsException: -1
	at org.joda.time.base.BasePeriod.getValue(BasePeriod.java:329)
	at org.joda.time.chrono.BaseChronology.add(BaseChronology.java:86)
	at org.joda.time.base.BaseInterval.<init>(BaseInterval.java:175)
	at org.joda.time.Interval.<init>(Interval.java:176)
	at org.joda.time.TestInterval_Constructors.testConstructor_RP_RI4(TestInterval_Constructors.java:397)

testConstructor_RP_RI7(org.joda.time.TestInterval_Constructors)  Time elapsed: 0 sec  <<< ERROR!
java.lang.ArrayIndexOutOfBoundsException: -1
	at org.joda.time.base.BasePeriod.getValue(BasePeriod.java:329)
	at org.joda.time.chrono.BaseChronology.add(BaseChronology.java:86)
	at org.joda.time.base.BaseInterval.<init>(BaseInterval.java:175)
	at org.joda.time.Interval.<init>(Interval.java:176)
	at org.joda.time.TestInterval_Constructors.testConstructor_RP_RI7(TestInterval_Constructors.java:421)

testConstructor_RP_RI8(org.joda.time.TestInterval_Constructors)  Time elapsed: 0.001 sec  <<< ERROR!
java.lang.ArrayIndexOutOfBoundsException: -1
	at org.joda.time.base.BasePeriod.getValue(BasePeriod.java:329)
	at org.joda.time.chrono.BaseChronology.add(BaseChronology.java:86)
	at org.joda.time.base.BaseInterval.<init>(BaseInterval.java:175)
	at org.joda.time.Interval.<init>(Interval.java:176)
	at org.joda.time.TestInterval_Constructors.testConstructor_RP_RI8(TestInterval_Constructors.java:430)

testWithPeriodAfterStart1(org.joda.time.TestInterval_Basics)  Time elapsed: 0.001 sec  <<< ERROR!
java.lang.ArrayIndexOutOfBoundsException: -1
	at org.joda.time.base.BasePeriod.getValue(BasePeriod.java:329)
	at org.joda.time.chrono.BaseChronology.add(BaseChronology.java:86)
	at org.joda.time.Interval.withPeriodAfterStart(Interval.java:464)
	at org.joda.time.TestInterval_Basics.testWithPeriodAfterStart1(TestInterval_Basics.java:1229)

testWithPeriodAfterStart3(org.joda.time.TestInterval_Basics)  Time elapsed: 0.001 sec  <<< ERROR!
java.lang.ArrayIndexOutOfBoundsException: -1
	at org.joda.time.base.BasePeriod.getValue(BasePeriod.java:329)
	at org.joda.time.chrono.BaseChronology.add(BaseChronology.java:86)
	at org.joda.time.Interval.withPeriodAfterStart(Interval.java:464)
	at org.joda.time.TestInterval_Basics.testWithPeriodAfterStart3(TestInterval_Basics.java:1244)

testWithPeriodBeforeEnd1(org.joda.time.TestInterval_Basics)  Time elapsed: 0 sec  <<< ERROR!
java.lang.ArrayIndexOutOfBoundsException: -1
	at org.joda.time.base.BasePeriod.getValue(BasePeriod.java:329)
	at org.joda.time.chrono.BaseChronology.add(BaseChronology.java:86)
	at org.joda.time.Interval.withPeriodBeforeEnd(Interval.java:481)
	at org.joda.time.TestInterval_Basics.testWithPeriodBeforeEnd1(TestInterval_Basics.java:1255)

testWithPeriodBeforeEnd3(org.joda.time.TestInterval_Basics)  Time elapsed: 0 sec  <<< ERROR!
java.lang.ArrayIndexOutOfBoundsException: -1
	at org.joda.time.base.BasePeriod.getValue(BasePeriod.java:329)
	at org.joda.time.chrono.BaseChronology.add(BaseChronology.java:86)
	at org.joda.time.Interval.withPeriodBeforeEnd(Interval.java:481)
	at org.joda.time.TestInterval_Basics.testWithPeriodBeforeEnd3(TestInterval_Basics.java:1270)

testPlus_RP(org.joda.time.TestLocalDateTime_Basics)  Time elapsed: 0 sec  <<< ERROR!
java.lang.ArrayIndexOutOfBoundsException: -1
	at org.joda.time.base.BasePeriod.getValue(BasePeriod.java:329)
	at org.joda.time.chrono.BaseChronology.add(BaseChronology.java:86)
	at org.joda.time.LocalDateTime.withPeriodAdded(LocalDateTime.java:1062)
	at org.joda.time.LocalDateTime.plus(LocalDateTime.java:1094)
	at org.joda.time.TestLocalDateTime_Basics.testPlus_RP(TestLocalDateTime_Basics.java:535)

testMinus_RP(org.joda.time.TestLocalDateTime_Basics)  Time elapsed: 0 sec  <<< ERROR!
java.lang.ArrayIndexOutOfBoundsException: -1
	at org.joda.time.base.BasePeriod.getValue(BasePeriod.java:329)
	at org.joda.time.chrono.BaseChronology.add(BaseChronology.java:86)
	at org.joda.time.LocalDateTime.withPeriodAdded(LocalDateTime.java:1062)
	at org.joda.time.LocalDateTime.minus(LocalDateTime.java:1311)
	at org.joda.time.TestLocalDateTime_Basics.testMinus_RP(TestLocalDateTime_Basics.java:626)

testToInterval(org.joda.time.TestLocalDate_Basics)  Time elapsed: 0 sec  <<< ERROR!
java.lang.ArrayIndexOutOfBoundsException: -1
	at org.joda.time.base.BasePeriod.getValue(BasePeriod.java:329)
	at org.joda.time.chrono.BaseChronology.add(BaseChronology.java:86)
	at org.joda.time.DateTime.withPeriodAdded(DateTime.java:941)
	at org.joda.time.DateTime.plus(DateTime.java:997)
	at org.joda.time.TestLocalDate_Basics.testToInterval(TestLocalDate_Basics.java:964)

testToInterval_Zone(org.joda.time.TestLocalDate_Basics)  Time elapsed: 0 sec  <<< ERROR!
java.lang.ArrayIndexOutOfBoundsException: -1
	at org.joda.time.base.BasePeriod.getValue(BasePeriod.java:329)
	at org.joda.time.chrono.BaseChronology.add(BaseChronology.java:86)
	at org.joda.time.DateTime.withPeriodAdded(DateTime.java:941)
	at org.joda.time.DateTime.plus(DateTime.java:997)
	at org.joda.time.TestLocalDate_Basics.testToInterval_Zone(TestLocalDate_Basics.java:975)

testToInterval_nullZone(org.joda.time.TestLocalDate_Basics)  Time elapsed: 0.001 sec  <<< ERROR!
java.lang.ArrayIndexOutOfBoundsException: -1
	at org.joda.time.base.BasePeriod.getValue(BasePeriod.java:329)
	at org.joda.time.chrono.BaseChronology.add(BaseChronology.java:86)
	at org.joda.time.DateTime.withPeriodAdded(DateTime.java:941)
	at org.joda.time.DateTime.plus(DateTime.java:997)
	at org.joda.time.TestLocalDate_Basics.testToInterval_nullZone(TestLocalDate_Basics.java:996)

testPlus_RP(org.joda.time.TestLocalTime_Basics)  Time elapsed: 0 sec  <<< ERROR!
java.lang.ArrayIndexOutOfBoundsException: -1
	at org.joda.time.base.BasePeriod.getValue(BasePeriod.java:329)
	at org.joda.time.chrono.BaseChronology.add(BaseChronology.java:86)
	at org.joda.time.LocalTime.withPeriodAdded(LocalTime.java:848)
	at org.joda.time.LocalTime.plus(LocalTime.java:867)
	at org.joda.time.TestLocalTime_Basics.testPlus_RP(TestLocalTime_Basics.java:540)

testMinus_RP(org.joda.time.TestLocalTime_Basics)  Time elapsed: 0 sec  <<< ERROR!
java.lang.ArrayIndexOutOfBoundsException: -1
	at org.joda.time.base.BasePeriod.getValue(BasePeriod.java:329)
	at org.joda.time.chrono.BaseChronology.add(BaseChronology.java:86)
	at org.joda.time.LocalTime.withPeriodAdded(LocalTime.java:848)
	at org.joda.time.LocalTime.minus(LocalTime.java:978)
	at org.joda.time.TestLocalTime_Basics.testMinus_RP(TestLocalTime_Basics.java:591)

testParse_noFormatter(org.joda.time.TestMutableInterval_Constructors)  Time elapsed: 0.003 sec  <<< ERROR!
java.lang.ArrayIndexOutOfBoundsException: -1
	at org.joda.time.base.BasePeriod.getValue(BasePeriod.java:329)
	at org.joda.time.chrono.BaseChronology.add(BaseChronology.java:86)
	at org.joda.time.convert.StringConverter.setInto(StringConverter.java:225)
	at org.joda.time.base.BaseInterval.<init>(BaseInterval.java:197)
	at org.joda.time.MutableInterval.<init>(MutableInterval.java:186)
	at org.joda.time.MutableInterval.parse(MutableInterval.java:71)
	at org.joda.time.TestMutableInterval_Constructors.testParse_noFormatter(TestMutableInterval_Constructors.java:115)

testConstructor_RI_RP1(org.joda.time.TestMutableInterval_Constructors)  Time elapsed: 0 sec  <<< ERROR!
java.lang.ArrayIndexOutOfBoundsException: -1
	at org.joda.time.base.BasePeriod.getValue(BasePeriod.java:329)
	at org.joda.time.chrono.BaseChronology.add(BaseChronology.java:86)
	at org.joda.time.base.BaseInterval.<init>(BaseInterval.java:151)
	at org.joda.time.MutableInterval.<init>(MutableInterval.java:154)
	at org.joda.time.TestMutableInterval_Constructors.testConstructor_RI_RP1(TestMutableInterval_Constructors.java:251)

testConstructor_RI_RP2(org.joda.time.TestMutableInterval_Constructors)  Time elapsed: 0 sec  <<< ERROR!
java.lang.ArrayIndexOutOfBoundsException: -1
	at org.joda.time.base.BasePeriod.getValue(BasePeriod.java:329)
	at org.joda.time.chrono.BaseChronology.add(BaseChronology.java:86)
	at org.joda.time.base.BaseInterval.<init>(BaseInterval.java:151)
	at org.joda.time.MutableInterval.<init>(MutableInterval.java:154)
	at org.joda.time.TestMutableInterval_Constructors.testConstructor_RI_RP2(TestMutableInterval_Constructors.java:264)

testConstructor_RI_RP3(org.joda.time.TestMutableInterval_Constructors)  Time elapsed: 0 sec  <<< ERROR!
java.lang.ArrayIndexOutOfBoundsException: -1
	at org.joda.time.base.BasePeriod.getValue(BasePeriod.java:329)
	at org.joda.time.chrono.BaseChronology.add(BaseChronology.java:86)
	at org.joda.time.base.BaseInterval.<init>(BaseInterval.java:151)
	at org.joda.time.MutableInterval.<init>(MutableInterval.java:154)
	at org.joda.time.TestMutableInterval_Constructors.testConstructor_RI_RP3(TestMutableInterval_Constructors.java:277)

testConstructor_RI_RP4(org.joda.time.TestMutableInterval_Constructors)  Time elapsed: 0.001 sec  <<< ERROR!
java.lang.ArrayIndexOutOfBoundsException: -1
	at org.joda.time.base.BasePeriod.getValue(BasePeriod.java:329)
	at org.joda.time.chrono.BaseChronology.add(BaseChronology.java:86)
	at org.joda.time.base.BaseInterval.<init>(BaseInterval.java:151)
	at org.joda.time.MutableInterval.<init>(MutableInterval.java:154)
	at org.joda.time.TestMutableInterval_Constructors.testConstructor_RI_RP4(TestMutableInterval_Constructors.java:289)

testConstructor_RI_RP7(org.joda.time.TestMutableInterval_Constructors)  Time elapsed: 0.001 sec  <<< ERROR!
java.lang.ArrayIndexOutOfBoundsException: -1
	at org.joda.time.base.BasePeriod.getValue(BasePeriod.java:329)
	at org.joda.time.chrono.BaseChronology.add(BaseChronology.java:86)
	at org.joda.time.base.BaseInterval.<init>(BaseInterval.java:151)
	at org.joda.time.MutableInterval.<init>(MutableInterval.java:154)
	at org.joda.time.TestMutableInterval_Constructors.testConstructor_RI_RP7(TestMutableInterval_Constructors.java:313)

testConstructor_RI_RP8(org.joda.time.TestMutableInterval_Constructors)  Time elapsed: 0 sec  <<< ERROR!
java.lang.ArrayIndexOutOfBoundsException: -1
	at org.joda.time.base.BasePeriod.getValue(BasePeriod.java:329)
	at org.joda.time.chrono.BaseChronology.add(BaseChronology.java:86)
	at org.joda.time.base.BaseInterval.<init>(BaseInterval.java:151)
	at org.joda.time.MutableInterval.<init>(MutableInterval.java:154)
	at org.joda.time.TestMutableInterval_Constructors.testConstructor_RI_RP8(TestMutableInterval_Constructors.java:322)

testConstructor_RP_RI1(org.joda.time.TestMutableInterval_Constructors)  Time elapsed: 0.001 sec  <<< ERROR!
java.lang.ArrayIndexOutOfBoundsException: -1
	at org.joda.time.base.BasePeriod.getValue(BasePeriod.java:329)
	at org.joda.time.chrono.BaseChronology.add(BaseChronology.java:86)
	at org.joda.time.base.BaseInterval.<init>(BaseInterval.java:175)
	at org.joda.time.MutableInterval.<init>(MutableInterval.java:169)
	at org.joda.time.TestMutableInterval_Constructors.testConstructor_RP_RI1(TestMutableInterval_Constructors.java:335)

testConstructor_RP_RI2(org.joda.time.TestMutableInterval_Constructors)  Time elapsed: 0 sec  <<< ERROR!
java.lang.ArrayIndexOutOfBoundsException: -1
	at org.joda.time.base.BasePeriod.getValue(BasePeriod.java:329)
	at org.joda.time.chrono.BaseChronology.add(BaseChronology.java:86)
	at org.joda.time.base.BaseInterval.<init>(BaseInterval.java:175)
	at org.joda.time.MutableInterval.<init>(MutableInterval.java:169)
	at org.joda.time.TestMutableInterval_Constructors.testConstructor_RP_RI2(TestMutableInterval_Constructors.java:348)

testConstructor_RP_RI3(org.joda.time.TestMutableInterval_Constructors)  Time elapsed: 0 sec  <<< ERROR!
java.lang.ArrayIndexOutOfBoundsException: -1
	at org.joda.time.base.BasePeriod.getValue(BasePeriod.java:329)
	at org.joda.time.chrono.BaseChronology.add(BaseChronology.java:86)
	at org.joda.time.base.BaseInterval.<init>(BaseInterval.java:175)
	at org.joda.time.MutableInterval.<init>(MutableInterval.java:169)
	at org.joda.time.TestMutableInterval_Constructors.testConstructor_RP_RI3(TestMutableInterval_Constructors.java:361)

testConstructor_RP_RI4(org.joda.time.TestMutableInterval_Constructors)  Time elapsed: 0 sec  <<< ERROR!
java.lang.ArrayIndexOutOfBoundsException: -1
	at org.joda.time.base.BasePeriod.getValue(BasePeriod.java:329)
	at org.joda.time.chrono.BaseChronology.add(BaseChronology.java:86)
	at org.joda.time.base.BaseInterval.<init>(BaseInterval.java:175)
	at org.joda.time.MutableInterval.<init>(MutableInterval.java:169)
	at org.joda.time.TestMutableInterval_Constructors.testConstructor_RP_RI4(TestMutableInterval_Constructors.java:373)

testConstructor_RP_RI7(org.joda.time.TestMutableInterval_Constructors)  Time elapsed: 0.001 sec  <<< ERROR!
java.lang.ArrayIndexOutOfBoundsException: -1
	at org.joda.time.base.BasePeriod.getValue(BasePeriod.java:329)
	at org.joda.time.chrono.BaseChronology.add(BaseChronology.java:86)
	at org.joda.time.base.BaseInterval.<init>(BaseInterval.java:175)
	at org.joda.time.MutableInterval.<init>(MutableInterval.java:169)
	at org.joda.time.TestMutableInterval_Constructors.testConstructor_RP_RI7(TestMutableInterval_Constructors.java:397)

testConstructor_RP_RI8(org.joda.time.TestMutableInterval_Constructors)  Time elapsed: 0 sec  <<< ERROR!
java.lang.ArrayIndexOutOfBoundsException: -1
	at org.joda.time.base.BasePeriod.getValue(BasePeriod.java:329)
	at org.joda.time.chrono.BaseChronology.add(BaseChronology.java:86)
	at org.joda.time.base.BaseInterval.<init>(BaseInterval.java:175)
	at org.joda.time.MutableInterval.<init>(MutableInterval.java:169)
	at org.joda.time.TestMutableInterval_Constructors.testConstructor_RP_RI8(TestMutableInterval_Constructors.java:406)

testSetPeriodAfterStart_RI1(org.joda.time.TestMutableInterval_Updates)  Time elapsed: 0 sec  <<< ERROR!
java.lang.ArrayIndexOutOfBoundsException: -1
	at org.joda.time.base.BasePeriod.getValue(BasePeriod.java:329)
	at org.joda.time.chrono.BaseChronology.add(BaseChronology.java:86)
	at org.joda.time.MutableInterval.setPeriodAfterStart(MutableInterval.java:371)
	at org.joda.time.TestMutableInterval_Updates.testSetPeriodAfterStart_RI1(TestMutableInterval_Updates.java:355)

testSePeriodAfterStart_RI2(org.joda.time.TestMutableInterval_Updates)  Time elapsed: 0 sec  <<< ERROR!
java.lang.ArrayIndexOutOfBoundsException: -1
	at org.joda.time.base.BasePeriod.getValue(BasePeriod.java:329)
	at org.joda.time.chrono.BaseChronology.add(BaseChronology.java:86)
	at org.joda.time.MutableInterval.setPeriodAfterStart(MutableInterval.java:371)
	at org.joda.time.TestMutableInterval_Updates.testSePeriodAfterStart_RI2(TestMutableInterval_Updates.java:363)

testSetPeriodBeforeEnd_RI1(org.joda.time.TestMutableInterval_Updates)  Time elapsed: 0 sec  <<< ERROR!
java.lang.ArrayIndexOutOfBoundsException: -1
	at org.joda.time.base.BasePeriod.getValue(BasePeriod.java:329)
	at org.joda.time.chrono.BaseChronology.add(BaseChronology.java:86)
	at org.joda.time.MutableInterval.setPeriodBeforeEnd(MutableInterval.java:387)
	at org.joda.time.TestMutableInterval_Updates.testSetPeriodBeforeEnd_RI1(TestMutableInterval_Updates.java:378)

testSePeriodBeforeEnd_RI2(org.joda.time.TestMutableInterval_Updates)  Time elapsed: 0.001 sec  <<< ERROR!
java.lang.ArrayIndexOutOfBoundsException: -1
	at org.joda.time.base.BasePeriod.getValue(BasePeriod.java:329)
	at org.joda.time.chrono.BaseChronology.add(BaseChronology.java:86)
	at org.joda.time.MutableInterval.setPeriodBeforeEnd(MutableInterval.java:387)
	at org.joda.time.TestMutableInterval_Updates.testSePeriodBeforeEnd_RI2(TestMutableInterval_Updates.java:386)

testToDurationFrom(org.joda.time.TestPeriod_Basics)  Time elapsed: 0.001 sec  <<< ERROR!
java.lang.ArrayIndexOutOfBoundsException: -1
	at org.joda.time.base.BasePeriod.getValue(BasePeriod.java:329)
	at org.joda.time.chrono.BaseChronology.add(BaseChronology.java:86)
	at org.joda.time.base.BasePeriod.toDurationFrom(BasePeriod.java:352)
	at org.joda.time.TestPeriod_Basics.testToDurationFrom(TestPeriod_Basics.java:516)

testToDurationTo(org.joda.time.TestPeriod_Basics)  Time elapsed: 0.001 sec  <<< ERROR!
java.lang.ArrayIndexOutOfBoundsException: -1
	at org.joda.time.base.BasePeriod.getValue(BasePeriod.java:329)
	at org.joda.time.chrono.BaseChronology.add(BaseChronology.java:86)
	at org.joda.time.base.BasePeriod.toDurationTo(BasePeriod.java:376)
	at org.joda.time.TestPeriod_Basics.testToDurationTo(TestPeriod_Basics.java:521)

testToDurationFrom(org.joda.time.TestMutablePeriod_Basics)  Time elapsed: 0.001 sec  <<< ERROR!
java.lang.ArrayIndexOutOfBoundsException: -1
	at org.joda.time.base.BasePeriod.getValue(BasePeriod.java:329)
	at org.joda.time.chrono.BaseChronology.add(BaseChronology.java:86)
	at org.joda.time.base.BasePeriod.toDurationFrom(BasePeriod.java:352)
	at org.joda.time.TestMutablePeriod_Basics.testToDurationFrom(TestMutablePeriod_Basics.java:435)

testAddToLocalDate(org.joda.time.TestHours)  Time elapsed: 0 sec  <<< ERROR!
java.lang.IndexOutOfBoundsException: -1
	at org.joda.time.base.BaseSingleFieldPeriod.getValue(BaseSingleFieldPeriod.java:234)
	at org.joda.time.chrono.BaseChronology.add(BaseChronology.java:86)
	at org.joda.time.LocalDateTime.withPeriodAdded(LocalDateTime.java:1062)
	at org.joda.time.LocalDateTime.plus(LocalDateTime.java:1094)
	at org.joda.time.TestHours.testAddToLocalDate(TestHours.java:394)

testAddToLocalDate(org.joda.time.TestMinutes)  Time elapsed: 0.003 sec  <<< ERROR!
java.lang.IndexOutOfBoundsException: -1
	at org.joda.time.base.BaseSingleFieldPeriod.getValue(BaseSingleFieldPeriod.java:234)
	at org.joda.time.chrono.BaseChronology.add(BaseChronology.java:86)
	at org.joda.time.LocalDateTime.withPeriodAdded(LocalDateTime.java:1062)
	at org.joda.time.LocalDateTime.plus(LocalDateTime.java:1094)
	at org.joda.time.TestMinutes.testAddToLocalDate(TestMinutes.java:377)

testAddToLocalDate(org.joda.time.TestSeconds)  Time elapsed: 0 sec  <<< ERROR!
java.lang.IndexOutOfBoundsException: -1
	at org.joda.time.base.BaseSingleFieldPeriod.getValue(BaseSingleFieldPeriod.java:234)
	at org.joda.time.chrono.BaseChronology.add(BaseChronology.java:86)
	at org.joda.time.LocalDateTime.withPeriodAdded(LocalDateTime.java:1062)
	at org.joda.time.LocalDateTime.plus(LocalDateTime.java:1094)
	at org.joda.time.TestSeconds.testAddToLocalDate(TestSeconds.java:367)

testToInterval(org.joda.time.TestYearMonthDay_Basics)  Time elapsed: 0 sec  <<< ERROR!
java.lang.ArrayIndexOutOfBoundsException: -1
	at org.joda.time.base.BasePeriod.getValue(BasePeriod.java:329)
	at org.joda.time.chrono.BaseChronology.add(BaseChronology.java:86)
	at org.joda.time.DateTime.withPeriodAdded(DateTime.java:941)
	at org.joda.time.DateTime.plus(DateTime.java:997)
	at org.joda.time.TestYearMonthDay_Basics.testToInterval(TestYearMonthDay_Basics.java:717)

testToInterval_Zone(org.joda.time.TestYearMonthDay_Basics)  Time elapsed: 0.001 sec  <<< ERROR!
java.lang.ArrayIndexOutOfBoundsException: -1
	at org.joda.time.base.BasePeriod.getValue(BasePeriod.java:329)
	at org.joda.time.chrono.BaseChronology.add(BaseChronology.java:86)
	at org.joda.time.DateTime.withPeriodAdded(DateTime.java:941)
	at org.joda.time.DateTime.plus(DateTime.java:997)
	at org.joda.time.TestYearMonthDay_Basics.testToInterval_Zone(TestYearMonthDay_Basics.java:728)

testToInterval_nullZone(org.joda.time.TestYearMonthDay_Basics)  Time elapsed: 0.001 sec  <<< ERROR!
java.lang.ArrayIndexOutOfBoundsException: -1
	at org.joda.time.base.BasePeriod.getValue(BasePeriod.java:329)
	at org.joda.time.chrono.BaseChronology.add(BaseChronology.java:86)
	at org.joda.time.DateTime.withPeriodAdded(DateTime.java:941)
	at org.joda.time.DateTime.plus(DateTime.java:997)
	at org.joda.time.TestYearMonthDay_Basics.testToInterval_nullZone(TestYearMonthDay_Basics.java:738)

testKeyYears(org.joda.time.chrono.TestBuddhistChronology)  Time elapsed: 0.001 sec  <<< ERROR!
java.lang.ArrayIndexOutOfBoundsException: -1
	at org.joda.time.base.BasePeriod.getValue(BasePeriod.java:329)
	at org.joda.time.chrono.BaseChronology.add(BaseChronology.java:86)
	at org.joda.time.DateTime.withPeriodAdded(DateTime.java:941)
	at org.joda.time.DateTime.plus(DateTime.java:997)
	at org.joda.time.chrono.TestBuddhistChronology.testKeyYears(TestBuddhistChronology.java:315)

testSetIntoInterval_Object_Chronology1(org.joda.time.convert.TestStringConverter)  Time elapsed: 0.001 sec  <<< ERROR!
java.lang.ArrayIndexOutOfBoundsException: -1
	at org.joda.time.base.BasePeriod.getValue(BasePeriod.java:329)
	at org.joda.time.chrono.BaseChronology.add(BaseChronology.java:86)
	at org.joda.time.convert.StringConverter.setInto(StringConverter.java:225)
	at org.joda.time.convert.TestStringConverter.testSetIntoInterval_Object_Chronology1(TestStringConverter.java:476)

testSetIntoInterval_Object_Chronology2(org.joda.time.convert.TestStringConverter)  Time elapsed: 0.001 sec  <<< ERROR!
java.lang.ArrayIndexOutOfBoundsException: -1
	at org.joda.time.base.BasePeriod.getValue(BasePeriod.java:329)
	at org.joda.time.chrono.BaseChronology.add(BaseChronology.java:86)
	at org.joda.time.convert.StringConverter.setInto(StringConverter.java:232)
	at org.joda.time.convert.TestStringConverter.testSetIntoInterval_Object_Chronology2(TestStringConverter.java:484)

testSetIntoInterval_Object_Chronology4(org.joda.time.convert.TestStringConverter)  Time elapsed: 0 sec  <<< ERROR!
java.lang.ArrayIndexOutOfBoundsException: -1
	at org.joda.time.base.BasePeriod.getValue(BasePeriod.java:329)
	at org.joda.time.chrono.BaseChronology.add(BaseChronology.java:86)
	at org.joda.time.convert.StringConverter.setInto(StringConverter.java:225)
	at org.joda.time.convert.TestStringConverter.testSetIntoInterval_Object_Chronology4(TestStringConverter.java:500)

testSetIntoInterval_Object_Chronology5(org.joda.time.convert.TestStringConverter)  Time elapsed: 0 sec  <<< ERROR!
java.lang.ArrayIndexOutOfBoundsException: -1
	at org.joda.time.base.BasePeriod.getValue(BasePeriod.java:329)
	at org.joda.time.chrono.BaseChronology.add(BaseChronology.java:86)
	at org.joda.time.convert.StringConverter.setInto(StringConverter.java:232)
	at org.joda.time.convert.TestStringConverter.testSetIntoInterval_Object_Chronology5(TestStringConverter.java:508)


Results :

Tests in error: 
  org.joda.time.TestDateMidnight_Basics#testMinus_RP ArrayIndexOutOfBoundsException
  org.joda.time.TestDateMidnight_Basics#testPlus_RP ArrayIndexOutOfBoundsException
  org.joda.time.TestDateMidnight_Basics#testToInterval ArrayIndexOutOfBoundsException
  org.joda.time.TestDateMidnight_Basics#testWithDurationAdded_RP_int ArrayIndexOutOfBoundsException
  org.joda.time.TestDateTime_Basics#testMinus_RP ArrayIndexOutOfBoundsException ...
  org.joda.time.TestDateTime_Basics#testPlus_RP ArrayIndexOutOfBoundsException -...
  org.joda.time.TestDateTime_Basics#testWithDurationAdded_RP_int ArrayIndexOutOfBoundsException
  org.joda.time.TestHours#testAddToLocalDate IndexOutOfBoundsException -1
  org.joda.time.TestInterval_Basics#testWithPeriodAfterStart1 ArrayIndexOutOfBoundsException
  org.joda.time.TestInterval_Basics#testWithPeriodAfterStart3 ArrayIndexOutOfBoundsException
  org.joda.time.TestInterval_Basics#testWithPeriodBeforeEnd1 ArrayIndexOutOfBoundsException
  org.joda.time.TestInterval_Basics#testWithPeriodBeforeEnd3 ArrayIndexOutOfBoundsException
  org.joda.time.TestInterval_Constructors#testConstructor_RI_RP1 ArrayIndexOutOfBoundsException
  org.joda.time.TestInterval_Constructors#testConstructor_RI_RP2 ArrayIndexOutOfBoundsException
  org.joda.time.TestInterval_Constructors#testConstructor_RI_RP3 ArrayIndexOutOfBoundsException
  org.joda.time.TestInterval_Constructors#testConstructor_RI_RP4 ArrayIndexOutOfBoundsException
  org.joda.time.TestInterval_Constructors#testConstructor_RI_RP7 ArrayIndexOutOfBoundsException
  org.joda.time.TestInterval_Constructors#testConstructor_RI_RP8 ArrayIndexOutOfBoundsException
  org.joda.time.TestInterval_Constructors#testConstructor_RP_RI1 ArrayIndexOutOfBoundsException
  org.joda.time.TestInterval_Constructors#testConstructor_RP_RI2 ArrayIndexOutOfBoundsException
  org.joda.time.TestInterval_Constructors#testConstructor_RP_RI3 ArrayIndexOutOfBoundsException
  org.joda.time.TestInterval_Constructors#testConstructor_RP_RI4 ArrayIndexOutOfBoundsException
  org.joda.time.TestInterval_Constructors#testConstructor_RP_RI7 ArrayIndexOutOfBoundsException
  org.joda.time.TestInterval_Constructors#testConstructor_RP_RI8 ArrayIndexOutOfBoundsException
  org.joda.time.TestInterval_Constructors#testParse_noFormatter ArrayIndexOutOfBoundsException
  org.joda.time.TestLocalDateTime_Basics#testMinus_RP ArrayIndexOutOfBoundsException
  org.joda.time.TestLocalDateTime_Basics#testPlus_RP ArrayIndexOutOfBoundsException
  org.joda.time.TestLocalDate_Basics#testToInterval ArrayIndexOutOfBoundsException
  org.joda.time.TestLocalDate_Basics#testToInterval_Zone ArrayIndexOutOfBoundsException
  org.joda.time.TestLocalDate_Basics#testToInterval_nullZone ArrayIndexOutOfBoundsException
  org.joda.time.TestLocalTime_Basics#testMinus_RP ArrayIndexOutOfBoundsException
  org.joda.time.TestLocalTime_Basics#testPlus_RP ArrayIndexOutOfBoundsException ...
  org.joda.time.TestMinutes#testAddToLocalDate IndexOutOfBoundsException -1
  org.joda.time.TestMutableDateTime_Adds#testAdd_RP1 ArrayIndexOutOfBoundsException
  org.joda.time.TestMutableDateTime_Adds#testAdd_RP_int1 ArrayIndexOutOfBoundsException
  org.joda.time.TestMutableInterval_Constructors#testConstructor_RI_RP1 ArrayIndexOutOfBoundsException
  org.joda.time.TestMutableInterval_Constructors#testConstructor_RI_RP2 ArrayIndexOutOfBoundsException
  org.joda.time.TestMutableInterval_Constructors#testConstructor_RI_RP3 ArrayIndexOutOfBoundsException
  org.joda.time.TestMutableInterval_Constructors#testConstructor_RI_RP4 ArrayIndexOutOfBoundsException
  org.joda.time.TestMutableInterval_Constructors#testConstructor_RI_RP7 ArrayIndexOutOfBoundsException
  org.joda.time.TestMutableInterval_Constructors#testConstructor_RI_RP8 ArrayIndexOutOfBoundsException
  org.joda.time.TestMutableInterval_Constructors#testConstructor_RP_RI1 ArrayIndexOutOfBoundsException
  org.joda.time.TestMutableInterval_Constructors#testConstructor_RP_RI2 ArrayIndexOutOfBoundsException
  org.joda.time.TestMutableInterval_Constructors#testConstructor_RP_RI3 ArrayIndexOutOfBoundsException
  org.joda.time.TestMutableInterval_Constructors#testConstructor_RP_RI4 ArrayIndexOutOfBoundsException
  org.joda.time.TestMutableInterval_Constructors#testConstructor_RP_RI7 ArrayIndexOutOfBoundsException
  org.joda.time.TestMutableInterval_Constructors#testConstructor_RP_RI8 ArrayIndexOutOfBoundsException
  org.joda.time.TestMutableInterval_Constructors#testParse_noFormatter ArrayIndexOutOfBoundsException
  org.joda.time.TestMutableInterval_Updates#testSePeriodAfterStart_RI2 ArrayIndexOutOfBoundsException
  org.joda.time.TestMutableInterval_Updates#testSePeriodBeforeEnd_RI2 ArrayIndexOutOfBoundsException
  org.joda.time.TestMutableInterval_Updates#testSetPeriodAfterStart_RI1 ArrayIndexOutOfBoundsException
  org.joda.time.TestMutableInterval_Updates#testSetPeriodBeforeEnd_RI1 ArrayIndexOutOfBoundsException
  org.joda.time.TestMutablePeriod_Basics#testToDurationFrom ArrayIndexOutOfBoundsException
  org.joda.time.TestPeriod_Basics#testToDurationFrom ArrayIndexOutOfBoundsException
  org.joda.time.TestPeriod_Basics#testToDurationTo ArrayIndexOutOfBoundsException
  org.joda.time.TestSeconds#testAddToLocalDate IndexOutOfBoundsException -1
  org.joda.time.TestYearMonthDay_Basics#testToInterval ArrayIndexOutOfBoundsException
  org.joda.time.TestYearMonthDay_Basics#testToInterval_Zone ArrayIndexOutOfBoundsException
  org.joda.time.TestYearMonthDay_Basics#testToInterval_nullZone ArrayIndexOutOfBoundsException
  org.joda.time.chrono.TestBuddhistChronology#testKeyYears ArrayIndexOutOfBoundsException
  org.joda.time.convert.TestStringConverter#testSetIntoInterval_Object_Chronology1 ArrayIndexOutOfBoundsException
  org.joda.time.convert.TestStringConverter#testSetIntoInterval_Object_Chronology2 ArrayIndexOutOfBoundsException
  org.joda.time.convert.TestStringConverter#testSetIntoInterval_Object_Chronology4 ArrayIndexOutOfBoundsException
  org.joda.time.convert.TestStringConverter#testSetIntoInterval_Object_Chronology5 ArrayIndexOutOfBoundsException

Tests run: 4157, Failures: 0, Errors: 64, Skipped: 0

[INFO] ------------------------------------------------------------------------
[INFO] BUILD FAILURE
[INFO] ------------------------------------------------------------------------
[INFO] Total time: 17.380s
[INFO] Finished at: Wed Aug 05 21:46:39 BST 2015
[INFO] Final Memory: 9M/213M
[INFO] ------------------------------------------------------------------------
[ERROR] Failed to execute goal org.apache.maven.plugins:maven-surefire-plugin:2.18.1:test (default-test) on project joda-time: There are test failures.
[ERROR] 
[ERROR] Please refer to /home/perham/Study/LittleDarwin/Cases/joda-time-2.8.1/target/surefire-reports for the individual test results.
[ERROR] -> [Help 1]
[ERROR] 
[ERROR] To see the full stack trace of the errors, re-run Maven with the -e switch.
[ERROR] Re-run Maven using the -X switch to enable full debug logging.
[ERROR] 
[ERROR] For more information about the errors and possible solutions, please read the following articles:
[ERROR] [Help 1] http://cwiki.apache.org/confluence/display/MAVEN/MojoFailureException
