[INFO] Scanning for projects...
[INFO]                                                                         
[INFO] ------------------------------------------------------------------------
[INFO] Building Joda-Time 2.8.1
[INFO] ------------------------------------------------------------------------
[INFO] 
[INFO] --- maven-resources-plugin:2.7:resources (default-resources) @ joda-time ---
[INFO] Using 'UTF-8' encoding to copy filtered resources.
[INFO] Copying 2 resources to META-INF
[INFO] Copying 10 resources
[INFO] 
[INFO] --- maven-compiler-plugin:3.3:compile (default-compile) @ joda-time ---
[INFO] Changes detected - recompiling the module!
[INFO] Compiling 166 source files to /home/perham/Study/LittleDarwin/Cases/joda-time-2.8.1/target/classes
[INFO] 
[INFO] --- exec-maven-plugin:1.4.0:java (compile-tzdb) @ joda-time ---
Writing zoneinfo files
Writing ZoneInfoMap
[INFO] 
[INFO] --- maven-resources-plugin:2.7:testResources (default-testResources) @ joda-time ---
[INFO] Using 'UTF-8' encoding to copy filtered resources.
[INFO] Copying 34 resources
[INFO] 
[INFO] --- maven-compiler-plugin:3.3:testCompile (default-testCompile) @ joda-time ---
[INFO] Nothing to compile - all classes are up to date
[INFO] 
[INFO] --- maven-surefire-plugin:2.18.1:test (default-test) @ joda-time ---
[INFO] Surefire report directory: /home/perham/Study/LittleDarwin/Cases/joda-time-2.8.1/target/surefire-reports

-------------------------------------------------------
 T E S T S
-------------------------------------------------------
Running org.joda.time.TestAllPackages

TestBuddhistChronology.testCalendar

TestCopticChronology.testCalendar

TestEthiopicChronology.testCalendar

TestIslamicChronology.testCalendar

Testing Gregorian chronology over 1000 iterations
100% complete (i=1000)

Testing Julian chronology over 1000 iterations
100% complete (i=1000)
Writing zoneinfo files
Writing ZoneInfoMap
Tests run: 4157, Failures: 24, Errors: 8, Skipped: 0, Time elapsed: 5.348 sec <<< FAILURE! - in org.joda.time.TestAllPackages
testToDateTime_Zone_dstGap(org.joda.time.TestLocalDateTime_Basics)  Time elapsed: 0.003 sec  <<< ERROR!
org.joda.time.IllegalFieldValueException: Value 1 for hourOfDay is not supported: Illegal instant due to time zone offset transition (daylight savings time 'gap'): 2014-03-30T01:00:00.000 (Europe/London)
	at org.joda.time.chrono.ZonedChronology$ZonedDateTimeField.set(ZonedChronology.java:486)
	at org.joda.time.chrono.BaseChronology.getDateTimeMillis(BaseChronology.java:135)
	at org.joda.time.chrono.AssembledChronology.getDateTimeMillis(AssembledChronology.java:65)
	at org.joda.time.base.BaseDateTime.<init>(BaseDateTime.java:258)
	at org.joda.time.DateTime.<init>(DateTime.java:532)
	at org.joda.time.LocalDateTime.toDateTime(LocalDateTime.java:750)
	at org.joda.time.TestLocalDateTime_Basics.testToDateTime_Zone_dstGap(TestLocalDateTime_Basics.java:797)
Caused by: org.joda.time.IllegalInstantException: Illegal instant due to time zone offset transition (daylight savings time 'gap'): 2014-03-30T01:00:00.000 (Europe/London)
	at org.joda.time.chrono.ZonedChronology$ZonedDateTimeField.set(ZonedChronology.java:485)
	... 32 more

testToDateTime_Zone_dstOverlap_NewYork(org.joda.time.TestLocalDateTime_Basics)  Time elapsed: 0.001 sec  <<< FAILURE!
junit.framework.AssertionFailedError: expected:<2007-11-04T01:30:00.000-04:00> but was:<2007-11-04T01:30:00.000-05:00>
	at junit.framework.Assert.fail(Assert.java:47)
	at junit.framework.Assert.failNotEquals(Assert.java:280)
	at junit.framework.Assert.assertEquals(Assert.java:64)
	at junit.framework.Assert.assertEquals(Assert.java:71)
	at org.joda.time.TestLocalDateTime_Basics.testToDateTime_Zone_dstOverlap_NewYork(TestLocalDateTime_Basics.java:813)

testToDateTime_LocalTime_Zone_dstGap(org.joda.time.TestLocalDate_Basics)  Time elapsed: 0.001 sec  <<< ERROR!
org.joda.time.IllegalFieldValueException: Value 1 for hourOfDay is not supported: Illegal instant due to time zone offset transition (daylight savings time 'gap'): 2014-03-30T01:00:00.000 (Europe/London)
	at org.joda.time.chrono.ZonedChronology$ZonedDateTimeField.set(ZonedChronology.java:486)
	at org.joda.time.chrono.BaseChronology.getDateTimeMillis(BaseChronology.java:135)
	at org.joda.time.chrono.AssembledChronology.getDateTimeMillis(AssembledChronology.java:65)
	at org.joda.time.base.BaseDateTime.<init>(BaseDateTime.java:258)
	at org.joda.time.DateTime.<init>(DateTime.java:532)
	at org.joda.time.LocalDate.toDateTime(LocalDate.java:958)
	at org.joda.time.TestLocalDate_Basics.testToDateTime_LocalTime_Zone_dstGap(TestLocalDate_Basics.java:870)
Caused by: org.joda.time.IllegalInstantException: Illegal instant due to time zone offset transition (daylight savings time 'gap'): 2014-03-30T01:00:00.000 (Europe/London)
	at org.joda.time.chrono.ZonedChronology$ZonedDateTimeField.set(ZonedChronology.java:485)
	... 32 more

testToDateTime_LocalTime_Zone_dstOverlap_NewYork(org.joda.time.TestLocalDate_Basics)  Time elapsed: 0.001 sec  <<< FAILURE!
junit.framework.AssertionFailedError: expected:<2007-11-04T01:30:00.000-04:00> but was:<2007-11-04T01:30:00.000-05:00>
	at junit.framework.Assert.fail(Assert.java:47)
	at junit.framework.Assert.failNotEquals(Assert.java:280)
	at junit.framework.Assert.assertEquals(Assert.java:64)
	at junit.framework.Assert.assertEquals(Assert.java:71)
	at org.joda.time.TestLocalDate_Basics.testToDateTime_LocalTime_Zone_dstOverlap_NewYork(TestLocalDate_Basics.java:888)

testIsLocalDateTimeGap_Berlin(org.joda.time.TestDateTimeZone)  Time elapsed: 0.001 sec  <<< ERROR!
org.joda.time.IllegalFieldValueException: Value 2 for hourOfDay is not supported: Illegal instant due to time zone offset transition (daylight savings time 'gap'): 2007-03-25T02:00:00.000 (Europe/Berlin)
	at org.joda.time.chrono.ZonedChronology$ZonedDateTimeField.set(ZonedChronology.java:486)
	at org.joda.time.chrono.BaseChronology.getDateTimeMillis(BaseChronology.java:135)
	at org.joda.time.chrono.AssembledChronology.getDateTimeMillis(AssembledChronology.java:65)
	at org.joda.time.base.BaseDateTime.<init>(BaseDateTime.java:258)
	at org.joda.time.DateTime.<init>(DateTime.java:532)
	at org.joda.time.LocalDateTime.toDateTime(LocalDateTime.java:750)
	at org.joda.time.DateTimeZone.isLocalDateTimeGap(DateTimeZone.java:1148)
	at org.joda.time.TestDateTimeZone.testIsLocalDateTimeGap_Berlin(TestDateTimeZone.java:934)
Caused by: org.joda.time.IllegalInstantException: Illegal instant due to time zone offset transition (daylight savings time 'gap'): 2007-03-25T02:00:00.000 (Europe/Berlin)
	at org.joda.time.chrono.ZonedChronology$ZonedDateTimeField.set(ZonedChronology.java:485)
	... 33 more

testIsLocalDateTimeGap_NewYork(org.joda.time.TestDateTimeZone)  Time elapsed: 0.003 sec  <<< ERROR!
org.joda.time.IllegalFieldValueException: Value 2 for hourOfDay is not supported: Illegal instant due to time zone offset transition (daylight savings time 'gap'): 2007-03-11T02:00:00.000 (America/New_York)
	at org.joda.time.chrono.ZonedChronology$ZonedDateTimeField.set(ZonedChronology.java:486)
	at org.joda.time.chrono.BaseChronology.getDateTimeMillis(BaseChronology.java:135)
	at org.joda.time.chrono.AssembledChronology.getDateTimeMillis(AssembledChronology.java:65)
	at org.joda.time.base.BaseDateTime.<init>(BaseDateTime.java:258)
	at org.joda.time.DateTime.<init>(DateTime.java:532)
	at org.joda.time.LocalDateTime.toDateTime(LocalDateTime.java:750)
	at org.joda.time.DateTimeZone.isLocalDateTimeGap(DateTimeZone.java:1148)
	at org.joda.time.TestDateTimeZone.testIsLocalDateTimeGap_NewYork(TestDateTimeZone.java:951)
Caused by: org.joda.time.IllegalInstantException: Illegal instant due to time zone offset transition (daylight savings time 'gap'): 2007-03-11T02:00:00.000 (America/New_York)
	at org.joda.time.chrono.ZonedChronology$ZonedDateTimeField.set(ZonedChronology.java:485)
	... 33 more

test_DateTime_roundCeiling_hourOfDay_NewYork_Autumn_preCutover(org.joda.time.TestDateTimeZoneCutover)  Time elapsed: 0.002 sec  <<< FAILURE!
junit.framework.ComparisonFailure: expected:<...11-04T01:30:00.000-0[4]:00> but was:<...11-04T01:30:00.000-0[5]:00>
	at junit.framework.Assert.assertEquals(Assert.java:81)
	at junit.framework.Assert.assertEquals(Assert.java:87)
	at org.joda.time.TestDateTimeZoneCutover.test_DateTime_roundCeiling_hourOfDay_NewYork_Autumn_preCutover(TestDateTimeZoneCutover.java:770)

test_DateTime_roundCeiling_hourOfDay_NewYork_Autumn_postCutover(org.joda.time.TestDateTimeZoneCutover)  Time elapsed: 0 sec  <<< FAILURE!
junit.framework.ComparisonFailure: expected:<2007-11-04T0[1]:30:00.000-05:00> but was:<2007-11-04T0[2]:30:00.000-05:00>
	at junit.framework.Assert.assertEquals(Assert.java:81)
	at junit.framework.Assert.assertEquals(Assert.java:87)
	at org.joda.time.TestDateTimeZoneCutover.test_DateTime_roundCeiling_hourOfDay_NewYork_Autumn_postCutover(TestDateTimeZoneCutover.java:777)

test_DateTime_roundCeiling_minuteOfHour_NewYork_Autumn_preCutover(org.joda.time.TestDateTimeZoneCutover)  Time elapsed: 0 sec  <<< FAILURE!
junit.framework.ComparisonFailure: expected:<...11-04T01:30:40.000-0[4]:00> but was:<...11-04T01:30:40.000-0[5]:00>
	at junit.framework.Assert.assertEquals(Assert.java:81)
	at junit.framework.Assert.assertEquals(Assert.java:87)
	at org.joda.time.TestDateTimeZoneCutover.test_DateTime_roundCeiling_minuteOfHour_NewYork_Autumn_preCutover(TestDateTimeZoneCutover.java:784)

test_DateTime_roundCeiling_minuteOfHour_NewYork_Autumn_postCutover(org.joda.time.TestDateTimeZoneCutover)  Time elapsed: 0.001 sec  <<< FAILURE!
junit.framework.ComparisonFailure: expected:<2007-11-04T0[1]:30:40.000-05:00> but was:<2007-11-04T0[2]:30:40.000-05:00>
	at junit.framework.Assert.assertEquals(Assert.java:81)
	at junit.framework.Assert.assertEquals(Assert.java:87)
	at org.joda.time.TestDateTimeZoneCutover.test_DateTime_roundCeiling_minuteOfHour_NewYork_Autumn_postCutover(TestDateTimeZoneCutover.java:791)

test_DateTime_roundCeiling_secondOfMinute_NewYork_Autumn_preCutover(org.joda.time.TestDateTimeZoneCutover)  Time elapsed: 0 sec  <<< FAILURE!
junit.framework.ComparisonFailure: expected:<...11-04T01:30:40.500-0[4]:00> but was:<...11-04T01:30:40.500-0[5]:00>
	at junit.framework.Assert.assertEquals(Assert.java:81)
	at junit.framework.Assert.assertEquals(Assert.java:87)
	at org.joda.time.TestDateTimeZoneCutover.test_DateTime_roundCeiling_secondOfMinute_NewYork_Autumn_preCutover(TestDateTimeZoneCutover.java:798)

test_DateTime_roundCeiling_secondOfMinute_NewYork_Autumn_postCutover(org.joda.time.TestDateTimeZoneCutover)  Time elapsed: 0.001 sec  <<< FAILURE!
junit.framework.ComparisonFailure: expected:<2007-11-04T0[1]:30:40.500-05:00> but was:<2007-11-04T0[2]:30:40.500-05:00>
	at junit.framework.Assert.assertEquals(Assert.java:81)
	at junit.framework.Assert.assertEquals(Assert.java:87)
	at org.joda.time.TestDateTimeZoneCutover.test_DateTime_roundCeiling_secondOfMinute_NewYork_Autumn_postCutover(TestDateTimeZoneCutover.java:805)

test_DateTime_constructor_Moscow_Autumn(org.joda.time.TestDateTimeZoneCutover)  Time elapsed: 0.001 sec  <<< FAILURE!
junit.framework.ComparisonFailure: expected:<...10-28T02:30:00.000+0[4]:00> but was:<...10-28T02:30:00.000+0[3]:00>
	at junit.framework.Assert.assertEquals(Assert.java:81)
	at junit.framework.Assert.assertEquals(Assert.java:87)
	at org.joda.time.TestDateTimeZoneCutover.test_DateTime_constructor_Moscow_Autumn(TestDateTimeZoneCutover.java:923)

testDateTimeCreation_newYork(org.joda.time.TestDateTimeZoneCutover)  Time elapsed: 0.001 sec  <<< FAILURE!
junit.framework.ComparisonFailure: expected:<...11-07T01:15:00.000-0[4]:00> but was:<...11-07T01:15:00.000-0[5]:00>
	at junit.framework.Assert.assertEquals(Assert.java:81)
	at junit.framework.Assert.assertEquals(Assert.java:87)
	at org.joda.time.TestDateTimeZoneCutover.testDateTimeCreation_newYork(TestDateTimeZoneCutover.java:1340)

testDateTimeCreation_losAngeles(org.joda.time.TestDateTimeZoneCutover)  Time elapsed: 0.001 sec  <<< FAILURE!
junit.framework.ComparisonFailure: expected:<...11-07T01:15:00.000-0[7]:00> but was:<...11-07T01:15:00.000-0[8]:00>
	at junit.framework.Assert.assertEquals(Assert.java:81)
	at junit.framework.Assert.assertEquals(Assert.java:87)
	at org.joda.time.TestDateTimeZoneCutover.testDateTimeCreation_losAngeles(TestDateTimeZoneCutover.java:1347)

test_LocalDate_toDateMidnight_Turk(org.joda.time.TestDateTimeZoneCutover)  Time elapsed: 0.001 sec  <<< ERROR!
org.joda.time.IllegalFieldValueException: Value 0 for hourOfDay is not supported: Illegal instant due to time zone offset transition (daylight savings time 'gap'): 2007-04-01T00:00:00.000 (MockZone)
	at org.joda.time.chrono.ZonedChronology$ZonedDateTimeField.set(ZonedChronology.java:486)
	at org.joda.time.chrono.BaseChronology.getDateTimeMillis(BaseChronology.java:135)
	at org.joda.time.chrono.AssembledChronology.getDateTimeMillis(AssembledChronology.java:65)
	at org.joda.time.base.BaseDateTime.<init>(BaseDateTime.java:258)
	at org.joda.time.DateMidnight.<init>(DateMidnight.java:350)
	at org.joda.time.LocalDate.toDateMidnight(LocalDate.java:867)
	at org.joda.time.TestDateTimeZoneCutover.test_LocalDate_toDateMidnight_Turk(TestDateTimeZoneCutover.java:442)
Caused by: org.joda.time.IllegalInstantException: Illegal instant due to time zone offset transition (daylight savings time 'gap'): 2007-04-01T00:00:00.000 (MockZone)
	at org.joda.time.chrono.ZonedChronology$ZonedDateTimeField.set(ZonedChronology.java:485)
	... 32 more

test_DateTime_new_Turk(org.joda.time.TestDateTimeZoneCutover)  Time elapsed: 0.001 sec  <<< ERROR!
org.joda.time.IllegalFieldValueException: Value 0 for hourOfDay is not supported: Illegal instant due to time zone offset transition (daylight savings time 'gap'): 2007-04-01T00:00:00.000 (MockZone)
	at org.joda.time.chrono.ZonedChronology$ZonedDateTimeField.set(ZonedChronology.java:486)
	at org.joda.time.chrono.BaseChronology.getDateTimeMillis(BaseChronology.java:135)
	at org.joda.time.chrono.AssembledChronology.getDateTimeMillis(AssembledChronology.java:65)
	at org.joda.time.base.BaseDateTime.<init>(BaseDateTime.java:258)
	at org.joda.time.base.BaseDateTime.<init>(BaseDateTime.java:227)
	at org.joda.time.DateTime.<init>(DateTime.java:503)
	at org.joda.time.TestDateTimeZoneCutover.test_DateTime_new_Turk(TestDateTimeZoneCutover.java:451)
Caused by: org.joda.time.IllegalInstantException: Illegal instant due to time zone offset transition (daylight savings time 'gap'): 2007-04-01T00:00:00.000 (MockZone)
	at org.joda.time.chrono.ZonedChronology$ZonedDateTimeField.set(ZonedChronology.java:485)
	... 32 more

test_DateTime_constructor_NewYork_Autumn(org.joda.time.TestDateTimeZoneCutover)  Time elapsed: 0 sec  <<< FAILURE!
junit.framework.ComparisonFailure: expected:<...11-04T01:30:00.000-0[4]:00> but was:<...11-04T01:30:00.000-0[5]:00>
	at junit.framework.Assert.assertEquals(Assert.java:81)
	at junit.framework.Assert.assertEquals(Assert.java:87)
	at org.joda.time.TestDateTimeZoneCutover.test_DateTime_constructor_NewYork_Autumn(TestDateTimeZoneCutover.java:665)

test_DateTime_roundFloor_day_NewYork_Autumn_preCutover(org.joda.time.TestDateTimeZoneCutover)  Time elapsed: 0 sec  <<< FAILURE!
junit.framework.ComparisonFailure: expected:<...11-04T01:30:00.000-0[4]:00> but was:<...11-04T01:30:00.000-0[5]:00>
	at junit.framework.Assert.assertEquals(Assert.java:81)
	at junit.framework.Assert.assertEquals(Assert.java:87)
	at org.joda.time.TestDateTimeZoneCutover.test_DateTime_roundFloor_day_NewYork_Autumn_preCutover(TestDateTimeZoneCutover.java:699)

test_DateTime_roundFloor_day_NewYork_Autumn_postCutover(org.joda.time.TestDateTimeZoneCutover)  Time elapsed: 0.001 sec  <<< FAILURE!
junit.framework.ComparisonFailure: expected:<2007-11-04T0[1]:30:00.000-05:00> but was:<2007-11-04T0[2]:30:00.000-05:00>
	at junit.framework.Assert.assertEquals(Assert.java:81)
	at junit.framework.Assert.assertEquals(Assert.java:87)
	at org.joda.time.TestDateTimeZoneCutover.test_DateTime_roundFloor_day_NewYork_Autumn_postCutover(TestDateTimeZoneCutover.java:706)

test_DateTime_roundFloor_hourOfDay_NewYork_Autumn_preCutover(org.joda.time.TestDateTimeZoneCutover)  Time elapsed: 0.001 sec  <<< FAILURE!
junit.framework.ComparisonFailure: expected:<...11-04T01:30:00.000-0[4]:00> but was:<...11-04T01:30:00.000-0[5]:00>
	at junit.framework.Assert.assertEquals(Assert.java:81)
	at junit.framework.Assert.assertEquals(Assert.java:87)
	at org.joda.time.TestDateTimeZoneCutover.test_DateTime_roundFloor_hourOfDay_NewYork_Autumn_preCutover(TestDateTimeZoneCutover.java:713)

test_DateTime_roundFloor_hourOfDay_NewYork_Autumn_postCutover(org.joda.time.TestDateTimeZoneCutover)  Time elapsed: 0 sec  <<< FAILURE!
junit.framework.ComparisonFailure: expected:<2007-11-04T0[1]:30:00.000-05:00> but was:<2007-11-04T0[2]:30:00.000-05:00>
	at junit.framework.Assert.assertEquals(Assert.java:81)
	at junit.framework.Assert.assertEquals(Assert.java:87)
	at org.joda.time.TestDateTimeZoneCutover.test_DateTime_roundFloor_hourOfDay_NewYork_Autumn_postCutover(TestDateTimeZoneCutover.java:720)

test_DateTime_roundFloor_minuteOfHour_NewYork_Autumn_preCutover(org.joda.time.TestDateTimeZoneCutover)  Time elapsed: 0.001 sec  <<< FAILURE!
junit.framework.ComparisonFailure: expected:<...11-04T01:30:40.000-0[4]:00> but was:<...11-04T01:30:40.000-0[5]:00>
	at junit.framework.Assert.assertEquals(Assert.java:81)
	at junit.framework.Assert.assertEquals(Assert.java:87)
	at org.joda.time.TestDateTimeZoneCutover.test_DateTime_roundFloor_minuteOfHour_NewYork_Autumn_preCutover(TestDateTimeZoneCutover.java:727)

test_DateTime_roundFloor_minuteOfHour_NewYork_Autumn_postCutover(org.joda.time.TestDateTimeZoneCutover)  Time elapsed: 0.001 sec  <<< FAILURE!
junit.framework.ComparisonFailure: expected:<2007-11-04T0[1]:30:40.000-05:00> but was:<2007-11-04T0[2]:30:40.000-05:00>
	at junit.framework.Assert.assertEquals(Assert.java:81)
	at junit.framework.Assert.assertEquals(Assert.java:87)
	at org.joda.time.TestDateTimeZoneCutover.test_DateTime_roundFloor_minuteOfHour_NewYork_Autumn_postCutover(TestDateTimeZoneCutover.java:734)

test_DateTime_roundFloor_secondOfMinute_NewYork_Autumn_preCutover(org.joda.time.TestDateTimeZoneCutover)  Time elapsed: 0 sec  <<< FAILURE!
junit.framework.ComparisonFailure: expected:<...11-04T01:30:40.500-0[4]:00> but was:<...11-04T01:30:40.500-0[5]:00>
	at junit.framework.Assert.assertEquals(Assert.java:81)
	at junit.framework.Assert.assertEquals(Assert.java:87)
	at org.joda.time.TestDateTimeZoneCutover.test_DateTime_roundFloor_secondOfMinute_NewYork_Autumn_preCutover(TestDateTimeZoneCutover.java:741)

test_DateTime_roundFloor_secondOfMinute_NewYork_Autumn_postCutover(org.joda.time.TestDateTimeZoneCutover)  Time elapsed: 0.001 sec  <<< FAILURE!
junit.framework.ComparisonFailure: expected:<2007-11-04T0[1]:30:40.500-05:00> but was:<2007-11-04T0[2]:30:40.500-05:00>
	at junit.framework.Assert.assertEquals(Assert.java:81)
	at junit.framework.Assert.assertEquals(Assert.java:87)
	at org.joda.time.TestDateTimeZoneCutover.test_DateTime_roundFloor_secondOfMinute_NewYork_Autumn_postCutover(TestDateTimeZoneCutover.java:748)

test_DateTime_roundCeiling_day_NewYork_Autumn_preCutover(org.joda.time.TestDateTimeZoneCutover)  Time elapsed: 0 sec  <<< FAILURE!
junit.framework.ComparisonFailure: expected:<...11-04T01:30:00.000-0[4]:00> but was:<...11-04T01:30:00.000-0[5]:00>
	at junit.framework.Assert.assertEquals(Assert.java:81)
	at junit.framework.Assert.assertEquals(Assert.java:87)
	at org.joda.time.TestDateTimeZoneCutover.test_DateTime_roundCeiling_day_NewYork_Autumn_preCutover(TestDateTimeZoneCutover.java:756)

test_DateTime_roundCeiling_day_NewYork_Autumn_postCutover(org.joda.time.TestDateTimeZoneCutover)  Time elapsed: 0.001 sec  <<< FAILURE!
junit.framework.ComparisonFailure: expected:<2007-11-04T0[1]:30:00.000-05:00> but was:<2007-11-04T0[2]:30:00.000-05:00>
	at junit.framework.Assert.assertEquals(Assert.java:81)
	at junit.framework.Assert.assertEquals(Assert.java:87)
	at org.joda.time.TestDateTimeZoneCutover.test_DateTime_roundCeiling_day_NewYork_Autumn_postCutover(TestDateTimeZoneCutover.java:763)

test_LocalDate_toDateMidnight_Gaza(org.joda.time.TestDateTimeZoneCutover)  Time elapsed: 0.001 sec  <<< ERROR!
org.joda.time.IllegalFieldValueException: Value 0 for hourOfDay is not supported: Illegal instant due to time zone offset transition (daylight savings time 'gap'): 2007-04-01T00:00:00.000 (MockZone)
	at org.joda.time.chrono.ZonedChronology$ZonedDateTimeField.set(ZonedChronology.java:486)
	at org.joda.time.chrono.BaseChronology.getDateTimeMillis(BaseChronology.java:135)
	at org.joda.time.chrono.AssembledChronology.getDateTimeMillis(AssembledChronology.java:65)
	at org.joda.time.base.BaseDateTime.<init>(BaseDateTime.java:258)
	at org.joda.time.DateMidnight.<init>(DateMidnight.java:350)
	at org.joda.time.LocalDate.toDateMidnight(LocalDate.java:867)
	at org.joda.time.TestDateTimeZoneCutover.test_LocalDate_toDateMidnight_Gaza(TestDateTimeZoneCutover.java:225)
Caused by: org.joda.time.IllegalInstantException: Illegal instant due to time zone offset transition (daylight savings time 'gap'): 2007-04-01T00:00:00.000 (MockZone)
	at org.joda.time.chrono.ZonedChronology$ZonedDateTimeField.set(ZonedChronology.java:485)
	... 32 more

test_DateTime_new_Gaza(org.joda.time.TestDateTimeZoneCutover)  Time elapsed: 0 sec  <<< ERROR!
org.joda.time.IllegalFieldValueException: Value 0 for hourOfDay is not supported: Illegal instant due to time zone offset transition (daylight savings time 'gap'): 2007-04-01T00:00:00.000 (MockZone)
	at org.joda.time.chrono.ZonedChronology$ZonedDateTimeField.set(ZonedChronology.java:486)
	at org.joda.time.chrono.BaseChronology.getDateTimeMillis(BaseChronology.java:135)
	at org.joda.time.chrono.AssembledChronology.getDateTimeMillis(AssembledChronology.java:65)
	at org.joda.time.base.BaseDateTime.<init>(BaseDateTime.java:258)
	at org.joda.time.base.BaseDateTime.<init>(BaseDateTime.java:227)
	at org.joda.time.DateTime.<init>(DateTime.java:503)
	at org.joda.time.TestDateTimeZoneCutover.test_DateTime_new_Gaza(TestDateTimeZoneCutover.java:234)
Caused by: org.joda.time.IllegalInstantException: Illegal instant due to time zone offset transition (daylight savings time 'gap'): 2007-04-01T00:00:00.000 (MockZone)
	at org.joda.time.chrono.ZonedChronology$ZonedDateTimeField.set(ZonedChronology.java:485)
	... 32 more

testZoneNameNearTransition(org.joda.time.format.TestDateTimeFormatter)  Time elapsed: 0 sec  <<< FAILURE!
junit.framework.ComparisonFailure: expected:<... 01:00:00.0 Eastern [Daylight] Time> but was:<... 01:00:00.0 Eastern [Standard] Time>
	at junit.framework.Assert.assertEquals(Assert.java:81)
	at junit.framework.Assert.assertEquals(Assert.java:87)
	at org.joda.time.format.TestDateTimeFormatter.testZoneNameNearTransition(TestDateTimeFormatter.java:1003)

testZoneShortNameNearTransition(org.joda.time.format.TestDateTimeFormatter)  Time elapsed: 0 sec  <<< FAILURE!
junit.framework.ComparisonFailure: expected:<...5-10-30 01:00:00.0 E[D]T> but was:<...5-10-30 01:00:00.0 E[S]T>
	at junit.framework.Assert.assertEquals(Assert.java:81)
	at junit.framework.Assert.assertEquals(Assert.java:87)
	at org.joda.time.format.TestDateTimeFormatter.testZoneShortNameNearTransition(TestDateTimeFormatter.java:1019)


Results :

Failed tests: 
  org.joda.time.TestDateTimeZoneCutover#testDateTimeCreation_losAngeles ComparisonFailure
  org.joda.time.TestDateTimeZoneCutover#testDateTimeCreation_newYork ComparisonFailure
  org.joda.time.TestDateTimeZoneCutover#test_DateTime_constructor_Moscow_Autumn ComparisonFailure
  org.joda.time.TestDateTimeZoneCutover#test_DateTime_constructor_NewYork_Autumn ComparisonFailure
  org.joda.time.TestDateTimeZoneCutover#test_DateTime_roundCeiling_day_NewYork_Autumn_postCutover ComparisonFailure
  org.joda.time.TestDateTimeZoneCutover#test_DateTime_roundCeiling_day_NewYork_Autumn_preCutover ComparisonFailure
  org.joda.time.TestDateTimeZoneCutover#test_DateTime_roundCeiling_hourOfDay_NewYork_Autumn_postCutover ComparisonFailure
  org.joda.time.TestDateTimeZoneCutover#test_DateTime_roundCeiling_hourOfDay_NewYork_Autumn_preCutover ComparisonFailure
  org.joda.time.TestDateTimeZoneCutover#test_DateTime_roundCeiling_minuteOfHour_NewYork_Autumn_postCutover ComparisonFailure
  org.joda.time.TestDateTimeZoneCutover#test_DateTime_roundCeiling_minuteOfHour_NewYork_Autumn_preCutover ComparisonFailure
  org.joda.time.TestDateTimeZoneCutover#test_DateTime_roundCeiling_secondOfMinute_NewYork_Autumn_postCutover ComparisonFailure
  org.joda.time.TestDateTimeZoneCutover#test_DateTime_roundCeiling_secondOfMinute_NewYork_Autumn_preCutover ComparisonFailure
  org.joda.time.TestDateTimeZoneCutover#test_DateTime_roundFloor_day_NewYork_Autumn_postCutover ComparisonFailure
  org.joda.time.TestDateTimeZoneCutover#test_DateTime_roundFloor_day_NewYork_Autumn_preCutover ComparisonFailure
  org.joda.time.TestDateTimeZoneCutover#test_DateTime_roundFloor_hourOfDay_NewYork_Autumn_postCutover ComparisonFailure
  org.joda.time.TestDateTimeZoneCutover#test_DateTime_roundFloor_hourOfDay_NewYork_Autumn_preCutover ComparisonFailure
  org.joda.time.TestDateTimeZoneCutover#test_DateTime_roundFloor_minuteOfHour_NewYork_Autumn_postCutover ComparisonFailure
  org.joda.time.TestDateTimeZoneCutover#test_DateTime_roundFloor_minuteOfHour_NewYork_Autumn_preCutover ComparisonFailure
  org.joda.time.TestDateTimeZoneCutover#test_DateTime_roundFloor_secondOfMinute_NewYork_Autumn_postCutover ComparisonFailure
  org.joda.time.TestDateTimeZoneCutover#test_DateTime_roundFloor_secondOfMinute_NewYork_Autumn_preCutover ComparisonFailure
  org.joda.time.TestLocalDateTime_Basics#testToDateTime_Zone_dstOverlap_NewYork AssertionFailedError
  org.joda.time.TestLocalDate_Basics#testToDateTime_LocalTime_Zone_dstOverlap_NewYork AssertionFailedError
  org.joda.time.format.TestDateTimeFormatter#testZoneNameNearTransition ComparisonFailure
  org.joda.time.format.TestDateTimeFormatter#testZoneShortNameNearTransition ComparisonFailure
Tests in error: 
  org.joda.time.TestDateTimeZone#testIsLocalDateTimeGap_Berlin IllegalFieldValueException
  org.joda.time.TestDateTimeZone#testIsLocalDateTimeGap_NewYork IllegalFieldValueException
  org.joda.time.TestDateTimeZoneCutover#test_DateTime_new_Gaza IllegalFieldValueException
  org.joda.time.TestDateTimeZoneCutover#test_DateTime_new_Turk IllegalFieldValueException
  org.joda.time.TestDateTimeZoneCutover#test_LocalDate_toDateMidnight_Gaza IllegalFieldValueException
  org.joda.time.TestDateTimeZoneCutover#test_LocalDate_toDateMidnight_Turk IllegalFieldValueException
  org.joda.time.TestLocalDateTime_Basics#testToDateTime_Zone_dstGap IllegalFieldValueException
  org.joda.time.TestLocalDate_Basics#testToDateTime_LocalTime_Zone_dstGap IllegalFieldValueException

Tests run: 4157, Failures: 24, Errors: 8, Skipped: 0

[INFO] ------------------------------------------------------------------------
[INFO] BUILD FAILURE
[INFO] ------------------------------------------------------------------------
[INFO] Total time: 16.407s
[INFO] Finished at: Wed Aug 05 21:42:36 BST 2015
[INFO] Final Memory: 9M/213M
[INFO] ------------------------------------------------------------------------
[ERROR] Failed to execute goal org.apache.maven.plugins:maven-surefire-plugin:2.18.1:test (default-test) on project joda-time: There are test failures.
[ERROR] 
[ERROR] Please refer to /home/perham/Study/LittleDarwin/Cases/joda-time-2.8.1/target/surefire-reports for the individual test results.
[ERROR] -> [Help 1]
[ERROR] 
[ERROR] To see the full stack trace of the errors, re-run Maven with the -e switch.
[ERROR] Re-run Maven using the -X switch to enable full debug logging.
[ERROR] 
[ERROR] For more information about the errors and possible solutions, please read the following articles:
[ERROR] [Help 1] http://cwiki.apache.org/confluence/display/MAVEN/MojoFailureException
