[INFO] Scanning for projects...
[INFO]                                                                         
[INFO] ------------------------------------------------------------------------
[INFO] Building Joda-Time 2.8.1
[INFO] ------------------------------------------------------------------------
[INFO] 
[INFO] --- maven-resources-plugin:2.7:resources (default-resources) @ joda-time ---
[INFO] Using 'UTF-8' encoding to copy filtered resources.
[INFO] Copying 2 resources to META-INF
[INFO] Copying 10 resources
[INFO] 
[INFO] --- maven-compiler-plugin:3.3:compile (default-compile) @ joda-time ---
[INFO] Changes detected - recompiling the module!
[INFO] Compiling 166 source files to /home/perham/Study/LittleDarwin/Cases/joda-time-2.8.1/target/classes
[INFO] 
[INFO] --- exec-maven-plugin:1.4.0:java (compile-tzdb) @ joda-time ---
Writing zoneinfo files
Writing ZoneInfoMap
[INFO] 
[INFO] --- maven-resources-plugin:2.7:testResources (default-testResources) @ joda-time ---
[INFO] Using 'UTF-8' encoding to copy filtered resources.
[INFO] Copying 34 resources
[INFO] 
[INFO] --- maven-compiler-plugin:3.3:testCompile (default-testCompile) @ joda-time ---
[INFO] Nothing to compile - all classes are up to date
[INFO] 
[INFO] --- maven-surefire-plugin:2.18.1:test (default-test) @ joda-time ---
[INFO] Surefire report directory: /home/perham/Study/LittleDarwin/Cases/joda-time-2.8.1/target/surefire-reports

-------------------------------------------------------
 T E S T S
-------------------------------------------------------
Running org.joda.time.TestAllPackages

TestBuddhistChronology.testCalendar

TestCopticChronology.testCalendar

TestEthiopicChronology.testCalendar

TestIslamicChronology.testCalendar

Testing Gregorian chronology over 1000 iterations
100% complete (i=1000)

Testing Julian chronology over 1000 iterations
100% complete (i=1000)
Writing zoneinfo files
Writing ZoneInfoMap
Tests run: 4157, Failures: 12, Errors: 262, Skipped: 0, Time elapsed: 5.516 sec <<< FAILURE! - in org.joda.time.TestAllPackages
test_seconds(org.joda.time.TestDurationFieldType)  Time elapsed: 0.001 sec  <<< ERROR!
java.lang.NullPointerException
	at org.joda.time.TestDurationFieldType.test_seconds(TestDurationFieldType.java:139)

testWithDurationAdded_RP_int(org.joda.time.TestDateTime_Basics)  Time elapsed: 0.001 sec  <<< ERROR!
java.lang.NullPointerException
	at org.joda.time.chrono.BaseChronology.add(BaseChronology.java:307)
	at org.joda.time.DateTime.withPeriodAdded(DateTime.java:941)
	at org.joda.time.TestDateTime_Basics.testWithDurationAdded_RP_int(TestDateTime_Basics.java:1018)

testPlus_RP(org.joda.time.TestDateTime_Basics)  Time elapsed: 0 sec  <<< ERROR!
java.lang.NullPointerException
	at org.joda.time.chrono.BaseChronology.add(BaseChronology.java:307)
	at org.joda.time.DateTime.withPeriodAdded(DateTime.java:941)
	at org.joda.time.DateTime.plus(DateTime.java:997)
	at org.joda.time.TestDateTime_Basics.testPlus_RP(TestDateTime_Basics.java:1057)

testPlusSeconds_int(org.joda.time.TestDateTime_Basics)  Time elapsed: 0.002 sec  <<< ERROR!
java.lang.NullPointerException
	at org.joda.time.DateTime.plusSeconds(DateTime.java:1203)
	at org.joda.time.TestDateTime_Basics.testPlusSeconds_int(TestDateTime_Basics.java:1127)

testMinus_RP(org.joda.time.TestDateTime_Basics)  Time elapsed: 0.004 sec  <<< ERROR!
java.lang.NullPointerException
	at org.joda.time.chrono.BaseChronology.add(BaseChronology.java:307)
	at org.joda.time.DateTime.withPeriodAdded(DateTime.java:941)
	at org.joda.time.DateTime.minus(DateTime.java:1286)
	at org.joda.time.TestDateTime_Basics.testMinus_RP(TestDateTime_Basics.java:1165)

testMinusSeconds_int(org.joda.time.TestDateTime_Basics)  Time elapsed: 0.001 sec  <<< ERROR!
java.lang.NullPointerException
	at org.joda.time.DateTime.minusSeconds(DateTime.java:1493)
	at org.joda.time.TestDateTime_Basics.testMinusSeconds_int(TestDateTime_Basics.java:1235)

testPropertyGetSecondOfMinute(org.joda.time.TestDateTime_Properties)  Time elapsed: 0.001 sec  <<< FAILURE!
junit.framework.AssertionFailedError: expected:<null> but was:<DurationField[seconds]>
	at junit.framework.Assert.fail(Assert.java:47)
	at junit.framework.Assert.failNotEquals(Assert.java:280)
	at junit.framework.Assert.assertEquals(Assert.java:64)
	at junit.framework.Assert.assertEquals(Assert.java:71)
	at org.joda.time.TestDateTime_Properties.testPropertyGetSecondOfMinute(TestDateTime_Properties.java:1236)

testPropertyGetSecondOfDay(org.joda.time.TestDateTime_Properties)  Time elapsed: 0 sec  <<< FAILURE!
junit.framework.AssertionFailedError: expected:<null> but was:<DurationField[seconds]>
	at junit.framework.Assert.fail(Assert.java:47)
	at junit.framework.Assert.failNotEquals(Assert.java:280)
	at junit.framework.Assert.assertEquals(Assert.java:64)
	at junit.framework.Assert.assertEquals(Assert.java:71)
	at org.joda.time.TestDateTime_Properties.testPropertyGetSecondOfDay(TestDateTime_Properties.java:1255)

testPropertyGetMillisOfSecond(org.joda.time.TestDateTime_Properties)  Time elapsed: 0.001 sec  <<< FAILURE!
junit.framework.AssertionFailedError: expected:<null> but was:<DurationField[seconds]>
	at junit.framework.Assert.fail(Assert.java:47)
	at junit.framework.Assert.failNotEquals(Assert.java:280)
	at junit.framework.Assert.assertEquals(Assert.java:64)
	at junit.framework.Assert.assertEquals(Assert.java:71)
	at org.joda.time.TestDateTime_Properties.testPropertyGetMillisOfSecond(TestDateTime_Properties.java:1275)

testAddSeconds_int1(org.joda.time.TestMutableDateTime_Adds)  Time elapsed: 0 sec  <<< ERROR!
java.lang.NullPointerException
	at org.joda.time.MutableDateTime.addSeconds(MutableDateTime.java:863)
	at org.joda.time.TestMutableDateTime_Adds.testAddSeconds_int1(TestMutableDateTime_Adds.java:350)

testAdd_RP1(org.joda.time.TestMutableDateTime_Adds)  Time elapsed: 0 sec  <<< ERROR!
java.lang.NullPointerException
	at org.joda.time.chrono.BaseChronology.add(BaseChronology.java:307)
	at org.joda.time.MutableDateTime.add(MutableDateTime.java:549)
	at org.joda.time.MutableDateTime.add(MutableDateTime.java:535)
	at org.joda.time.TestMutableDateTime_Adds.testAdd_RP1(TestMutableDateTime_Adds.java:144)

testAdd_RP_int1(org.joda.time.TestMutableDateTime_Adds)  Time elapsed: 0.001 sec  <<< ERROR!
java.lang.NullPointerException
	at org.joda.time.chrono.BaseChronology.add(BaseChronology.java:307)
	at org.joda.time.MutableDateTime.add(MutableDateTime.java:549)
	at org.joda.time.TestMutableDateTime_Adds.testAdd_RP_int1(TestMutableDateTime_Adds.java:158)

testPropertyGetSecondOfMinute(org.joda.time.TestMutableDateTime_Properties)  Time elapsed: 0 sec  <<< FAILURE!
junit.framework.AssertionFailedError: expected:<null> but was:<DurationField[seconds]>
	at junit.framework.Assert.fail(Assert.java:47)
	at junit.framework.Assert.failNotEquals(Assert.java:280)
	at junit.framework.Assert.assertEquals(Assert.java:64)
	at junit.framework.Assert.assertEquals(Assert.java:71)
	at org.joda.time.TestMutableDateTime_Properties.testPropertyGetSecondOfMinute(TestMutableDateTime_Properties.java:634)

testPropertyGetSecondOfDay(org.joda.time.TestMutableDateTime_Properties)  Time elapsed: 0 sec  <<< FAILURE!
junit.framework.AssertionFailedError: expected:<null> but was:<DurationField[seconds]>
	at junit.framework.Assert.fail(Assert.java:47)
	at junit.framework.Assert.failNotEquals(Assert.java:280)
	at junit.framework.Assert.assertEquals(Assert.java:64)
	at junit.framework.Assert.assertEquals(Assert.java:71)
	at org.joda.time.TestMutableDateTime_Properties.testPropertyGetSecondOfDay(TestMutableDateTime_Properties.java:651)

testPropertyGetMillisOfSecond(org.joda.time.TestMutableDateTime_Properties)  Time elapsed: 0 sec  <<< FAILURE!
junit.framework.AssertionFailedError: expected:<null> but was:<DurationField[seconds]>
	at junit.framework.Assert.fail(Assert.java:47)
	at junit.framework.Assert.failNotEquals(Assert.java:280)
	at junit.framework.Assert.assertEquals(Assert.java:64)
	at junit.framework.Assert.assertEquals(Assert.java:71)
	at org.joda.time.TestMutableDateTime_Properties.testPropertyGetMillisOfSecond(TestMutableDateTime_Properties.java:669)

testWithDurationAdded_RP_int(org.joda.time.TestDateMidnight_Basics)  Time elapsed: 0.001 sec  <<< ERROR!
java.lang.NullPointerException
	at org.joda.time.chrono.BaseChronology.add(BaseChronology.java:307)
	at org.joda.time.DateMidnight.withPeriodAdded(DateMidnight.java:556)
	at org.joda.time.TestDateMidnight_Basics.testWithDurationAdded_RP_int(TestDateMidnight_Basics.java:831)

testPlus_RP(org.joda.time.TestDateMidnight_Basics)  Time elapsed: 0 sec  <<< ERROR!
java.lang.NullPointerException
	at org.joda.time.chrono.BaseChronology.add(BaseChronology.java:307)
	at org.joda.time.DateMidnight.withPeriodAdded(DateMidnight.java:556)
	at org.joda.time.DateMidnight.plus(DateMidnight.java:601)
	at org.joda.time.TestDateMidnight_Basics.testPlus_RP(TestDateMidnight_Basics.java:870)

testMinus_RP(org.joda.time.TestDateMidnight_Basics)  Time elapsed: 0.001 sec  <<< ERROR!
java.lang.NullPointerException
	at org.joda.time.chrono.BaseChronology.add(BaseChronology.java:307)
	at org.joda.time.DateMidnight.withPeriodAdded(DateMidnight.java:556)
	at org.joda.time.DateMidnight.minus(DateMidnight.java:742)
	at org.joda.time.TestDateMidnight_Basics.testMinus_RP(TestDateMidnight_Basics.java:938)

testToPeriod(org.joda.time.TestDuration_Basics)  Time elapsed: 0.001 sec  <<< ERROR!
java.lang.NullPointerException
	at org.joda.time.chrono.BaseChronology.get(BaseChronology.java:284)
	at org.joda.time.base.BasePeriod.<init>(BasePeriod.java:236)
	at org.joda.time.Period.<init>(Period.java:382)
	at org.joda.time.base.AbstractDuration.toPeriod(AbstractDuration.java:80)
	at org.joda.time.TestDuration_Basics.testToPeriod(TestDuration_Basics.java:456)

testToPeriod_fixedZone(org.joda.time.TestDuration_Basics)  Time elapsed: 0.001 sec  <<< ERROR!
java.lang.NullPointerException
	at org.joda.time.chrono.BaseChronology.get(BaseChronology.java:284)
	at org.joda.time.base.BasePeriod.<init>(BasePeriod.java:236)
	at org.joda.time.Period.<init>(Period.java:382)
	at org.joda.time.base.AbstractDuration.toPeriod(AbstractDuration.java:80)
	at org.joda.time.TestDuration_Basics.testToPeriod_fixedZone(TestDuration_Basics.java:480)

testToPeriod_PeriodType(org.joda.time.TestDuration_Basics)  Time elapsed: 0 sec  <<< ERROR!
java.lang.NullPointerException
	at org.joda.time.chrono.BaseChronology.get(BaseChronology.java:284)
	at org.joda.time.base.BasePeriod.<init>(BasePeriod.java:258)
	at org.joda.time.Period.<init>(Period.java:402)
	at org.joda.time.base.BaseDuration.toPeriod(BaseDuration.java:144)
	at org.joda.time.TestDuration_Basics.testToPeriod_PeriodType(TestDuration_Basics.java:502)

testToPeriod_Chronology(org.joda.time.TestDuration_Basics)  Time elapsed: 0.001 sec  <<< ERROR!
java.lang.NullPointerException
	at org.joda.time.chrono.BaseChronology.get(BaseChronology.java:284)
	at org.joda.time.base.BasePeriod.<init>(BasePeriod.java:258)
	at org.joda.time.Period.<init>(Period.java:423)
	at org.joda.time.base.BaseDuration.toPeriod(BaseDuration.java:164)
	at org.joda.time.TestDuration_Basics.testToPeriod_Chronology(TestDuration_Basics.java:515)

testToPeriod_PeriodType_Chronology(org.joda.time.TestDuration_Basics)  Time elapsed: 0 sec  <<< ERROR!
java.lang.NullPointerException
	at org.joda.time.chrono.BaseChronology.get(BaseChronology.java:284)
	at org.joda.time.base.BasePeriod.<init>(BasePeriod.java:258)
	at org.joda.time.Period.<init>(Period.java:444)
	at org.joda.time.base.BaseDuration.toPeriod(BaseDuration.java:185)
	at org.joda.time.TestDuration_Basics.testToPeriod_PeriodType_Chronology(TestDuration_Basics.java:528)

testToPeriodFrom(org.joda.time.TestDuration_Basics)  Time elapsed: 0.001 sec  <<< ERROR!
java.lang.NullPointerException
	at org.joda.time.chrono.BaseChronology.get(BaseChronology.java:260)
	at org.joda.time.base.BasePeriod.<init>(BasePeriod.java:201)
	at org.joda.time.Period.<init>(Period.java:626)
	at org.joda.time.base.BaseDuration.toPeriodFrom(BaseDuration.java:200)
	at org.joda.time.TestDuration_Basics.testToPeriodFrom(TestDuration_Basics.java:542)

testToPeriodFrom_PeriodType(org.joda.time.TestDuration_Basics)  Time elapsed: 0.001 sec  <<< ERROR!
java.lang.NullPointerException
	at org.joda.time.chrono.BaseChronology.get(BaseChronology.java:260)
	at org.joda.time.base.BasePeriod.<init>(BasePeriod.java:201)
	at org.joda.time.Period.<init>(Period.java:637)
	at org.joda.time.base.BaseDuration.toPeriodFrom(BaseDuration.java:216)
	at org.joda.time.TestDuration_Basics.testToPeriodFrom_PeriodType(TestDuration_Basics.java:555)

testToPeriodTo(org.joda.time.TestDuration_Basics)  Time elapsed: 0.001 sec  <<< ERROR!
java.lang.NullPointerException
	at org.joda.time.chrono.BaseChronology.get(BaseChronology.java:260)
	at org.joda.time.base.BasePeriod.<init>(BasePeriod.java:219)
	at org.joda.time.Period.<init>(Period.java:647)
	at org.joda.time.base.BaseDuration.toPeriodTo(BaseDuration.java:232)
	at org.joda.time.TestDuration_Basics.testToPeriodTo(TestDuration_Basics.java:568)

testToPeriodTo_PeriodType(org.joda.time.TestDuration_Basics)  Time elapsed: 0.001 sec  <<< ERROR!
java.lang.NullPointerException
	at org.joda.time.chrono.BaseChronology.get(BaseChronology.java:260)
	at org.joda.time.base.BasePeriod.<init>(BasePeriod.java:219)
	at org.joda.time.Period.<init>(Period.java:658)
	at org.joda.time.base.BaseDuration.toPeriodTo(BaseDuration.java:249)
	at org.joda.time.TestDuration_Basics.testToPeriodTo_PeriodType(TestDuration_Basics.java:581)

testConstructor_RI_RP4(org.joda.time.TestInterval_Constructors)  Time elapsed: 0 sec  <<< ERROR!
java.lang.NullPointerException
	at org.joda.time.chrono.BaseChronology.get(BaseChronology.java:284)
	at org.joda.time.base.BasePeriod.<init>(BasePeriod.java:236)
	at org.joda.time.Period.<init>(Period.java:382)
	at org.joda.time.TestInterval_Constructors.testConstructor_RI_RP4(TestInterval_Constructors.java:308)

testConstructor_RP_RI4(org.joda.time.TestInterval_Constructors)  Time elapsed: 0 sec  <<< ERROR!
java.lang.NullPointerException
	at org.joda.time.chrono.BaseChronology.get(BaseChronology.java:284)
	at org.joda.time.base.BasePeriod.<init>(BasePeriod.java:236)
	at org.joda.time.Period.<init>(Period.java:382)
	at org.joda.time.TestInterval_Constructors.testConstructor_RP_RI4(TestInterval_Constructors.java:392)

testToPeriod_PeriodType1(org.joda.time.TestInterval_Basics)  Time elapsed: 0.001 sec  <<< ERROR!
java.lang.NullPointerException
	at org.joda.time.chrono.BaseChronology.get(BaseChronology.java:260)
	at org.joda.time.base.BasePeriod.<init>(BasePeriod.java:110)
	at org.joda.time.Period.<init>(Period.java:490)
	at org.joda.time.base.AbstractInterval.toPeriod(AbstractInterval.java:447)
	at org.joda.time.TestInterval_Basics.testToPeriod_PeriodType1(TestInterval_Basics.java:1008)

testToPeriod_PeriodType2(org.joda.time.TestInterval_Basics)  Time elapsed: 0.001 sec  <<< ERROR!
java.lang.NullPointerException
	at org.joda.time.chrono.BaseChronology.get(BaseChronology.java:260)
	at org.joda.time.base.BasePeriod.<init>(BasePeriod.java:110)
	at org.joda.time.Period.<init>(Period.java:490)
	at org.joda.time.base.AbstractInterval.toPeriod(AbstractInterval.java:447)
	at org.joda.time.TestInterval_Basics.testToPeriod_PeriodType2(TestInterval_Basics.java:1018)

testToPeriod(org.joda.time.TestInterval_Basics)  Time elapsed: 0.001 sec  <<< ERROR!
java.lang.NullPointerException
	at org.joda.time.chrono.BaseChronology.get(BaseChronology.java:260)
	at org.joda.time.base.BasePeriod.<init>(BasePeriod.java:110)
	at org.joda.time.Period.<init>(Period.java:478)
	at org.joda.time.base.AbstractInterval.toPeriod(AbstractInterval.java:433)
	at org.joda.time.TestInterval_Basics.testToPeriod(TestInterval_Basics.java:997)

testPlus_RP(org.joda.time.TestLocalDateTime_Basics)  Time elapsed: 0 sec  <<< ERROR!
java.lang.NullPointerException
	at org.joda.time.chrono.BaseChronology.add(BaseChronology.java:307)
	at org.joda.time.LocalDateTime.withPeriodAdded(LocalDateTime.java:1062)
	at org.joda.time.LocalDateTime.plus(LocalDateTime.java:1094)
	at org.joda.time.TestLocalDateTime_Basics.testPlus_RP(TestLocalDateTime_Basics.java:535)

testPlusSeconds_int(org.joda.time.TestLocalDateTime_Basics)  Time elapsed: 0.001 sec  <<< ERROR!
java.lang.NullPointerException
	at org.joda.time.LocalDateTime.plusSeconds(LocalDateTime.java:1256)
	at org.joda.time.TestLocalDateTime_Basics.testPlusSeconds_int(TestLocalDateTime_Basics.java:605)

testMinus_RP(org.joda.time.TestLocalDateTime_Basics)  Time elapsed: 0 sec  <<< ERROR!
java.lang.NullPointerException
	at org.joda.time.chrono.BaseChronology.add(BaseChronology.java:307)
	at org.joda.time.LocalDateTime.withPeriodAdded(LocalDateTime.java:1062)
	at org.joda.time.LocalDateTime.minus(LocalDateTime.java:1311)
	at org.joda.time.TestLocalDateTime_Basics.testMinus_RP(TestLocalDateTime_Basics.java:626)

testMinusSeconds_int(org.joda.time.TestLocalDateTime_Basics)  Time elapsed: 0 sec  <<< ERROR!
java.lang.NullPointerException
	at org.joda.time.LocalDateTime.minusSeconds(LocalDateTime.java:1473)
	at org.joda.time.TestLocalDateTime_Basics.testMinusSeconds_int(TestLocalDateTime_Basics.java:697)

testIsSupported_DurationFieldType(org.joda.time.TestLocalDateTime_Basics)  Time elapsed: 0 sec  <<< ERROR!
java.lang.NullPointerException
	at org.joda.time.LocalDateTime.isSupported(LocalDateTime.java:639)
	at org.joda.time.TestLocalDateTime_Basics.testIsSupported_DurationFieldType(TestLocalDateTime_Basics.java:275)

testPropertyGetSecond(org.joda.time.TestLocalDateTime_Properties)  Time elapsed: 0.001 sec  <<< FAILURE!
junit.framework.AssertionFailedError: expected:<null> but was:<DurationField[seconds]>
	at junit.framework.Assert.fail(Assert.java:47)
	at junit.framework.Assert.failNotEquals(Assert.java:280)
	at junit.framework.Assert.assertEquals(Assert.java:64)
	at junit.framework.Assert.assertEquals(Assert.java:71)
	at org.joda.time.TestLocalDateTime_Properties.testPropertyGetSecond(TestLocalDateTime_Properties.java:834)

testPropertyGetMilli(org.joda.time.TestLocalDateTime_Properties)  Time elapsed: 0.001 sec  <<< FAILURE!
junit.framework.AssertionFailedError: expected:<null> but was:<DurationField[seconds]>
	at junit.framework.Assert.fail(Assert.java:47)
	at junit.framework.Assert.failNotEquals(Assert.java:280)
	at junit.framework.Assert.assertEquals(Assert.java:64)
	at junit.framework.Assert.assertEquals(Assert.java:71)
	at org.joda.time.TestLocalDateTime_Properties.testPropertyGetMilli(TestLocalDateTime_Properties.java:963)

testPlus_RP(org.joda.time.TestLocalDate_Basics)  Time elapsed: 0.001 sec  <<< ERROR!
java.lang.NullPointerException
	at org.joda.time.LocalDate.isSupported(LocalDate.java:594)
	at org.joda.time.LocalDate.withPeriodAdded(LocalDate.java:1168)
	at org.joda.time.LocalDate.plus(LocalDate.java:1193)
	at org.joda.time.TestLocalDate_Basics.testPlus_RP(TestLocalDate_Basics.java:519)

testMinus_RP(org.joda.time.TestLocalDate_Basics)  Time elapsed: 0 sec  <<< ERROR!
java.lang.NullPointerException
	at org.joda.time.LocalDate.isSupported(LocalDate.java:594)
	at org.joda.time.LocalDate.withPeriodAdded(LocalDate.java:1168)
	at org.joda.time.LocalDate.minus(LocalDate.java:1312)
	at org.joda.time.TestLocalDate_Basics.testMinus_RP(TestLocalDate_Basics.java:570)

testConstructor_ObjectLocalTime(org.joda.time.TestLocalTime_Constructors)  Time elapsed: 0.001 sec  <<< ERROR!
java.lang.NullPointerException
	at org.joda.time.LocalTime.isSupported(LocalTime.java:646)
	at org.joda.time.LocalTime.isSupported(LocalTime.java:625)
	at org.joda.time.LocalTime.get(LocalTime.java:607)
	at org.joda.time.convert.ReadablePartialConverter.getPartialValues(ReadablePartialConverter.java:91)
	at org.joda.time.convert.AbstractConverter.getPartialValues(AbstractConverter.java:123)
	at org.joda.time.LocalTime.<init>(LocalTime.java:435)
	at org.joda.time.LocalTime.<init>(LocalTime.java:383)
	at org.joda.time.TestLocalTime_Constructors.testConstructor_ObjectLocalTime(TestLocalTime_Constructors.java:462)

testToString(org.joda.time.TestLocalTime_Basics)  Time elapsed: 0 sec  <<< ERROR!
java.lang.NullPointerException
	at org.joda.time.LocalTime.isSupported(LocalTime.java:646)
	at org.joda.time.LocalTime.isSupported(LocalTime.java:625)
	at org.joda.time.format.DateTimeFormatterBuilder$PaddedNumber.printTo(DateTimeFormatterBuilder.java:1434)
	at org.joda.time.format.DateTimeFormatterBuilder$Composite.printTo(DateTimeFormatterBuilder.java:2446)
	at org.joda.time.format.DateTimeFormatter.printTo(DateTimeFormatter.java:609)
	at org.joda.time.format.DateTimeFormatter.print(DateTimeFormatter.java:663)
	at org.joda.time.LocalTime.toString(LocalTime.java:1299)
	at org.joda.time.TestLocalTime_Basics.testToString(TestLocalTime_Basics.java:786)

testIsSupported_DateTimeFieldType(org.joda.time.TestLocalTime_Basics)  Time elapsed: 0.001 sec  <<< ERROR!
java.lang.NullPointerException
	at org.joda.time.LocalTime.isSupported(LocalTime.java:646)
	at org.joda.time.LocalTime.isSupported(LocalTime.java:625)
	at org.joda.time.TestLocalTime_Basics.testIsSupported_DateTimeFieldType(TestLocalTime_Basics.java:213)

testToString_String(org.joda.time.TestLocalTime_Basics)  Time elapsed: 0 sec  <<< ERROR!
java.lang.NullPointerException
	at org.joda.time.LocalTime.isSupported(LocalTime.java:646)
	at org.joda.time.LocalTime.isSupported(LocalTime.java:625)
	at org.joda.time.format.DateTimeFormatterBuilder$PaddedNumber.printTo(DateTimeFormatterBuilder.java:1434)
	at org.joda.time.format.DateTimeFormatterBuilder$Composite.printTo(DateTimeFormatterBuilder.java:2446)
	at org.joda.time.format.DateTimeFormatter.printTo(DateTimeFormatter.java:609)
	at org.joda.time.format.DateTimeFormatter.print(DateTimeFormatter.java:663)
	at org.joda.time.LocalTime.toString(LocalTime.java:1299)
	at org.joda.time.LocalTime.toString(LocalTime.java:1310)
	at org.joda.time.TestLocalTime_Basics.testToString_String(TestLocalTime_Basics.java:793)

testToString_String_Locale(org.joda.time.TestLocalTime_Basics)  Time elapsed: 0.001 sec  <<< ERROR!
java.lang.NullPointerException
	at org.joda.time.LocalTime.isSupported(LocalTime.java:646)
	at org.joda.time.LocalTime.isSupported(LocalTime.java:625)
	at org.joda.time.format.DateTimeFormatterBuilder$PaddedNumber.printTo(DateTimeFormatterBuilder.java:1434)
	at org.joda.time.format.DateTimeFormatterBuilder$Composite.printTo(DateTimeFormatterBuilder.java:2446)
	at org.joda.time.format.DateTimeFormatter.printTo(DateTimeFormatter.java:609)
	at org.joda.time.format.DateTimeFormatter.print(DateTimeFormatter.java:663)
	at org.joda.time.LocalTime.toString(LocalTime.java:1299)
	at org.joda.time.LocalTime.toString(LocalTime.java:1324)
	at org.joda.time.TestLocalTime_Basics.testToString_String_Locale(TestLocalTime_Basics.java:800)

testToString_DTFormatter(org.joda.time.TestLocalTime_Basics)  Time elapsed: 0 sec  <<< ERROR!
java.lang.NullPointerException
	at org.joda.time.LocalTime.isSupported(LocalTime.java:646)
	at org.joda.time.LocalTime.isSupported(LocalTime.java:625)
	at org.joda.time.format.DateTimeFormatterBuilder$PaddedNumber.printTo(DateTimeFormatterBuilder.java:1434)
	at org.joda.time.format.DateTimeFormatterBuilder$Composite.printTo(DateTimeFormatterBuilder.java:2446)
	at org.joda.time.format.DateTimeFormatter.printTo(DateTimeFormatter.java:609)
	at org.joda.time.format.DateTimeFormatter.print(DateTimeFormatter.java:663)
	at org.joda.time.LocalTime.toString(LocalTime.java:1299)
	at org.joda.time.base.AbstractPartial.toString(AbstractPartial.java:410)
	at org.joda.time.TestLocalTime_Basics.testToString_DTFormatter(TestLocalTime_Basics.java:809)

testGet_DateTimeFieldType(org.joda.time.TestLocalTime_Basics)  Time elapsed: 0.001 sec  <<< ERROR!
java.lang.NullPointerException
	at org.joda.time.LocalTime.isSupported(LocalTime.java:646)
	at org.joda.time.LocalTime.isSupported(LocalTime.java:625)
	at org.joda.time.LocalTime.get(LocalTime.java:607)
	at org.joda.time.TestLocalTime_Basics.testGet_DateTimeFieldType(TestLocalTime_Basics.java:100)

testCompareTo(org.joda.time.TestLocalTime_Basics)  Time elapsed: 0 sec  <<< ERROR!
java.lang.NullPointerException
	at org.joda.time.Partial.<init>(Partial.java:221)
	at org.joda.time.Partial.<init>(Partial.java:177)
	at org.joda.time.TestLocalTime_Basics.testCompareTo(TestLocalTime_Basics.java:338)

testPlus_RP(org.joda.time.TestLocalTime_Basics)  Time elapsed: 0 sec  <<< ERROR!
java.lang.NullPointerException
	at org.joda.time.chrono.BaseChronology.add(BaseChronology.java:307)
	at org.joda.time.LocalTime.withPeriodAdded(LocalTime.java:848)
	at org.joda.time.LocalTime.plus(LocalTime.java:867)
	at org.joda.time.TestLocalTime_Basics.testPlus_RP(TestLocalTime_Basics.java:540)

testPlusSeconds_int(org.joda.time.TestLocalTime_Basics)  Time elapsed: 0.001 sec  <<< ERROR!
java.lang.NullPointerException
	at org.joda.time.LocalTime.plusSeconds(LocalTime.java:936)
	at org.joda.time.TestLocalTime_Basics.testPlusSeconds_int(TestLocalTime_Basics.java:570)

testMinus_RP(org.joda.time.TestLocalTime_Basics)  Time elapsed: 0 sec  <<< ERROR!
java.lang.NullPointerException
	at org.joda.time.chrono.BaseChronology.add(BaseChronology.java:307)
	at org.joda.time.LocalTime.withPeriodAdded(LocalTime.java:848)
	at org.joda.time.LocalTime.minus(LocalTime.java:978)
	at org.joda.time.TestLocalTime_Basics.testMinus_RP(TestLocalTime_Basics.java:591)

testMinusSeconds_int(org.joda.time.TestLocalTime_Basics)  Time elapsed: 0.001 sec  <<< ERROR!
java.lang.NullPointerException
	at org.joda.time.LocalTime.minusSeconds(LocalTime.java:1047)
	at org.joda.time.TestLocalTime_Basics.testMinusSeconds_int(TestLocalTime_Basics.java:621)

testProperty(org.joda.time.TestLocalTime_Basics)  Time elapsed: 0 sec  <<< ERROR!
java.lang.NullPointerException
	at org.joda.time.LocalTime.isSupported(LocalTime.java:646)
	at org.joda.time.LocalTime.isSupported(LocalTime.java:625)
	at org.joda.time.LocalTime.property(LocalTime.java:1087)
	at org.joda.time.TestLocalTime_Basics.testProperty(TestLocalTime_Basics.java:740)

testIsSupported_DurationFieldType(org.joda.time.TestLocalTime_Basics)  Time elapsed: 0 sec  <<< ERROR!
java.lang.NullPointerException
	at org.joda.time.LocalTime.isSupported(LocalTime.java:646)
	at org.joda.time.TestLocalTime_Basics.testIsSupported_DurationFieldType(TestLocalTime_Basics.java:260)

testWithFieldAdded_DurationFieldType_int_7(org.joda.time.TestLocalTime_Basics)  Time elapsed: 0.001 sec  <<< ERROR!
java.lang.NullPointerException
	at org.joda.time.LocalTime.isSupported(LocalTime.java:646)
	at org.joda.time.LocalTime.withFieldAdded(LocalTime.java:818)
	at org.joda.time.TestLocalTime_Basics.testWithFieldAdded_DurationFieldType_int_7(TestLocalTime_Basics.java:507)

testWithFieldAdded_DurationFieldType_int_8(org.joda.time.TestLocalTime_Basics)  Time elapsed: 0 sec  <<< ERROR!
java.lang.NullPointerException
	at org.joda.time.LocalTime.isSupported(LocalTime.java:646)
	at org.joda.time.LocalTime.withFieldAdded(LocalTime.java:818)
	at org.joda.time.TestLocalTime_Basics.testWithFieldAdded_DurationFieldType_int_8(TestLocalTime_Basics.java:525)

testPropertyGetSecond(org.joda.time.TestLocalTime_Properties)  Time elapsed: 0.001 sec  <<< FAILURE!
junit.framework.AssertionFailedError: expected:<null> but was:<DurationField[seconds]>
	at junit.framework.Assert.fail(Assert.java:47)
	at junit.framework.Assert.failNotEquals(Assert.java:280)
	at junit.framework.Assert.assertEquals(Assert.java:64)
	at junit.framework.Assert.assertEquals(Assert.java:71)
	at org.joda.time.TestLocalTime_Properties.testPropertyGetSecond(TestLocalTime_Properties.java:455)

testPropertyCompareToSecond(org.joda.time.TestLocalTime_Properties)  Time elapsed: 0 sec  <<< ERROR!
java.lang.NullPointerException
	at org.joda.time.LocalTime.isSupported(LocalTime.java:646)
	at org.joda.time.LocalTime.isSupported(LocalTime.java:625)
	at org.joda.time.LocalTime.get(LocalTime.java:607)
	at org.joda.time.field.AbstractReadableInstantFieldProperty.compareTo(AbstractReadableInstantFieldProperty.java:424)
	at org.joda.time.TestLocalTime_Properties.testPropertyCompareToSecond(TestLocalTime_Properties.java:594)

testPropertyGetMilli(org.joda.time.TestLocalTime_Properties)  Time elapsed: 0.001 sec  <<< FAILURE!
junit.framework.AssertionFailedError: expected:<null> but was:<DurationField[seconds]>
	at junit.framework.Assert.fail(Assert.java:47)
	at junit.framework.Assert.failNotEquals(Assert.java:280)
	at junit.framework.Assert.assertEquals(Assert.java:64)
	at junit.framework.Assert.assertEquals(Assert.java:71)
	at org.joda.time.TestLocalTime_Properties.testPropertyGetMilli(TestLocalTime_Properties.java:627)

testPropertyCompareToMilli(org.joda.time.TestLocalTime_Properties)  Time elapsed: 0.001 sec  <<< ERROR!
java.lang.NullPointerException
	at org.joda.time.LocalTime.isSupported(LocalTime.java:646)
	at org.joda.time.LocalTime.isSupported(LocalTime.java:629)
	at org.joda.time.LocalTime.get(LocalTime.java:607)
	at org.joda.time.field.AbstractReadableInstantFieldProperty.compareTo(AbstractReadableInstantFieldProperty.java:424)
	at org.joda.time.TestLocalTime_Properties.testPropertyCompareToMilli(TestLocalTime_Properties.java:759)

testConstructor_RI_RP4(org.joda.time.TestMutableInterval_Constructors)  Time elapsed: 0.001 sec  <<< ERROR!
java.lang.NullPointerException
	at org.joda.time.chrono.BaseChronology.get(BaseChronology.java:284)
	at org.joda.time.base.BasePeriod.<init>(BasePeriod.java:236)
	at org.joda.time.Period.<init>(Period.java:382)
	at org.joda.time.TestMutableInterval_Constructors.testConstructor_RI_RP4(TestMutableInterval_Constructors.java:284)

testConstructor_RP_RI4(org.joda.time.TestMutableInterval_Constructors)  Time elapsed: 0.001 sec  <<< ERROR!
java.lang.NullPointerException
	at org.joda.time.chrono.BaseChronology.get(BaseChronology.java:284)
	at org.joda.time.base.BasePeriod.<init>(BasePeriod.java:236)
	at org.joda.time.Period.<init>(Period.java:382)
	at org.joda.time.TestMutableInterval_Constructors.testConstructor_RP_RI4(TestMutableInterval_Constructors.java:368)

testToPeriod_PeriodType1(org.joda.time.TestMutableInterval_Basics)  Time elapsed: 0 sec  <<< ERROR!
java.lang.NullPointerException
	at org.joda.time.chrono.BaseChronology.get(BaseChronology.java:260)
	at org.joda.time.base.BasePeriod.<init>(BasePeriod.java:110)
	at org.joda.time.Period.<init>(Period.java:490)
	at org.joda.time.base.AbstractInterval.toPeriod(AbstractInterval.java:447)
	at org.joda.time.TestMutableInterval_Basics.testToPeriod_PeriodType1(TestMutableInterval_Basics.java:433)

testToPeriod_PeriodType2(org.joda.time.TestMutableInterval_Basics)  Time elapsed: 0 sec  <<< ERROR!
java.lang.NullPointerException
	at org.joda.time.chrono.BaseChronology.get(BaseChronology.java:260)
	at org.joda.time.base.BasePeriod.<init>(BasePeriod.java:110)
	at org.joda.time.Period.<init>(Period.java:490)
	at org.joda.time.base.AbstractInterval.toPeriod(AbstractInterval.java:447)
	at org.joda.time.TestMutableInterval_Basics.testToPeriod_PeriodType2(TestMutableInterval_Basics.java:443)

testToPeriod(org.joda.time.TestMutableInterval_Basics)  Time elapsed: 0.001 sec  <<< ERROR!
java.lang.NullPointerException
	at org.joda.time.chrono.BaseChronology.get(BaseChronology.java:260)
	at org.joda.time.base.BasePeriod.<init>(BasePeriod.java:110)
	at org.joda.time.Period.<init>(Period.java:478)
	at org.joda.time.base.AbstractInterval.toPeriod(AbstractInterval.java:433)
	at org.joda.time.TestMutableInterval_Basics.testToPeriod(TestMutableInterval_Basics.java:422)

testSetPeriodAfterStart_RI1(org.joda.time.TestMutableInterval_Updates)  Time elapsed: 0.005 sec  <<< ERROR!
java.lang.NullPointerException
	at org.joda.time.chrono.BaseChronology.get(BaseChronology.java:284)
	at org.joda.time.base.BasePeriod.<init>(BasePeriod.java:236)
	at org.joda.time.Period.<init>(Period.java:382)
	at org.joda.time.TestMutableInterval_Updates.testSetPeriodAfterStart_RI1(TestMutableInterval_Updates.java:355)

testSePeriodAfterStart_RI2(org.joda.time.TestMutableInterval_Updates)  Time elapsed: 0 sec  <<< ERROR!
java.lang.NullPointerException
	at org.joda.time.chrono.BaseChronology.get(BaseChronology.java:284)
	at org.joda.time.base.BasePeriod.<init>(BasePeriod.java:236)
	at org.joda.time.Period.<init>(Period.java:382)
	at org.joda.time.TestMutableInterval_Updates.testSePeriodAfterStart_RI2(TestMutableInterval_Updates.java:363)

testSetPeriodBeforeEnd_RI1(org.joda.time.TestMutableInterval_Updates)  Time elapsed: 0 sec  <<< ERROR!
java.lang.NullPointerException
	at org.joda.time.chrono.BaseChronology.get(BaseChronology.java:284)
	at org.joda.time.base.BasePeriod.<init>(BasePeriod.java:236)
	at org.joda.time.Period.<init>(Period.java:382)
	at org.joda.time.TestMutableInterval_Updates.testSetPeriodBeforeEnd_RI1(TestMutableInterval_Updates.java:378)

testSePeriodBeforeEnd_RI2(org.joda.time.TestMutableInterval_Updates)  Time elapsed: 0.005 sec  <<< ERROR!
java.lang.NullPointerException
	at org.joda.time.chrono.BaseChronology.get(BaseChronology.java:284)
	at org.joda.time.base.BasePeriod.<init>(BasePeriod.java:236)
	at org.joda.time.Period.<init>(Period.java:382)
	at org.joda.time.TestMutableInterval_Updates.testSePeriodBeforeEnd_RI2(TestMutableInterval_Updates.java:386)

testConstructor_long1(org.joda.time.TestPeriod_Constructors)  Time elapsed: 0.001 sec  <<< ERROR!
java.lang.NullPointerException
	at org.joda.time.chrono.BaseChronology.get(BaseChronology.java:284)
	at org.joda.time.base.BasePeriod.<init>(BasePeriod.java:236)
	at org.joda.time.Period.<init>(Period.java:382)
	at org.joda.time.TestPeriod_Constructors.testConstructor_long1(TestPeriod_Constructors.java:127)

testConstructor_long2(org.joda.time.TestPeriod_Constructors)  Time elapsed: 0.001 sec  <<< ERROR!
java.lang.NullPointerException
	at org.joda.time.chrono.BaseChronology.get(BaseChronology.java:284)
	at org.joda.time.base.BasePeriod.<init>(BasePeriod.java:236)
	at org.joda.time.Period.<init>(Period.java:382)
	at org.joda.time.TestPeriod_Constructors.testConstructor_long2(TestPeriod_Constructors.java:144)

testConstructor_RI_RI7(org.joda.time.TestPeriod_Constructors)  Time elapsed: 0.001 sec  <<< ERROR!
java.lang.NullPointerException
	at org.joda.time.chrono.BaseChronology.get(BaseChronology.java:260)
	at org.joda.time.base.BasePeriod.<init>(BasePeriod.java:132)
	at org.joda.time.Period.<init>(Period.java:519)
	at org.joda.time.TestPeriod_Constructors.testConstructor_RI_RI7(TestPeriod_Constructors.java:712)

testConstructor_RI_RD1(org.joda.time.TestPeriod_Constructors)  Time elapsed: 0.001 sec  <<< ERROR!
java.lang.NullPointerException
	at org.joda.time.chrono.BaseChronology.get(BaseChronology.java:260)
	at org.joda.time.base.BasePeriod.<init>(BasePeriod.java:201)
	at org.joda.time.Period.<init>(Period.java:626)
	at org.joda.time.TestPeriod_Constructors.testConstructor_RI_RD1(TestPeriod_Constructors.java:1017)

testConstructor_RD_RI1(org.joda.time.TestPeriod_Constructors)  Time elapsed: 0.001 sec  <<< ERROR!
java.lang.NullPointerException
	at org.joda.time.chrono.BaseChronology.get(BaseChronology.java:260)
	at org.joda.time.base.BasePeriod.<init>(BasePeriod.java:219)
	at org.joda.time.Period.<init>(Period.java:647)
	at org.joda.time.TestPeriod_Constructors.testConstructor_RD_RI1(TestPeriod_Constructors.java:1081)

testConstructor_RI_RI6(org.joda.time.TestPeriod_Constructors)  Time elapsed: 0.001 sec  <<< ERROR!
java.lang.NullPointerException
	at org.joda.time.chrono.BaseChronology.get(BaseChronology.java:260)
	at org.joda.time.base.BasePeriod.<init>(BasePeriod.java:132)
	at org.joda.time.Period.<init>(Period.java:519)
	at org.joda.time.TestPeriod_Constructors.testConstructor_RI_RI6(TestPeriod_Constructors.java:696)

testConstructor_long3(org.joda.time.TestPeriod_Constructors)  Time elapsed: 0 sec  <<< ERROR!
java.lang.NullPointerException
	at org.joda.time.chrono.BaseChronology.get(BaseChronology.java:284)
	at org.joda.time.base.BasePeriod.<init>(BasePeriod.java:236)
	at org.joda.time.Period.<init>(Period.java:382)
	at org.joda.time.TestPeriod_Constructors.testConstructor_long3(TestPeriod_Constructors.java:162)

testConstructor_long_fixedZone(org.joda.time.TestPeriod_Constructors)  Time elapsed: 0.001 sec  <<< ERROR!
java.lang.NullPointerException
	at org.joda.time.chrono.BaseChronology.get(BaseChronology.java:284)
	at org.joda.time.base.BasePeriod.<init>(BasePeriod.java:236)
	at org.joda.time.Period.<init>(Period.java:382)
	at org.joda.time.TestPeriod_Constructors.testConstructor_long_fixedZone(TestPeriod_Constructors.java:184)

testConstructor_long_PeriodType1(org.joda.time.TestPeriod_Constructors)  Time elapsed: 0.006 sec  <<< ERROR!
java.lang.NullPointerException
	at org.joda.time.chrono.BaseChronology.get(BaseChronology.java:284)
	at org.joda.time.base.BasePeriod.<init>(BasePeriod.java:258)
	at org.joda.time.Period.<init>(Period.java:402)
	at org.joda.time.TestPeriod_Constructors.testConstructor_long_PeriodType1(TestPeriod_Constructors.java:206)

testConstructor_long_PeriodType3(org.joda.time.TestPeriod_Constructors)  Time elapsed: 0 sec  <<< ERROR!
java.lang.NullPointerException
	at org.joda.time.chrono.BaseChronology.get(BaseChronology.java:284)
	at org.joda.time.base.BasePeriod.<init>(BasePeriod.java:258)
	at org.joda.time.Period.<init>(Period.java:402)
	at org.joda.time.TestPeriod_Constructors.testConstructor_long_PeriodType3(TestPeriod_Constructors.java:240)

testConstructor_long_PeriodType4(org.joda.time.TestPeriod_Constructors)  Time elapsed: 0 sec  <<< ERROR!
java.lang.NullPointerException
	at org.joda.time.chrono.BaseChronology.get(BaseChronology.java:284)
	at org.joda.time.base.BasePeriod.<init>(BasePeriod.java:258)
	at org.joda.time.Period.<init>(Period.java:402)
	at org.joda.time.TestPeriod_Constructors.testConstructor_long_PeriodType4(TestPeriod_Constructors.java:257)

testConstructor_long_Chronology1(org.joda.time.TestPeriod_Constructors)  Time elapsed: 0 sec  <<< ERROR!
java.lang.NullPointerException
	at org.joda.time.chrono.BaseChronology.get(BaseChronology.java:284)
	at org.joda.time.base.BasePeriod.<init>(BasePeriod.java:258)
	at org.joda.time.Period.<init>(Period.java:423)
	at org.joda.time.TestPeriod_Constructors.testConstructor_long_Chronology1(TestPeriod_Constructors.java:275)

testConstructor_long_Chronology2(org.joda.time.TestPeriod_Constructors)  Time elapsed: 0 sec  <<< ERROR!
java.lang.NullPointerException
	at org.joda.time.chrono.BaseChronology.get(BaseChronology.java:284)
	at org.joda.time.base.BasePeriod.<init>(BasePeriod.java:258)
	at org.joda.time.Period.<init>(Period.java:423)
	at org.joda.time.TestPeriod_Constructors.testConstructor_long_Chronology2(TestPeriod_Constructors.java:292)

testConstructor_long_Chronology3(org.joda.time.TestPeriod_Constructors)  Time elapsed: 0 sec  <<< ERROR!
java.lang.NullPointerException
	at org.joda.time.chrono.BaseChronology.get(BaseChronology.java:284)
	at org.joda.time.base.BasePeriod.<init>(BasePeriod.java:258)
	at org.joda.time.Period.<init>(Period.java:423)
	at org.joda.time.TestPeriod_Constructors.testConstructor_long_Chronology3(TestPeriod_Constructors.java:309)

testConstructor_long_PeriodType_Chronology1(org.joda.time.TestPeriod_Constructors)  Time elapsed: 0 sec  <<< ERROR!
java.lang.NullPointerException
	at org.joda.time.chrono.BaseChronology.get(BaseChronology.java:284)
	at org.joda.time.base.BasePeriod.<init>(BasePeriod.java:258)
	at org.joda.time.Period.<init>(Period.java:444)
	at org.joda.time.TestPeriod_Constructors.testConstructor_long_PeriodType_Chronology1(TestPeriod_Constructors.java:327)

testConstructor_long_PeriodType_Chronology2(org.joda.time.TestPeriod_Constructors)  Time elapsed: 0 sec  <<< ERROR!
java.lang.NullPointerException
	at org.joda.time.chrono.BaseChronology.get(BaseChronology.java:284)
	at org.joda.time.base.BasePeriod.<init>(BasePeriod.java:258)
	at org.joda.time.Period.<init>(Period.java:444)
	at org.joda.time.TestPeriod_Constructors.testConstructor_long_PeriodType_Chronology2(TestPeriod_Constructors.java:344)

testConstructor_long_PeriodType_Chronology3(org.joda.time.TestPeriod_Constructors)  Time elapsed: 0 sec  <<< ERROR!
java.lang.NullPointerException
	at org.joda.time.chrono.BaseChronology.get(BaseChronology.java:284)
	at org.joda.time.base.BasePeriod.<init>(BasePeriod.java:258)
	at org.joda.time.Period.<init>(Period.java:444)
	at org.joda.time.TestPeriod_Constructors.testConstructor_long_PeriodType_Chronology3(TestPeriod_Constructors.java:361)

testConstructor_long_PeriodType_Chronology4(org.joda.time.TestPeriod_Constructors)  Time elapsed: 0.001 sec  <<< ERROR!
java.lang.NullPointerException
	at org.joda.time.chrono.BaseChronology.get(BaseChronology.java:284)
	at org.joda.time.base.BasePeriod.<init>(BasePeriod.java:258)
	at org.joda.time.Period.<init>(Period.java:444)
	at org.joda.time.TestPeriod_Constructors.testConstructor_long_PeriodType_Chronology4(TestPeriod_Constructors.java:378)

testConstructor_long_long_PeriodType1(org.joda.time.TestPeriod_Constructors)  Time elapsed: 0 sec  <<< ERROR!
java.lang.NullPointerException
	at org.joda.time.chrono.BaseChronology.get(BaseChronology.java:260)
	at org.joda.time.base.BasePeriod.<init>(BasePeriod.java:110)
	at org.joda.time.Period.<init>(Period.java:466)
	at org.joda.time.TestPeriod_Constructors.testConstructor_long_long_PeriodType1(TestPeriod_Constructors.java:496)

testConstructor_long_long_PeriodType2(org.joda.time.TestPeriod_Constructors)  Time elapsed: 0 sec  <<< ERROR!
java.lang.NullPointerException
	at org.joda.time.chrono.BaseChronology.get(BaseChronology.java:260)
	at org.joda.time.base.BasePeriod.<init>(BasePeriod.java:110)
	at org.joda.time.Period.<init>(Period.java:466)
	at org.joda.time.TestPeriod_Constructors.testConstructor_long_long_PeriodType2(TestPeriod_Constructors.java:511)

testToPeriod_PeriodType3(org.joda.time.TestPeriod_Constructors)  Time elapsed: 0 sec  <<< ERROR!
java.lang.NullPointerException
	at org.joda.time.chrono.BaseChronology.get(BaseChronology.java:260)
	at org.joda.time.base.BasePeriod.<init>(BasePeriod.java:110)
	at org.joda.time.Period.<init>(Period.java:466)
	at org.joda.time.TestPeriod_Constructors.testToPeriod_PeriodType3(TestPeriod_Constructors.java:541)

testConstructor_long_long_PeriodType3(org.joda.time.TestPeriod_Constructors)  Time elapsed: 0.001 sec  <<< ERROR!
java.lang.NullPointerException
	at org.joda.time.chrono.BaseChronology.get(BaseChronology.java:260)
	at org.joda.time.base.BasePeriod.<init>(BasePeriod.java:110)
	at org.joda.time.Period.<init>(Period.java:466)
	at org.joda.time.TestPeriod_Constructors.testConstructor_long_long_PeriodType3(TestPeriod_Constructors.java:526)

testConstructor_long_long_PeriodType_Chronology1(org.joda.time.TestPeriod_Constructors)  Time elapsed: 0 sec  <<< ERROR!
java.lang.NullPointerException
	at org.joda.time.chrono.BaseChronology.get(BaseChronology.java:260)
	at org.joda.time.base.BasePeriod.<init>(BasePeriod.java:110)
	at org.joda.time.Period.<init>(Period.java:490)
	at org.joda.time.TestPeriod_Constructors.testConstructor_long_long_PeriodType_Chronology1(TestPeriod_Constructors.java:589)

testConstructor_long_long_PeriodType_Chronology2(org.joda.time.TestPeriod_Constructors)  Time elapsed: 0.001 sec  <<< ERROR!
java.lang.NullPointerException
	at org.joda.time.chrono.BaseChronology.get(BaseChronology.java:260)
	at org.joda.time.base.BasePeriod.<init>(BasePeriod.java:110)
	at org.joda.time.Period.<init>(Period.java:490)
	at org.joda.time.TestPeriod_Constructors.testConstructor_long_long_PeriodType_Chronology2(TestPeriod_Constructors.java:604)

testConstructor_RI_RI_PeriodType1(org.joda.time.TestPeriod_Constructors)  Time elapsed: 0.003 sec  <<< ERROR!
java.lang.NullPointerException
	at org.joda.time.chrono.BaseChronology.get(BaseChronology.java:260)
	at org.joda.time.base.BasePeriod.<init>(BasePeriod.java:132)
	at org.joda.time.Period.<init>(Period.java:548)
	at org.joda.time.TestPeriod_Constructors.testConstructor_RI_RI_PeriodType1(TestPeriod_Constructors.java:728)

testConstructor_RI_RI_PeriodType2(org.joda.time.TestPeriod_Constructors)  Time elapsed: 0 sec  <<< ERROR!
java.lang.NullPointerException
	at org.joda.time.chrono.BaseChronology.get(BaseChronology.java:260)
	at org.joda.time.base.BasePeriod.<init>(BasePeriod.java:132)
	at org.joda.time.Period.<init>(Period.java:548)
	at org.joda.time.TestPeriod_Constructors.testConstructor_RI_RI_PeriodType2(TestPeriod_Constructors.java:743)

testConstructor_RI_RI_PeriodType3(org.joda.time.TestPeriod_Constructors)  Time elapsed: 0 sec  <<< ERROR!
java.lang.NullPointerException
	at org.joda.time.chrono.BaseChronology.get(BaseChronology.java:260)
	at org.joda.time.base.BasePeriod.<init>(BasePeriod.java:132)
	at org.joda.time.Period.<init>(Period.java:548)
	at org.joda.time.TestPeriod_Constructors.testConstructor_RI_RI_PeriodType3(TestPeriod_Constructors.java:758)

testConstructor_RI_RI_PeriodType4(org.joda.time.TestPeriod_Constructors)  Time elapsed: 0 sec  <<< ERROR!
java.lang.NullPointerException
	at org.joda.time.chrono.BaseChronology.get(BaseChronology.java:260)
	at org.joda.time.base.BasePeriod.<init>(BasePeriod.java:132)
	at org.joda.time.Period.<init>(Period.java:548)
	at org.joda.time.TestPeriod_Constructors.testConstructor_RI_RI_PeriodType4(TestPeriod_Constructors.java:773)

testConstructor_RP_RP1(org.joda.time.TestPeriod_Constructors)  Time elapsed: 0 sec  <<< ERROR!
java.lang.NullPointerException
	at org.joda.time.chrono.BaseChronology.get(BaseChronology.java:260)
	at org.joda.time.base.BasePeriod.<init>(BasePeriod.java:182)
	at org.joda.time.Period.<init>(Period.java:582)
	at org.joda.time.TestPeriod_Constructors.testConstructor_RP_RP1(TestPeriod_Constructors.java:805)

testConstructor_RP_RP2(org.joda.time.TestPeriod_Constructors)  Time elapsed: 0 sec  <<< ERROR!
java.lang.NullPointerException
	at org.joda.time.chrono.BaseChronology.get(BaseChronology.java:260)
	at org.joda.time.base.BasePeriod.<init>(BasePeriod.java:182)
	at org.joda.time.Period.<init>(Period.java:582)
	at org.joda.time.TestPeriod_Constructors.testConstructor_RP_RP2(TestPeriod_Constructors.java:821)

testConstructor_RP_RP2Local(org.joda.time.TestPeriod_Constructors)  Time elapsed: 0 sec  <<< ERROR!
java.lang.NullPointerException
	at org.joda.time.chrono.BaseChronology.get(BaseChronology.java:260)
	at org.joda.time.base.BasePeriod.<init>(BasePeriod.java:167)
	at org.joda.time.Period.<init>(Period.java:582)
	at org.joda.time.TestPeriod_Constructors.testConstructor_RP_RP2Local(TestPeriod_Constructors.java:836)

testConstructor_RP_RP_PeriodType1(org.joda.time.TestPeriod_Constructors)  Time elapsed: 0.001 sec  <<< ERROR!
java.lang.NullPointerException
	at org.joda.time.chrono.BaseChronology.get(BaseChronology.java:260)
	at org.joda.time.base.BasePeriod.<init>(BasePeriod.java:182)
	at org.joda.time.Period.<init>(Period.java:616)
	at org.joda.time.TestPeriod_Constructors.testConstructor_RP_RP_PeriodType1(TestPeriod_Constructors.java:911)

testConstructor_RI_RD_PeriodType1(org.joda.time.TestPeriod_Constructors)  Time elapsed: 0.001 sec  <<< ERROR!
java.lang.NullPointerException
	at org.joda.time.chrono.BaseChronology.get(BaseChronology.java:260)
	at org.joda.time.base.BasePeriod.<init>(BasePeriod.java:201)
	at org.joda.time.Period.<init>(Period.java:637)
	at org.joda.time.TestPeriod_Constructors.testConstructor_RI_RD_PeriodType1(TestPeriod_Constructors.java:1049)

testConstructor_RD_RI_PeriodType1(org.joda.time.TestPeriod_Constructors)  Time elapsed: 0 sec  <<< ERROR!
java.lang.NullPointerException
	at org.joda.time.chrono.BaseChronology.get(BaseChronology.java:260)
	at org.joda.time.base.BasePeriod.<init>(BasePeriod.java:219)
	at org.joda.time.Period.<init>(Period.java:658)
	at org.joda.time.TestPeriod_Constructors.testConstructor_RD_RI_PeriodType1(TestPeriod_Constructors.java:1113)

testConstructor_trickyDifferences_RI_RI_toFeb_standardYear(org.joda.time.TestPeriod_Constructors)  Time elapsed: 0.001 sec  <<< ERROR!
java.lang.NullPointerException
	at org.joda.time.chrono.BaseChronology.get(BaseChronology.java:260)
	at org.joda.time.base.BasePeriod.<init>(BasePeriod.java:132)
	at org.joda.time.Period.<init>(Period.java:519)
	at org.joda.time.TestPeriod_Constructors.testConstructor_trickyDifferences_RI_RI_toFeb_standardYear(TestPeriod_Constructors.java:1362)

testConstructor_trickyDifferences_RI_RI_toFeb_leapYear(org.joda.time.TestPeriod_Constructors)  Time elapsed: 0.001 sec  <<< ERROR!
java.lang.NullPointerException
	at org.joda.time.chrono.BaseChronology.get(BaseChronology.java:260)
	at org.joda.time.base.BasePeriod.<init>(BasePeriod.java:132)
	at org.joda.time.Period.<init>(Period.java:519)
	at org.joda.time.TestPeriod_Constructors.testConstructor_trickyDifferences_RI_RI_toFeb_leapYear(TestPeriod_Constructors.java:1370)

testConstructor_trickyDifferences_RI_RI_toFeb_exactMonths(org.joda.time.TestPeriod_Constructors)  Time elapsed: 0 sec  <<< ERROR!
java.lang.NullPointerException
	at org.joda.time.chrono.BaseChronology.get(BaseChronology.java:260)
	at org.joda.time.base.BasePeriod.<init>(BasePeriod.java:132)
	at org.joda.time.Period.<init>(Period.java:519)
	at org.joda.time.TestPeriod_Constructors.testConstructor_trickyDifferences_RI_RI_toFeb_exactMonths(TestPeriod_Constructors.java:1378)

testConstructor_trickyDifferences_RI_RI_toFeb_endOfMonth1(org.joda.time.TestPeriod_Constructors)  Time elapsed: 0.001 sec  <<< ERROR!
java.lang.NullPointerException
	at org.joda.time.chrono.BaseChronology.get(BaseChronology.java:260)
	at org.joda.time.base.BasePeriod.<init>(BasePeriod.java:132)
	at org.joda.time.Period.<init>(Period.java:519)
	at org.joda.time.TestPeriod_Constructors.testConstructor_trickyDifferences_RI_RI_toFeb_endOfMonth1(TestPeriod_Constructors.java:1386)

testConstructor_trickyDifferences_RI_RI_toFeb_endOfMonth2(org.joda.time.TestPeriod_Constructors)  Time elapsed: 0 sec  <<< ERROR!
java.lang.NullPointerException
	at org.joda.time.chrono.BaseChronology.get(BaseChronology.java:260)
	at org.joda.time.base.BasePeriod.<init>(BasePeriod.java:132)
	at org.joda.time.Period.<init>(Period.java:519)
	at org.joda.time.TestPeriod_Constructors.testConstructor_trickyDifferences_RI_RI_toFeb_endOfMonth2(TestPeriod_Constructors.java:1394)

testConstructor_trickyDifferences_RI_RI_toFeb_endOfMonth3(org.joda.time.TestPeriod_Constructors)  Time elapsed: 0.001 sec  <<< ERROR!
java.lang.NullPointerException
	at org.joda.time.chrono.BaseChronology.get(BaseChronology.java:260)
	at org.joda.time.base.BasePeriod.<init>(BasePeriod.java:132)
	at org.joda.time.Period.<init>(Period.java:519)
	at org.joda.time.TestPeriod_Constructors.testConstructor_trickyDifferences_RI_RI_toFeb_endOfMonth3(TestPeriod_Constructors.java:1402)

testConstructor_trickyDifferences_RI_RI_toMar_endOfMonth1(org.joda.time.TestPeriod_Constructors)  Time elapsed: 0.001 sec  <<< ERROR!
java.lang.NullPointerException
	at org.joda.time.chrono.BaseChronology.get(BaseChronology.java:260)
	at org.joda.time.base.BasePeriod.<init>(BasePeriod.java:132)
	at org.joda.time.Period.<init>(Period.java:519)
	at org.joda.time.TestPeriod_Constructors.testConstructor_trickyDifferences_RI_RI_toMar_endOfMonth1(TestPeriod_Constructors.java:1410)

testConstructor_trickyDifferences_RI_RI_toMar_endOfMonth2(org.joda.time.TestPeriod_Constructors)  Time elapsed: 0 sec  <<< ERROR!
java.lang.NullPointerException
	at org.joda.time.chrono.BaseChronology.get(BaseChronology.java:260)
	at org.joda.time.base.BasePeriod.<init>(BasePeriod.java:132)
	at org.joda.time.Period.<init>(Period.java:519)
	at org.joda.time.TestPeriod_Constructors.testConstructor_trickyDifferences_RI_RI_toMar_endOfMonth2(TestPeriod_Constructors.java:1418)

testConstructor_trickyDifferences_LD_LD_toFeb_standardYear(org.joda.time.TestPeriod_Constructors)  Time elapsed: 0.001 sec  <<< ERROR!
java.lang.NullPointerException
	at org.joda.time.chrono.BaseChronology.get(BaseChronology.java:260)
	at org.joda.time.base.BasePeriod.<init>(BasePeriod.java:167)
	at org.joda.time.Period.<init>(Period.java:582)
	at org.joda.time.TestPeriod_Constructors.testConstructor_trickyDifferences_LD_LD_toFeb_standardYear(TestPeriod_Constructors.java:1427)

testConstructor_trickyDifferences_LD_LD_toFeb_leapYear(org.joda.time.TestPeriod_Constructors)  Time elapsed: 0 sec  <<< ERROR!
java.lang.NullPointerException
	at org.joda.time.chrono.BaseChronology.get(BaseChronology.java:260)
	at org.joda.time.base.BasePeriod.<init>(BasePeriod.java:167)
	at org.joda.time.Period.<init>(Period.java:582)
	at org.joda.time.TestPeriod_Constructors.testConstructor_trickyDifferences_LD_LD_toFeb_leapYear(TestPeriod_Constructors.java:1435)

testConstructor_trickyDifferences_LD_LD_toFeb_exactMonths(org.joda.time.TestPeriod_Constructors)  Time elapsed: 0 sec  <<< ERROR!
java.lang.NullPointerException
	at org.joda.time.chrono.BaseChronology.get(BaseChronology.java:260)
	at org.joda.time.base.BasePeriod.<init>(BasePeriod.java:167)
	at org.joda.time.Period.<init>(Period.java:582)
	at org.joda.time.TestPeriod_Constructors.testConstructor_trickyDifferences_LD_LD_toFeb_exactMonths(TestPeriod_Constructors.java:1443)

testConstructor_trickyDifferences_LD_LD_toFeb_endOfMonth1(org.joda.time.TestPeriod_Constructors)  Time elapsed: 0.001 sec  <<< ERROR!
java.lang.NullPointerException
	at org.joda.time.chrono.BaseChronology.get(BaseChronology.java:260)
	at org.joda.time.base.BasePeriod.<init>(BasePeriod.java:167)
	at org.joda.time.Period.<init>(Period.java:582)
	at org.joda.time.TestPeriod_Constructors.testConstructor_trickyDifferences_LD_LD_toFeb_endOfMonth1(TestPeriod_Constructors.java:1451)

testConstructor_long_long_Chronology1(org.joda.time.TestPeriod_Constructors)  Time elapsed: 0 sec  <<< ERROR!
java.lang.NullPointerException
	at org.joda.time.chrono.BaseChronology.get(BaseChronology.java:260)
	at org.joda.time.base.BasePeriod.<init>(BasePeriod.java:110)
	at org.joda.time.Period.<init>(Period.java:478)
	at org.joda.time.TestPeriod_Constructors.testConstructor_long_long_Chronology1(TestPeriod_Constructors.java:558)

testConstructor_long_long_Chronology2(org.joda.time.TestPeriod_Constructors)  Time elapsed: 0.001 sec  <<< ERROR!
java.lang.NullPointerException
	at org.joda.time.chrono.BaseChronology.get(BaseChronology.java:260)
	at org.joda.time.base.BasePeriod.<init>(BasePeriod.java:110)
	at org.joda.time.Period.<init>(Period.java:478)
	at org.joda.time.TestPeriod_Constructors.testConstructor_long_long_Chronology2(TestPeriod_Constructors.java:573)

testConstructor_long_long1(org.joda.time.TestPeriod_Constructors)  Time elapsed: 0.001 sec  <<< ERROR!
java.lang.NullPointerException
	at org.joda.time.chrono.BaseChronology.get(BaseChronology.java:260)
	at org.joda.time.base.BasePeriod.<init>(BasePeriod.java:110)
	at org.joda.time.Period.<init>(Period.java:455)
	at org.joda.time.TestPeriod_Constructors.testConstructor_long_long1(TestPeriod_Constructors.java:465)

testConstructor_RI_RI1(org.joda.time.TestPeriod_Constructors)  Time elapsed: 0 sec  <<< ERROR!
java.lang.NullPointerException
	at org.joda.time.chrono.BaseChronology.get(BaseChronology.java:260)
	at org.joda.time.base.BasePeriod.<init>(BasePeriod.java:132)
	at org.joda.time.Period.<init>(Period.java:519)
	at org.joda.time.TestPeriod_Constructors.testConstructor_RI_RI1(TestPeriod_Constructors.java:620)

testConstructor_RI_RI2(org.joda.time.TestPeriod_Constructors)  Time elapsed: 0.001 sec  <<< ERROR!
java.lang.NullPointerException
	at org.joda.time.chrono.BaseChronology.get(BaseChronology.java:260)
	at org.joda.time.base.BasePeriod.<init>(BasePeriod.java:132)
	at org.joda.time.Period.<init>(Period.java:519)
	at org.joda.time.TestPeriod_Constructors.testConstructor_RI_RI2(TestPeriod_Constructors.java:635)

testConstructor_RI_RI3(org.joda.time.TestPeriod_Constructors)  Time elapsed: 0 sec  <<< ERROR!
java.lang.NullPointerException
	at org.joda.time.chrono.BaseChronology.get(BaseChronology.java:260)
	at org.joda.time.base.BasePeriod.<init>(BasePeriod.java:132)
	at org.joda.time.Period.<init>(Period.java:519)
	at org.joda.time.TestPeriod_Constructors.testConstructor_RI_RI3(TestPeriod_Constructors.java:650)

testConstructor_RI_RI4(org.joda.time.TestPeriod_Constructors)  Time elapsed: 0.001 sec  <<< ERROR!
java.lang.NullPointerException
	at org.joda.time.chrono.BaseChronology.get(BaseChronology.java:260)
	at org.joda.time.base.BasePeriod.<init>(BasePeriod.java:132)
	at org.joda.time.Period.<init>(Period.java:519)
	at org.joda.time.TestPeriod_Constructors.testConstructor_RI_RI4(TestPeriod_Constructors.java:665)

testConstructor_long_long2(org.joda.time.TestPeriod_Constructors)  Time elapsed: 0 sec  <<< ERROR!
java.lang.NullPointerException
	at org.joda.time.chrono.BaseChronology.get(BaseChronology.java:260)
	at org.joda.time.base.BasePeriod.<init>(BasePeriod.java:110)
	at org.joda.time.Period.<init>(Period.java:455)
	at org.joda.time.TestPeriod_Constructors.testConstructor_long_long2(TestPeriod_Constructors.java:480)

testConstructor_trickyDifferences_LD_LD_toFeb_endOfMonth2(org.joda.time.TestPeriod_Constructors)  Time elapsed: 0.001 sec  <<< ERROR!
java.lang.NullPointerException
	at org.joda.time.chrono.BaseChronology.get(BaseChronology.java:260)
	at org.joda.time.base.BasePeriod.<init>(BasePeriod.java:167)
	at org.joda.time.Period.<init>(Period.java:582)
	at org.joda.time.TestPeriod_Constructors.testConstructor_trickyDifferences_LD_LD_toFeb_endOfMonth2(TestPeriod_Constructors.java:1459)

testConstructor_trickyDifferences_LD_LD_toFeb_endOfMonth3(org.joda.time.TestPeriod_Constructors)  Time elapsed: 0 sec  <<< ERROR!
java.lang.NullPointerException
	at org.joda.time.chrono.BaseChronology.get(BaseChronology.java:260)
	at org.joda.time.base.BasePeriod.<init>(BasePeriod.java:167)
	at org.joda.time.Period.<init>(Period.java:582)
	at org.joda.time.TestPeriod_Constructors.testConstructor_trickyDifferences_LD_LD_toFeb_endOfMonth3(TestPeriod_Constructors.java:1467)

testConstructor_trickyDifferences_LD_LD_toMar_endOfMonth1(org.joda.time.TestPeriod_Constructors)  Time elapsed: 0.001 sec  <<< ERROR!
java.lang.NullPointerException
	at org.joda.time.chrono.BaseChronology.get(BaseChronology.java:260)
	at org.joda.time.base.BasePeriod.<init>(BasePeriod.java:167)
	at org.joda.time.Period.<init>(Period.java:582)
	at org.joda.time.TestPeriod_Constructors.testConstructor_trickyDifferences_LD_LD_toMar_endOfMonth1(TestPeriod_Constructors.java:1475)

testConstructor_trickyDifferences_LD_LD_toMar_endOfMonth2(org.joda.time.TestPeriod_Constructors)  Time elapsed: 0 sec  <<< ERROR!
java.lang.NullPointerException
	at org.joda.time.chrono.BaseChronology.get(BaseChronology.java:260)
	at org.joda.time.base.BasePeriod.<init>(BasePeriod.java:167)
	at org.joda.time.Period.<init>(Period.java:582)
	at org.joda.time.TestPeriod_Constructors.testConstructor_trickyDifferences_LD_LD_toMar_endOfMonth2(TestPeriod_Constructors.java:1483)

testToString(org.joda.time.TestPeriod_Basics)  Time elapsed: 0.001 sec  <<< ERROR!
java.lang.NullPointerException
	at org.joda.time.chrono.BaseChronology.get(BaseChronology.java:284)
	at org.joda.time.base.BasePeriod.<init>(BasePeriod.java:236)
	at org.joda.time.Period.<init>(Period.java:382)
	at org.joda.time.TestPeriod_Basics.testToString(TestPeriod_Basics.java:477)

testEqualsHashCode(org.joda.time.TestPeriod_Basics)  Time elapsed: 0 sec  <<< ERROR!
java.lang.NullPointerException
	at org.joda.time.chrono.BaseChronology.get(BaseChronology.java:284)
	at org.joda.time.base.BasePeriod.<init>(BasePeriod.java:236)
	at org.joda.time.Period.<init>(Period.java:382)
	at org.joda.time.TestPeriod_Basics.testEqualsHashCode(TestPeriod_Basics.java:196)

testSerialization(org.joda.time.TestPeriod_Basics)  Time elapsed: 0 sec  <<< ERROR!
java.lang.NullPointerException
	at org.joda.time.chrono.BaseChronology.get(BaseChronology.java:284)
	at org.joda.time.base.BasePeriod.<init>(BasePeriod.java:236)
	at org.joda.time.Period.<init>(Period.java:382)
	at org.joda.time.TestPeriod_Basics.testSerialization(TestPeriod_Basics.java:228)

testWithPeriodType2(org.joda.time.TestPeriod_Basics)  Time elapsed: 0.001 sec  <<< ERROR!
java.lang.NullPointerException
	at org.joda.time.chrono.BaseChronology.get(BaseChronology.java:284)
	at org.joda.time.base.BasePeriod.<init>(BasePeriod.java:236)
	at org.joda.time.Period.<init>(Period.java:382)
	at org.joda.time.TestPeriod_Basics.testWithPeriodType2(TestPeriod_Basics.java:532)

testWithPeriodType4(org.joda.time.TestPeriod_Basics)  Time elapsed: 0 sec  <<< ERROR!
java.lang.NullPointerException
	at org.joda.time.chrono.BaseChronology.get(BaseChronology.java:284)
	at org.joda.time.base.BasePeriod.<init>(BasePeriod.java:236)
	at org.joda.time.Period.<init>(Period.java:382)
	at org.joda.time.TestPeriod_Basics.testWithPeriodType4(TestPeriod_Basics.java:548)

testToMutablePeriod(org.joda.time.TestPeriod_Basics)  Time elapsed: 0 sec  <<< ERROR!
java.lang.NullPointerException
	at org.joda.time.chrono.BaseChronology.get(BaseChronology.java:284)
	at org.joda.time.base.BasePeriod.<init>(BasePeriod.java:236)
	at org.joda.time.Period.<init>(Period.java:382)
	at org.joda.time.TestPeriod_Basics.testToMutablePeriod(TestPeriod_Basics.java:503)

testToDurationFrom(org.joda.time.TestPeriod_Basics)  Time elapsed: 0.001 sec  <<< ERROR!
java.lang.NullPointerException
	at org.joda.time.chrono.BaseChronology.get(BaseChronology.java:284)
	at org.joda.time.base.BasePeriod.<init>(BasePeriod.java:236)
	at org.joda.time.Period.<init>(Period.java:382)
	at org.joda.time.TestPeriod_Basics.testToDurationFrom(TestPeriod_Basics.java:515)

testToDurationTo(org.joda.time.TestPeriod_Basics)  Time elapsed: 0 sec  <<< ERROR!
java.lang.NullPointerException
	at org.joda.time.chrono.BaseChronology.get(BaseChronology.java:284)
	at org.joda.time.base.BasePeriod.<init>(BasePeriod.java:236)
	at org.joda.time.Period.<init>(Period.java:382)
	at org.joda.time.TestPeriod_Basics.testToDurationTo(TestPeriod_Basics.java:520)

testWithPeriodType1(org.joda.time.TestPeriod_Basics)  Time elapsed: 0.001 sec  <<< ERROR!
java.lang.NullPointerException
	at org.joda.time.chrono.BaseChronology.get(BaseChronology.java:284)
	at org.joda.time.base.BasePeriod.<init>(BasePeriod.java:236)
	at org.joda.time.Period.<init>(Period.java:382)
	at org.joda.time.TestPeriod_Basics.testWithPeriodType1(TestPeriod_Basics.java:526)

testNormalizedStandard_periodType_yearMonth3(org.joda.time.TestPeriod_Basics)  Time elapsed: 0 sec  <<< ERROR!
java.lang.NullPointerException
	at org.joda.time.chrono.BaseChronology.get(BaseChronology.java:284)
	at org.joda.time.base.BasePeriod.<init>(BasePeriod.java:258)
	at org.joda.time.Period.<init>(Period.java:444)
	at org.joda.time.Period.normalizedStandard(Period.java:1644)
	at org.joda.time.TestPeriod_Basics.testNormalizedStandard_periodType_yearMonth3(TestPeriod_Basics.java:1479)

testNormalizedStandard_periodType_weekDay1(org.joda.time.TestPeriod_Basics)  Time elapsed: 0.001 sec  <<< ERROR!
java.lang.NullPointerException
	at org.joda.time.chrono.BaseChronology.get(BaseChronology.java:284)
	at org.joda.time.base.BasePeriod.<init>(BasePeriod.java:258)
	at org.joda.time.Period.<init>(Period.java:444)
	at org.joda.time.Period.normalizedStandard(Period.java:1644)
	at org.joda.time.TestPeriod_Basics.testNormalizedStandard_periodType_weekDay1(TestPeriod_Basics.java:1486)

testNormalizedStandard_periodType_weekDay3(org.joda.time.TestPeriod_Basics)  Time elapsed: 0 sec  <<< ERROR!
java.lang.NullPointerException
	at org.joda.time.chrono.BaseChronology.get(BaseChronology.java:284)
	at org.joda.time.base.BasePeriod.<init>(BasePeriod.java:258)
	at org.joda.time.Period.<init>(Period.java:444)
	at org.joda.time.Period.normalizedStandard(Period.java:1644)
	at org.joda.time.TestPeriod_Basics.testNormalizedStandard_periodType_weekDay3(TestPeriod_Basics.java:1501)

testNormalizedStandard_periodType_yearMonthWeekDay(org.joda.time.TestPeriod_Basics)  Time elapsed: 0.001 sec  <<< ERROR!
java.lang.NullPointerException
	at org.joda.time.chrono.BaseChronology.get(BaseChronology.java:284)
	at org.joda.time.base.BasePeriod.<init>(BasePeriod.java:258)
	at org.joda.time.Period.<init>(Period.java:444)
	at org.joda.time.Period.normalizedStandard(Period.java:1644)
	at org.joda.time.TestPeriod_Basics.testNormalizedStandard_periodType_yearMonthWeekDay(TestPeriod_Basics.java:1508)

testNormalizedStandard_periodType_yearMonthDay(org.joda.time.TestPeriod_Basics)  Time elapsed: 0 sec  <<< ERROR!
java.lang.NullPointerException
	at org.joda.time.chrono.BaseChronology.get(BaseChronology.java:284)
	at org.joda.time.base.BasePeriod.<init>(BasePeriod.java:258)
	at org.joda.time.Period.<init>(Period.java:444)
	at org.joda.time.Period.normalizedStandard(Period.java:1644)
	at org.joda.time.TestPeriod_Basics.testNormalizedStandard_periodType_yearMonthDay(TestPeriod_Basics.java:1515)

testToPeriod(org.joda.time.TestPeriod_Basics)  Time elapsed: 0 sec  <<< ERROR!
java.lang.NullPointerException
	at org.joda.time.chrono.BaseChronology.get(BaseChronology.java:284)
	at org.joda.time.base.BasePeriod.<init>(BasePeriod.java:236)
	at org.joda.time.Period.<init>(Period.java:382)
	at org.joda.time.TestPeriod_Basics.testToPeriod(TestPeriod_Basics.java:497)

testNormalizedStandard_weekDay1(org.joda.time.TestPeriod_Basics)  Time elapsed: 0.001 sec  <<< ERROR!
java.lang.NullPointerException
	at org.joda.time.chrono.BaseChronology.get(BaseChronology.java:284)
	at org.joda.time.base.BasePeriod.<init>(BasePeriod.java:258)
	at org.joda.time.Period.<init>(Period.java:444)
	at org.joda.time.Period.normalizedStandard(Period.java:1644)
	at org.joda.time.Period.normalizedStandard(Period.java:1601)
	at org.joda.time.TestPeriod_Basics.testNormalizedStandard_weekDay1(TestPeriod_Basics.java:1419)

testNormalizedStandard_yearMonthWeekDay(org.joda.time.TestPeriod_Basics)  Time elapsed: 0 sec  <<< ERROR!
java.lang.NullPointerException
	at org.joda.time.chrono.BaseChronology.get(BaseChronology.java:284)
	at org.joda.time.base.BasePeriod.<init>(BasePeriod.java:258)
	at org.joda.time.Period.<init>(Period.java:444)
	at org.joda.time.Period.normalizedStandard(Period.java:1644)
	at org.joda.time.Period.normalizedStandard(Period.java:1601)
	at org.joda.time.TestPeriod_Basics.testNormalizedStandard_yearMonthWeekDay(TestPeriod_Basics.java:1434)

testNormalizedStandard_yearMonthDay(org.joda.time.TestPeriod_Basics)  Time elapsed: 0.001 sec  <<< ERROR!
java.lang.NullPointerException
	at org.joda.time.chrono.BaseChronology.get(BaseChronology.java:284)
	at org.joda.time.base.BasePeriod.<init>(BasePeriod.java:258)
	at org.joda.time.Period.<init>(Period.java:444)
	at org.joda.time.Period.normalizedStandard(Period.java:1644)
	at org.joda.time.Period.normalizedStandard(Period.java:1601)
	at org.joda.time.TestPeriod_Basics.testNormalizedStandard_yearMonthDay(TestPeriod_Basics.java:1441)

testNormalizedStandard_negative(org.joda.time.TestPeriod_Basics)  Time elapsed: 0 sec  <<< ERROR!
java.lang.NullPointerException
	at org.joda.time.chrono.BaseChronology.get(BaseChronology.java:284)
	at org.joda.time.base.BasePeriod.<init>(BasePeriod.java:258)
	at org.joda.time.Period.<init>(Period.java:444)
	at org.joda.time.Period.normalizedStandard(Period.java:1644)
	at org.joda.time.Period.normalizedStandard(Period.java:1601)
	at org.joda.time.TestPeriod_Basics.testNormalizedStandard_negative(TestPeriod_Basics.java:1448)

testNormalizedStandard_fullNegative(org.joda.time.TestPeriod_Basics)  Time elapsed: 0.001 sec  <<< ERROR!
java.lang.NullPointerException
	at org.joda.time.chrono.BaseChronology.get(BaseChronology.java:284)
	at org.joda.time.base.BasePeriod.<init>(BasePeriod.java:258)
	at org.joda.time.Period.<init>(Period.java:444)
	at org.joda.time.Period.normalizedStandard(Period.java:1644)
	at org.joda.time.Period.normalizedStandard(Period.java:1601)
	at org.joda.time.TestPeriod_Basics.testNormalizedStandard_fullNegative(TestPeriod_Basics.java:1455)

testConstructor_long1(org.joda.time.TestMutablePeriod_Constructors)  Time elapsed: 0 sec  <<< ERROR!
java.lang.NullPointerException
	at org.joda.time.chrono.BaseChronology.get(BaseChronology.java:284)
	at org.joda.time.base.BasePeriod.<init>(BasePeriod.java:236)
	at org.joda.time.MutablePeriod.<init>(MutablePeriod.java:180)
	at org.joda.time.TestMutablePeriod_Constructors.testConstructor_long1(TestMutablePeriod_Constructors.java:158)

testConstructor_long2(org.joda.time.TestMutablePeriod_Constructors)  Time elapsed: 0.001 sec  <<< ERROR!
java.lang.NullPointerException
	at org.joda.time.chrono.BaseChronology.get(BaseChronology.java:284)
	at org.joda.time.base.BasePeriod.<init>(BasePeriod.java:236)
	at org.joda.time.MutablePeriod.<init>(MutablePeriod.java:180)
	at org.joda.time.TestMutablePeriod_Constructors.testConstructor_long2(TestMutablePeriod_Constructors.java:175)

testConstructor_Object_Chronology1(org.joda.time.TestMutablePeriod_Constructors)  Time elapsed: 0 sec  <<< ERROR!
java.lang.NullPointerException
	at org.joda.time.chrono.BaseChronology.get(BaseChronology.java:284)
	at org.joda.time.convert.ReadableDurationConverter.setInto(ReadableDurationConverter.java:75)
	at org.joda.time.base.BasePeriod.<init>(BasePeriod.java:279)
	at org.joda.time.MutablePeriod.<init>(MutablePeriod.java:408)
	at org.joda.time.TestMutablePeriod_Constructors.testConstructor_Object_Chronology1(TestMutablePeriod_Constructors.java:942)

testConstructor_Object_Chronology2(org.joda.time.TestMutablePeriod_Constructors)  Time elapsed: 0.001 sec  <<< ERROR!
java.lang.NullPointerException
	at org.joda.time.chrono.BaseChronology.get(BaseChronology.java:284)
	at org.joda.time.convert.ReadableDurationConverter.setInto(ReadableDurationConverter.java:75)
	at org.joda.time.base.BasePeriod.<init>(BasePeriod.java:279)
	at org.joda.time.MutablePeriod.<init>(MutablePeriod.java:408)
	at org.joda.time.TestMutablePeriod_Constructors.testConstructor_Object_Chronology2(TestMutablePeriod_Constructors.java:960)

testConstructor_RI_RD1(org.joda.time.TestMutablePeriod_Constructors)  Time elapsed: 0.001 sec  <<< ERROR!
java.lang.NullPointerException
	at org.joda.time.chrono.BaseChronology.get(BaseChronology.java:260)
	at org.joda.time.base.BasePeriod.<init>(BasePeriod.java:201)
	at org.joda.time.MutablePeriod.<init>(MutablePeriod.java:326)
	at org.joda.time.TestMutablePeriod_Constructors.testConstructor_RI_RD1(TestMutablePeriod_Constructors.java:763)

testConstructor_long3(org.joda.time.TestMutablePeriod_Constructors)  Time elapsed: 0 sec  <<< ERROR!
java.lang.NullPointerException
	at org.joda.time.chrono.BaseChronology.get(BaseChronology.java:284)
	at org.joda.time.base.BasePeriod.<init>(BasePeriod.java:236)
	at org.joda.time.MutablePeriod.<init>(MutablePeriod.java:180)
	at org.joda.time.TestMutablePeriod_Constructors.testConstructor_long3(TestMutablePeriod_Constructors.java:193)

testConstructor_long_PeriodType1(org.joda.time.TestMutablePeriod_Constructors)  Time elapsed: 0.001 sec  <<< ERROR!
java.lang.NullPointerException
	at org.joda.time.chrono.BaseChronology.get(BaseChronology.java:284)
	at org.joda.time.base.BasePeriod.<init>(BasePeriod.java:258)
	at org.joda.time.MutablePeriod.<init>(MutablePeriod.java:200)
	at org.joda.time.TestMutablePeriod_Constructors.testConstructor_long_PeriodType1(TestMutablePeriod_Constructors.java:212)

testConstructor_long_PeriodType3(org.joda.time.TestMutablePeriod_Constructors)  Time elapsed: 0 sec  <<< ERROR!
java.lang.NullPointerException
	at org.joda.time.chrono.BaseChronology.get(BaseChronology.java:284)
	at org.joda.time.base.BasePeriod.<init>(BasePeriod.java:258)
	at org.joda.time.MutablePeriod.<init>(MutablePeriod.java:200)
	at org.joda.time.TestMutablePeriod_Constructors.testConstructor_long_PeriodType3(TestMutablePeriod_Constructors.java:246)

testConstructor_long_PeriodType4(org.joda.time.TestMutablePeriod_Constructors)  Time elapsed: 0.001 sec  <<< ERROR!
java.lang.NullPointerException
	at org.joda.time.chrono.BaseChronology.get(BaseChronology.java:284)
	at org.joda.time.base.BasePeriod.<init>(BasePeriod.java:258)
	at org.joda.time.MutablePeriod.<init>(MutablePeriod.java:200)
	at org.joda.time.TestMutablePeriod_Constructors.testConstructor_long_PeriodType4(TestMutablePeriod_Constructors.java:263)

testConstructor_long_Chronology1(org.joda.time.TestMutablePeriod_Constructors)  Time elapsed: 0 sec  <<< ERROR!
java.lang.NullPointerException
	at org.joda.time.chrono.BaseChronology.get(BaseChronology.java:284)
	at org.joda.time.base.BasePeriod.<init>(BasePeriod.java:258)
	at org.joda.time.MutablePeriod.<init>(MutablePeriod.java:221)
	at org.joda.time.TestMutablePeriod_Constructors.testConstructor_long_Chronology1(TestMutablePeriod_Constructors.java:281)

testConstructor_long_Chronology2(org.joda.time.TestMutablePeriod_Constructors)  Time elapsed: 0.001 sec  <<< ERROR!
java.lang.NullPointerException
	at org.joda.time.chrono.BaseChronology.get(BaseChronology.java:284)
	at org.joda.time.base.BasePeriod.<init>(BasePeriod.java:258)
	at org.joda.time.MutablePeriod.<init>(MutablePeriod.java:221)
	at org.joda.time.TestMutablePeriod_Constructors.testConstructor_long_Chronology2(TestMutablePeriod_Constructors.java:298)

testConstructor_long_Chronology3(org.joda.time.TestMutablePeriod_Constructors)  Time elapsed: 0 sec  <<< ERROR!
java.lang.NullPointerException
	at org.joda.time.chrono.BaseChronology.get(BaseChronology.java:284)
	at org.joda.time.base.BasePeriod.<init>(BasePeriod.java:258)
	at org.joda.time.MutablePeriod.<init>(MutablePeriod.java:221)
	at org.joda.time.TestMutablePeriod_Constructors.testConstructor_long_Chronology3(TestMutablePeriod_Constructors.java:315)

testConstructor_long_PeriodType_Chronology1(org.joda.time.TestMutablePeriod_Constructors)  Time elapsed: 0 sec  <<< ERROR!
java.lang.NullPointerException
	at org.joda.time.chrono.BaseChronology.get(BaseChronology.java:284)
	at org.joda.time.base.BasePeriod.<init>(BasePeriod.java:258)
	at org.joda.time.MutablePeriod.<init>(MutablePeriod.java:242)
	at org.joda.time.TestMutablePeriod_Constructors.testConstructor_long_PeriodType_Chronology1(TestMutablePeriod_Constructors.java:333)

testConstructor_long_PeriodType_Chronology2(org.joda.time.TestMutablePeriod_Constructors)  Time elapsed: 0.001 sec  <<< ERROR!
java.lang.NullPointerException
	at org.joda.time.chrono.BaseChronology.get(BaseChronology.java:284)
	at org.joda.time.base.BasePeriod.<init>(BasePeriod.java:258)
	at org.joda.time.MutablePeriod.<init>(MutablePeriod.java:242)
	at org.joda.time.TestMutablePeriod_Constructors.testConstructor_long_PeriodType_Chronology2(TestMutablePeriod_Constructors.java:350)

testConstructor_long_PeriodType_Chronology3(org.joda.time.TestMutablePeriod_Constructors)  Time elapsed: 0 sec  <<< ERROR!
java.lang.NullPointerException
	at org.joda.time.chrono.BaseChronology.get(BaseChronology.java:284)
	at org.joda.time.base.BasePeriod.<init>(BasePeriod.java:258)
	at org.joda.time.MutablePeriod.<init>(MutablePeriod.java:242)
	at org.joda.time.TestMutablePeriod_Constructors.testConstructor_long_PeriodType_Chronology3(TestMutablePeriod_Constructors.java:367)

testConstructor_long_PeriodType_Chronology4(org.joda.time.TestMutablePeriod_Constructors)  Time elapsed: 0.001 sec  <<< ERROR!
java.lang.NullPointerException
	at org.joda.time.chrono.BaseChronology.get(BaseChronology.java:284)
	at org.joda.time.base.BasePeriod.<init>(BasePeriod.java:258)
	at org.joda.time.MutablePeriod.<init>(MutablePeriod.java:242)
	at org.joda.time.TestMutablePeriod_Constructors.testConstructor_long_PeriodType_Chronology4(TestMutablePeriod_Constructors.java:384)

testConstructor_long_long_PeriodType1(org.joda.time.TestMutablePeriod_Constructors)  Time elapsed: 0.001 sec  <<< ERROR!
java.lang.NullPointerException
	at org.joda.time.chrono.BaseChronology.get(BaseChronology.java:260)
	at org.joda.time.base.BasePeriod.<init>(BasePeriod.java:110)
	at org.joda.time.MutablePeriod.<init>(MutablePeriod.java:264)
	at org.joda.time.TestMutablePeriod_Constructors.testConstructor_long_long_PeriodType1(TestMutablePeriod_Constructors.java:502)

testConstructor_long_long_PeriodType2(org.joda.time.TestMutablePeriod_Constructors)  Time elapsed: 0.001 sec  <<< ERROR!
java.lang.NullPointerException
	at org.joda.time.chrono.BaseChronology.get(BaseChronology.java:260)
	at org.joda.time.base.BasePeriod.<init>(BasePeriod.java:110)
	at org.joda.time.MutablePeriod.<init>(MutablePeriod.java:264)
	at org.joda.time.TestMutablePeriod_Constructors.testConstructor_long_long_PeriodType2(TestMutablePeriod_Constructors.java:517)

testConstructor_long_long_PeriodType3(org.joda.time.TestMutablePeriod_Constructors)  Time elapsed: 0 sec  <<< ERROR!
java.lang.NullPointerException
	at org.joda.time.chrono.BaseChronology.get(BaseChronology.java:260)
	at org.joda.time.base.BasePeriod.<init>(BasePeriod.java:110)
	at org.joda.time.MutablePeriod.<init>(MutablePeriod.java:264)
	at org.joda.time.TestMutablePeriod_Constructors.testConstructor_long_long_PeriodType3(TestMutablePeriod_Constructors.java:532)

testConstructor_long_long_PeriodType_Chronology1(org.joda.time.TestMutablePeriod_Constructors)  Time elapsed: 0.001 sec  <<< ERROR!
java.lang.NullPointerException
	at org.joda.time.chrono.BaseChronology.get(BaseChronology.java:260)
	at org.joda.time.base.BasePeriod.<init>(BasePeriod.java:110)
	at org.joda.time.MutablePeriod.<init>(MutablePeriod.java:288)
	at org.joda.time.TestMutablePeriod_Constructors.testConstructor_long_long_PeriodType_Chronology1(TestMutablePeriod_Constructors.java:579)

testConstructor_long_long_PeriodType_Chronology2(org.joda.time.TestMutablePeriod_Constructors)  Time elapsed: 0 sec  <<< ERROR!
java.lang.NullPointerException
	at org.joda.time.chrono.BaseChronology.get(BaseChronology.java:260)
	at org.joda.time.base.BasePeriod.<init>(BasePeriod.java:110)
	at org.joda.time.MutablePeriod.<init>(MutablePeriod.java:288)
	at org.joda.time.TestMutablePeriod_Constructors.testConstructor_long_long_PeriodType_Chronology2(TestMutablePeriod_Constructors.java:594)

testConstructor_RI_RI_PeriodType1(org.joda.time.TestMutablePeriod_Constructors)  Time elapsed: 0 sec  <<< ERROR!
java.lang.NullPointerException
	at org.joda.time.chrono.BaseChronology.get(BaseChronology.java:260)
	at org.joda.time.base.BasePeriod.<init>(BasePeriod.java:132)
	at org.joda.time.MutablePeriod.<init>(MutablePeriod.java:316)
	at org.joda.time.TestMutablePeriod_Constructors.testConstructor_RI_RI_PeriodType1(TestMutablePeriod_Constructors.java:686)

testConstructor_RI_RI_PeriodType2(org.joda.time.TestMutablePeriod_Constructors)  Time elapsed: 0.001 sec  <<< ERROR!
java.lang.NullPointerException
	at org.joda.time.chrono.BaseChronology.get(BaseChronology.java:260)
	at org.joda.time.base.BasePeriod.<init>(BasePeriod.java:132)
	at org.joda.time.MutablePeriod.<init>(MutablePeriod.java:316)
	at org.joda.time.TestMutablePeriod_Constructors.testConstructor_RI_RI_PeriodType2(TestMutablePeriod_Constructors.java:701)

testConstructor_RI_RI_PeriodType3(org.joda.time.TestMutablePeriod_Constructors)  Time elapsed: 0.001 sec  <<< ERROR!
java.lang.NullPointerException
	at org.joda.time.chrono.BaseChronology.get(BaseChronology.java:260)
	at org.joda.time.base.BasePeriod.<init>(BasePeriod.java:132)
	at org.joda.time.MutablePeriod.<init>(MutablePeriod.java:316)
	at org.joda.time.TestMutablePeriod_Constructors.testConstructor_RI_RI_PeriodType3(TestMutablePeriod_Constructors.java:716)

testConstructor_RI_RI_PeriodType4(org.joda.time.TestMutablePeriod_Constructors)  Time elapsed: 0 sec  <<< ERROR!
java.lang.NullPointerException
	at org.joda.time.chrono.BaseChronology.get(BaseChronology.java:260)
	at org.joda.time.base.BasePeriod.<init>(BasePeriod.java:132)
	at org.joda.time.MutablePeriod.<init>(MutablePeriod.java:316)
	at org.joda.time.TestMutablePeriod_Constructors.testConstructor_RI_RI_PeriodType4(TestMutablePeriod_Constructors.java:731)

testConstructor_RI_RD_PeriodType1(org.joda.time.TestMutablePeriod_Constructors)  Time elapsed: 0.001 sec  <<< ERROR!
java.lang.NullPointerException
	at org.joda.time.chrono.BaseChronology.get(BaseChronology.java:260)
	at org.joda.time.base.BasePeriod.<init>(BasePeriod.java:201)
	at org.joda.time.MutablePeriod.<init>(MutablePeriod.java:337)
	at org.joda.time.TestMutablePeriod_Constructors.testConstructor_RI_RD_PeriodType1(TestMutablePeriod_Constructors.java:795)

testConstructor_long_long_Chronology1(org.joda.time.TestMutablePeriod_Constructors)  Time elapsed: 0.001 sec  <<< ERROR!
java.lang.NullPointerException
	at org.joda.time.chrono.BaseChronology.get(BaseChronology.java:260)
	at org.joda.time.base.BasePeriod.<init>(BasePeriod.java:110)
	at org.joda.time.MutablePeriod.<init>(MutablePeriod.java:276)
	at org.joda.time.TestMutablePeriod_Constructors.testConstructor_long_long_Chronology1(TestMutablePeriod_Constructors.java:548)

testConstructor_long_long_Chronology2(org.joda.time.TestMutablePeriod_Constructors)  Time elapsed: 0.001 sec  <<< ERROR!
java.lang.NullPointerException
	at org.joda.time.chrono.BaseChronology.get(BaseChronology.java:260)
	at org.joda.time.base.BasePeriod.<init>(BasePeriod.java:110)
	at org.joda.time.MutablePeriod.<init>(MutablePeriod.java:276)
	at org.joda.time.TestMutablePeriod_Constructors.testConstructor_long_long_Chronology2(TestMutablePeriod_Constructors.java:563)

testConstructor_long_long1(org.joda.time.TestMutablePeriod_Constructors)  Time elapsed: 0 sec  <<< ERROR!
java.lang.NullPointerException
	at org.joda.time.chrono.BaseChronology.get(BaseChronology.java:260)
	at org.joda.time.base.BasePeriod.<init>(BasePeriod.java:110)
	at org.joda.time.MutablePeriod.<init>(MutablePeriod.java:253)
	at org.joda.time.TestMutablePeriod_Constructors.testConstructor_long_long1(TestMutablePeriod_Constructors.java:471)

testConstructor_RI_RI1(org.joda.time.TestMutablePeriod_Constructors)  Time elapsed: 0.001 sec  <<< ERROR!
java.lang.NullPointerException
	at org.joda.time.chrono.BaseChronology.get(BaseChronology.java:260)
	at org.joda.time.base.BasePeriod.<init>(BasePeriod.java:132)
	at org.joda.time.MutablePeriod.<init>(MutablePeriod.java:302)
	at org.joda.time.TestMutablePeriod_Constructors.testConstructor_RI_RI1(TestMutablePeriod_Constructors.java:610)

testConstructor_RI_RI2(org.joda.time.TestMutablePeriod_Constructors)  Time elapsed: 0 sec  <<< ERROR!
java.lang.NullPointerException
	at org.joda.time.chrono.BaseChronology.get(BaseChronology.java:260)
	at org.joda.time.base.BasePeriod.<init>(BasePeriod.java:132)
	at org.joda.time.MutablePeriod.<init>(MutablePeriod.java:302)
	at org.joda.time.TestMutablePeriod_Constructors.testConstructor_RI_RI2(TestMutablePeriod_Constructors.java:625)

testConstructor_RI_RI3(org.joda.time.TestMutablePeriod_Constructors)  Time elapsed: 0.001 sec  <<< ERROR!
java.lang.NullPointerException
	at org.joda.time.chrono.BaseChronology.get(BaseChronology.java:260)
	at org.joda.time.base.BasePeriod.<init>(BasePeriod.java:132)
	at org.joda.time.MutablePeriod.<init>(MutablePeriod.java:302)
	at org.joda.time.TestMutablePeriod_Constructors.testConstructor_RI_RI3(TestMutablePeriod_Constructors.java:640)

testConstructor_RI_RI4(org.joda.time.TestMutablePeriod_Constructors)  Time elapsed: 0.001 sec  <<< ERROR!
java.lang.NullPointerException
	at org.joda.time.chrono.BaseChronology.get(BaseChronology.java:260)
	at org.joda.time.base.BasePeriod.<init>(BasePeriod.java:132)
	at org.joda.time.MutablePeriod.<init>(MutablePeriod.java:302)
	at org.joda.time.TestMutablePeriod_Constructors.testConstructor_RI_RI4(TestMutablePeriod_Constructors.java:655)

testConstructor_long_long2(org.joda.time.TestMutablePeriod_Constructors)  Time elapsed: 0 sec  <<< ERROR!
java.lang.NullPointerException
	at org.joda.time.chrono.BaseChronology.get(BaseChronology.java:260)
	at org.joda.time.base.BasePeriod.<init>(BasePeriod.java:110)
	at org.joda.time.MutablePeriod.<init>(MutablePeriod.java:253)
	at org.joda.time.TestMutablePeriod_Constructors.testConstructor_long_long2(TestMutablePeriod_Constructors.java:486)

testToString(org.joda.time.TestMutablePeriod_Basics)  Time elapsed: 0 sec  <<< ERROR!
java.lang.NullPointerException
	at org.joda.time.chrono.BaseChronology.get(BaseChronology.java:284)
	at org.joda.time.base.BasePeriod.<init>(BasePeriod.java:236)
	at org.joda.time.MutablePeriod.<init>(MutablePeriod.java:180)
	at org.joda.time.TestMutablePeriod_Basics.testToString(TestMutablePeriod_Basics.java:410)

testEqualsHashCode(org.joda.time.TestMutablePeriod_Basics)  Time elapsed: 0 sec  <<< ERROR!
java.lang.NullPointerException
	at org.joda.time.chrono.BaseChronology.get(BaseChronology.java:284)
	at org.joda.time.base.BasePeriod.<init>(BasePeriod.java:236)
	at org.joda.time.MutablePeriod.<init>(MutablePeriod.java:180)
	at org.joda.time.TestMutablePeriod_Basics.testEqualsHashCode(TestMutablePeriod_Basics.java:130)

testSerialization(org.joda.time.TestMutablePeriod_Basics)  Time elapsed: 0 sec  <<< ERROR!
java.lang.NullPointerException
	at org.joda.time.chrono.BaseChronology.get(BaseChronology.java:284)
	at org.joda.time.base.BasePeriod.<init>(BasePeriod.java:236)
	at org.joda.time.MutablePeriod.<init>(MutablePeriod.java:180)
	at org.joda.time.TestMutablePeriod_Basics.testSerialization(TestMutablePeriod_Basics.java:161)

testClone(org.joda.time.TestMutablePeriod_Basics)  Time elapsed: 0 sec  <<< ERROR!
java.lang.NullPointerException
	at org.joda.time.chrono.BaseChronology.get(BaseChronology.java:284)
	at org.joda.time.base.BasePeriod.<init>(BasePeriod.java:236)
	at org.joda.time.MutablePeriod.<init>(MutablePeriod.java:180)
	at org.joda.time.TestMutablePeriod_Basics.testClone(TestMutablePeriod_Basics.java:448)

testCopy(org.joda.time.TestMutablePeriod_Basics)  Time elapsed: 0.001 sec  <<< ERROR!
java.lang.NullPointerException
	at org.joda.time.chrono.BaseChronology.get(BaseChronology.java:284)
	at org.joda.time.base.BasePeriod.<init>(BasePeriod.java:236)
	at org.joda.time.MutablePeriod.<init>(MutablePeriod.java:180)
	at org.joda.time.TestMutablePeriod_Basics.testCopy(TestMutablePeriod_Basics.java:440)

testToMutablePeriod(org.joda.time.TestMutablePeriod_Basics)  Time elapsed: 0 sec  <<< ERROR!
java.lang.NullPointerException
	at org.joda.time.chrono.BaseChronology.get(BaseChronology.java:284)
	at org.joda.time.base.BasePeriod.<init>(BasePeriod.java:236)
	at org.joda.time.MutablePeriod.<init>(MutablePeriod.java:180)
	at org.joda.time.TestMutablePeriod_Basics.testToMutablePeriod(TestMutablePeriod_Basics.java:422)

testToDurationFrom(org.joda.time.TestMutablePeriod_Basics)  Time elapsed: 0 sec  <<< ERROR!
java.lang.NullPointerException
	at org.joda.time.chrono.BaseChronology.get(BaseChronology.java:284)
	at org.joda.time.base.BasePeriod.<init>(BasePeriod.java:236)
	at org.joda.time.MutablePeriod.<init>(MutablePeriod.java:180)
	at org.joda.time.TestMutablePeriod_Basics.testToDurationFrom(TestMutablePeriod_Basics.java:434)

testToPeriod(org.joda.time.TestMutablePeriod_Basics)  Time elapsed: 0 sec  <<< ERROR!
java.lang.NullPointerException
	at org.joda.time.chrono.BaseChronology.get(BaseChronology.java:284)
	at org.joda.time.base.BasePeriod.<init>(BasePeriod.java:236)
	at org.joda.time.MutablePeriod.<init>(MutablePeriod.java:180)
	at org.joda.time.TestMutablePeriod_Basics.testToPeriod(TestMutablePeriod_Basics.java:416)

testAdd_long1(org.joda.time.TestMutablePeriod_Updates)  Time elapsed: 0.001 sec  <<< ERROR!
java.lang.NullPointerException
	at org.joda.time.chrono.BaseChronology.get(BaseChronology.java:284)
	at org.joda.time.base.BasePeriod.<init>(BasePeriod.java:236)
	at org.joda.time.MutablePeriod.<init>(MutablePeriod.java:180)
	at org.joda.time.TestMutablePeriod_Updates.testAdd_long1(TestMutablePeriod_Updates.java:1092)

testAdd_RD1(org.joda.time.TestMutablePeriod_Updates)  Time elapsed: 0 sec  <<< ERROR!
java.lang.NullPointerException
	at org.joda.time.chrono.BaseChronology.get(BaseChronology.java:284)
	at org.joda.time.base.BasePeriod.<init>(BasePeriod.java:236)
	at org.joda.time.MutablePeriod.<init>(MutablePeriod.java:180)
	at org.joda.time.TestMutablePeriod_Updates.testAdd_RD1(TestMutablePeriod_Updates.java:1190)

testSetPeriod_long_long1(org.joda.time.TestMutablePeriod_Updates)  Time elapsed: 0 sec  <<< ERROR!
java.lang.NullPointerException
	at org.joda.time.chrono.BaseChronology.get(BaseChronology.java:260)
	at org.joda.time.MutablePeriod.setPeriod(MutablePeriod.java:548)
	at org.joda.time.MutablePeriod.setPeriod(MutablePeriod.java:535)
	at org.joda.time.TestMutablePeriod_Updates.testSetPeriod_long_long1(TestMutablePeriod_Updates.java:562)

testSetPeriod_long_long2(org.joda.time.TestMutablePeriod_Updates)  Time elapsed: 0.001 sec  <<< ERROR!
java.lang.NullPointerException
	at org.joda.time.chrono.BaseChronology.get(BaseChronology.java:260)
	at org.joda.time.MutablePeriod.setPeriod(MutablePeriod.java:548)
	at org.joda.time.MutablePeriod.setPeriod(MutablePeriod.java:535)
	at org.joda.time.TestMutablePeriod_Updates.testSetPeriod_long_long2(TestMutablePeriod_Updates.java:577)

testSetPeriod_long_long_NoYears(org.joda.time.TestMutablePeriod_Updates)  Time elapsed: 0.001 sec  <<< ERROR!
java.lang.NullPointerException
	at org.joda.time.chrono.BaseChronology.get(BaseChronology.java:260)
	at org.joda.time.MutablePeriod.setPeriod(MutablePeriod.java:548)
	at org.joda.time.MutablePeriod.setPeriod(MutablePeriod.java:535)
	at org.joda.time.TestMutablePeriod_Updates.testSetPeriod_long_long_NoYears(TestMutablePeriod_Updates.java:606)

testSetPeriod_long_long_NoMonths(org.joda.time.TestMutablePeriod_Updates)  Time elapsed: 0 sec  <<< ERROR!
java.lang.NullPointerException
	at org.joda.time.chrono.BaseChronology.get(BaseChronology.java:260)
	at org.joda.time.MutablePeriod.setPeriod(MutablePeriod.java:548)
	at org.joda.time.MutablePeriod.setPeriod(MutablePeriod.java:535)
	at org.joda.time.TestMutablePeriod_Updates.testSetPeriod_long_long_NoMonths(TestMutablePeriod_Updates.java:621)

testSetPeriod_long_long_NoWeeks(org.joda.time.TestMutablePeriod_Updates)  Time elapsed: 0.001 sec  <<< ERROR!
java.lang.NullPointerException
	at org.joda.time.chrono.BaseChronology.get(BaseChronology.java:260)
	at org.joda.time.MutablePeriod.setPeriod(MutablePeriod.java:548)
	at org.joda.time.MutablePeriod.setPeriod(MutablePeriod.java:535)
	at org.joda.time.TestMutablePeriod_Updates.testSetPeriod_long_long_NoWeeks(TestMutablePeriod_Updates.java:636)

testSetPeriod_long_long_NoDays(org.joda.time.TestMutablePeriod_Updates)  Time elapsed: 0 sec  <<< ERROR!
java.lang.NullPointerException
	at org.joda.time.chrono.BaseChronology.get(BaseChronology.java:260)
	at org.joda.time.MutablePeriod.setPeriod(MutablePeriod.java:548)
	at org.joda.time.MutablePeriod.setPeriod(MutablePeriod.java:535)
	at org.joda.time.TestMutablePeriod_Updates.testSetPeriod_long_long_NoDays(TestMutablePeriod_Updates.java:651)

testSetPeriod_long_long_NoHours(org.joda.time.TestMutablePeriod_Updates)  Time elapsed: 0.001 sec  <<< ERROR!
java.lang.NullPointerException
	at org.joda.time.chrono.BaseChronology.get(BaseChronology.java:260)
	at org.joda.time.MutablePeriod.setPeriod(MutablePeriod.java:548)
	at org.joda.time.MutablePeriod.setPeriod(MutablePeriod.java:535)
	at org.joda.time.TestMutablePeriod_Updates.testSetPeriod_long_long_NoHours(TestMutablePeriod_Updates.java:666)

testSetPeriod_long_long_NoMinutes(org.joda.time.TestMutablePeriod_Updates)  Time elapsed: 0.002 sec  <<< ERROR!
java.lang.NullPointerException
	at org.joda.time.chrono.BaseChronology.get(BaseChronology.java:260)
	at org.joda.time.MutablePeriod.setPeriod(MutablePeriod.java:548)
	at org.joda.time.MutablePeriod.setPeriod(MutablePeriod.java:535)
	at org.joda.time.TestMutablePeriod_Updates.testSetPeriod_long_long_NoMinutes(TestMutablePeriod_Updates.java:681)

testSetPeriod_long_long_NoMillis(org.joda.time.TestMutablePeriod_Updates)  Time elapsed: 0 sec  <<< ERROR!
java.lang.NullPointerException
	at org.joda.time.chrono.BaseChronology.get(BaseChronology.java:260)
	at org.joda.time.MutablePeriod.setPeriod(MutablePeriod.java:548)
	at org.joda.time.MutablePeriod.setPeriod(MutablePeriod.java:535)
	at org.joda.time.TestMutablePeriod_Updates.testSetPeriod_long_long_NoMillis(TestMutablePeriod_Updates.java:711)

testSetPeriod_RI_RI1(org.joda.time.TestMutablePeriod_Updates)  Time elapsed: 0 sec  <<< ERROR!
java.lang.NullPointerException
	at org.joda.time.chrono.BaseChronology.get(BaseChronology.java:260)
	at org.joda.time.MutablePeriod.setPeriod(MutablePeriod.java:548)
	at org.joda.time.MutablePeriod.setPeriod(MutablePeriod.java:522)
	at org.joda.time.TestMutablePeriod_Updates.testSetPeriod_RI_RI1(TestMutablePeriod_Updates.java:727)

testSetPeriod_RI_RI2(org.joda.time.TestMutablePeriod_Updates)  Time elapsed: 0.001 sec  <<< ERROR!
java.lang.NullPointerException
	at org.joda.time.chrono.BaseChronology.get(BaseChronology.java:260)
	at org.joda.time.MutablePeriod.setPeriod(MutablePeriod.java:548)
	at org.joda.time.MutablePeriod.setPeriod(MutablePeriod.java:522)
	at org.joda.time.TestMutablePeriod_Updates.testSetPeriod_RI_RI2(TestMutablePeriod_Updates.java:742)

testSetPeriod_RInterval1(org.joda.time.TestMutablePeriod_Updates)  Time elapsed: 0.001 sec  <<< ERROR!
java.lang.NullPointerException
	at org.joda.time.chrono.BaseChronology.get(BaseChronology.java:260)
	at org.joda.time.MutablePeriod.setPeriod(MutablePeriod.java:548)
	at org.joda.time.MutablePeriod.setPeriod(MutablePeriod.java:501)
	at org.joda.time.TestMutablePeriod_Updates.testSetPeriod_RInterval1(TestMutablePeriod_Updates.java:772)

testSetPeriod_long1(org.joda.time.TestMutablePeriod_Updates)  Time elapsed: 0 sec  <<< ERROR!
java.lang.NullPointerException
	at org.joda.time.chrono.BaseChronology.get(BaseChronology.java:284)
	at org.joda.time.MutablePeriod.setPeriod(MutablePeriod.java:611)
	at org.joda.time.MutablePeriod.setPeriod(MutablePeriod.java:595)
	at org.joda.time.TestMutablePeriod_Updates.testSetPeriod_long1(TestMutablePeriod_Updates.java:799)

testSetPeriod_long2(org.joda.time.TestMutablePeriod_Updates)  Time elapsed: 0.001 sec  <<< ERROR!
java.lang.NullPointerException
	at org.joda.time.chrono.BaseChronology.get(BaseChronology.java:284)
	at org.joda.time.MutablePeriod.setPeriod(MutablePeriod.java:611)
	at org.joda.time.MutablePeriod.setPeriod(MutablePeriod.java:595)
	at org.joda.time.TestMutablePeriod_Updates.testSetPeriod_long2(TestMutablePeriod_Updates.java:812)

testSetPeriod_RD1(org.joda.time.TestMutablePeriod_Updates)  Time elapsed: 0 sec  <<< ERROR!
java.lang.NullPointerException
	at org.joda.time.chrono.BaseChronology.get(BaseChronology.java:284)
	at org.joda.time.MutablePeriod.setPeriod(MutablePeriod.java:611)
	at org.joda.time.MutablePeriod.setPeriod(MutablePeriod.java:580)
	at org.joda.time.MutablePeriod.setPeriod(MutablePeriod.java:563)
	at org.joda.time.TestMutablePeriod_Updates.testSetPeriod_RD1(TestMutablePeriod_Updates.java:1017)

testSetPeriod_RD2(org.joda.time.TestMutablePeriod_Updates)  Time elapsed: 0 sec  <<< ERROR!
java.lang.NullPointerException
	at org.joda.time.chrono.BaseChronology.get(BaseChronology.java:284)
	at org.joda.time.MutablePeriod.setPeriod(MutablePeriod.java:611)
	at org.joda.time.MutablePeriod.setPeriod(MutablePeriod.java:580)
	at org.joda.time.MutablePeriod.setPeriod(MutablePeriod.java:563)
	at org.joda.time.TestMutablePeriod_Updates.testSetPeriod_RD2(TestMutablePeriod_Updates.java:1035)

testAdd_8ints1(org.joda.time.TestMutablePeriod_Updates)  Time elapsed: 0 sec  <<< ERROR!
java.lang.NullPointerException
	at org.joda.time.chrono.BaseChronology.get(BaseChronology.java:284)
	at org.joda.time.base.BasePeriod.<init>(BasePeriod.java:236)
	at org.joda.time.MutablePeriod.<init>(MutablePeriod.java:180)
	at org.joda.time.TestMutablePeriod_Updates.testAdd_8ints1(TestMutablePeriod_Updates.java:1062)

testAdd_8ints2(org.joda.time.TestMutablePeriod_Updates)  Time elapsed: 0 sec  <<< ERROR!
java.lang.NullPointerException
	at org.joda.time.chrono.BaseChronology.get(BaseChronology.java:284)
	at org.joda.time.base.BasePeriod.<init>(BasePeriod.java:258)
	at org.joda.time.MutablePeriod.<init>(MutablePeriod.java:200)
	at org.joda.time.TestMutablePeriod_Updates.testAdd_8ints2(TestMutablePeriod_Updates.java:1075)

testAdd_long2(org.joda.time.TestMutablePeriod_Updates)  Time elapsed: 0.001 sec  <<< ERROR!
java.lang.NullPointerException
	at org.joda.time.chrono.BaseChronology.get(BaseChronology.java:284)
	at org.joda.time.base.BasePeriod.<init>(BasePeriod.java:258)
	at org.joda.time.MutablePeriod.<init>(MutablePeriod.java:200)
	at org.joda.time.TestMutablePeriod_Updates.testAdd_long2(TestMutablePeriod_Updates.java:1105)

testAdd_long3(org.joda.time.TestMutablePeriod_Updates)  Time elapsed: 0 sec  <<< ERROR!
java.lang.NullPointerException
	at org.joda.time.chrono.BaseChronology.get(BaseChronology.java:284)
	at org.joda.time.base.BasePeriod.<init>(BasePeriod.java:258)
	at org.joda.time.Period.<init>(Period.java:402)
	at org.joda.time.MutablePeriod.add(MutablePeriod.java:707)
	at org.joda.time.TestMutablePeriod_Updates.testAdd_long3(TestMutablePeriod_Updates.java:1125)

testAdd_long_Chronology1(org.joda.time.TestMutablePeriod_Updates)  Time elapsed: 0.001 sec  <<< ERROR!
java.lang.NullPointerException
	at org.joda.time.chrono.BaseChronology.get(BaseChronology.java:284)
	at org.joda.time.base.BasePeriod.<init>(BasePeriod.java:236)
	at org.joda.time.MutablePeriod.<init>(MutablePeriod.java:180)
	at org.joda.time.TestMutablePeriod_Updates.testAdd_long_Chronology1(TestMutablePeriod_Updates.java:1138)

testAdd_long_Chronology2(org.joda.time.TestMutablePeriod_Updates)  Time elapsed: 0 sec  <<< ERROR!
java.lang.NullPointerException
	at org.joda.time.chrono.BaseChronology.get(BaseChronology.java:284)
	at org.joda.time.base.BasePeriod.<init>(BasePeriod.java:258)
	at org.joda.time.MutablePeriod.<init>(MutablePeriod.java:200)
	at org.joda.time.TestMutablePeriod_Updates.testAdd_long_Chronology2(TestMutablePeriod_Updates.java:1151)

testAdd_long_Chronology3(org.joda.time.TestMutablePeriod_Updates)  Time elapsed: 0 sec  <<< ERROR!
java.lang.NullPointerException
	at org.joda.time.chrono.BaseChronology.get(BaseChronology.java:284)
	at org.joda.time.base.BasePeriod.<init>(BasePeriod.java:258)
	at org.joda.time.MutablePeriod.<init>(MutablePeriod.java:200)
	at org.joda.time.TestMutablePeriod_Updates.testAdd_long_Chronology3(TestMutablePeriod_Updates.java:1170)

testAdd_RP3(org.joda.time.TestMutablePeriod_Updates)  Time elapsed: 0.001 sec  <<< ERROR!
java.lang.NullPointerException
	at org.joda.time.chrono.BaseChronology.get(BaseChronology.java:284)
	at org.joda.time.base.BasePeriod.<init>(BasePeriod.java:258)
	at org.joda.time.MutablePeriod.<init>(MutablePeriod.java:200)
	at org.joda.time.TestMutablePeriod_Updates.testAdd_RP3(TestMutablePeriod_Updates.java:1262)

testAdd_RInterval1(org.joda.time.TestMutablePeriod_Updates)  Time elapsed: 0 sec  <<< ERROR!
java.lang.NullPointerException
	at org.joda.time.chrono.BaseChronology.get(BaseChronology.java:284)
	at org.joda.time.base.BasePeriod.<init>(BasePeriod.java:236)
	at org.joda.time.MutablePeriod.<init>(MutablePeriod.java:180)
	at org.joda.time.TestMutablePeriod_Updates.testAdd_RInterval1(TestMutablePeriod_Updates.java:1318)

testAdd_RInterval2(org.joda.time.TestMutablePeriod_Updates)  Time elapsed: 0.001 sec  <<< ERROR!
java.lang.NullPointerException
	at org.joda.time.chrono.BaseChronology.get(BaseChronology.java:284)
	at org.joda.time.base.BasePeriod.<init>(BasePeriod.java:236)
	at org.joda.time.MutablePeriod.<init>(MutablePeriod.java:180)
	at org.joda.time.TestMutablePeriod_Updates.testAdd_RInterval2(TestMutablePeriod_Updates.java:1333)

testAdd_RInterval3(org.joda.time.TestMutablePeriod_Updates)  Time elapsed: 0 sec  <<< ERROR!
java.lang.NullPointerException
	at org.joda.time.chrono.BaseChronology.get(BaseChronology.java:284)
	at org.joda.time.base.BasePeriod.<init>(BasePeriod.java:258)
	at org.joda.time.MutablePeriod.<init>(MutablePeriod.java:200)
	at org.joda.time.TestMutablePeriod_Updates.testAdd_RInterval3(TestMutablePeriod_Updates.java:1346)

testAdd_RInterval4(org.joda.time.TestMutablePeriod_Updates)  Time elapsed: 0.001 sec  <<< ERROR!
java.lang.NullPointerException
	at org.joda.time.chrono.BaseChronology.get(BaseChronology.java:284)
	at org.joda.time.base.BasePeriod.<init>(BasePeriod.java:258)
	at org.joda.time.MutablePeriod.<init>(MutablePeriod.java:200)
	at org.joda.time.TestMutablePeriod_Updates.testAdd_RInterval4(TestMutablePeriod_Updates.java:1361)

testAdd_RD2(org.joda.time.TestMutablePeriod_Updates)  Time elapsed: 0 sec  <<< ERROR!
java.lang.NullPointerException
	at org.joda.time.chrono.BaseChronology.get(BaseChronology.java:284)
	at org.joda.time.base.BasePeriod.<init>(BasePeriod.java:258)
	at org.joda.time.MutablePeriod.<init>(MutablePeriod.java:200)
	at org.joda.time.TestMutablePeriod_Updates.testAdd_RD2(TestMutablePeriod_Updates.java:1203)

testAdd_RP1(org.joda.time.TestMutablePeriod_Updates)  Time elapsed: 0 sec  <<< ERROR!
java.lang.NullPointerException
	at org.joda.time.chrono.BaseChronology.get(BaseChronology.java:284)
	at org.joda.time.base.BasePeriod.<init>(BasePeriod.java:236)
	at org.joda.time.MutablePeriod.<init>(MutablePeriod.java:180)
	at org.joda.time.TestMutablePeriod_Updates.testAdd_RP1(TestMutablePeriod_Updates.java:1235)

testAdd_RP2(org.joda.time.TestMutablePeriod_Updates)  Time elapsed: 0.001 sec  <<< ERROR!
java.lang.NullPointerException
	at org.joda.time.chrono.BaseChronology.get(BaseChronology.java:284)
	at org.joda.time.base.BasePeriod.<init>(BasePeriod.java:258)
	at org.joda.time.MutablePeriod.<init>(MutablePeriod.java:200)
	at org.joda.time.TestMutablePeriod_Updates.testAdd_RP2(TestMutablePeriod_Updates.java:1248)

testFactory_standardMinutesIn_RPeriod(org.joda.time.TestMinutes)  Time elapsed: 0 sec  <<< ERROR!
java.lang.NullPointerException
	at org.joda.time.base.BaseSingleFieldPeriod.standardPeriodIn(BaseSingleFieldPeriod.java:139)
	at org.joda.time.Minutes.standardMinutesIn(Minutes.java:165)
	at org.joda.time.TestMinutes.testFactory_standardMinutesIn_RPeriod(TestMinutes.java:120)

testAddToLocalDate(org.joda.time.TestSeconds)  Time elapsed: 0 sec  <<< ERROR!
java.lang.NullPointerException
	at org.joda.time.chrono.BaseChronology.add(BaseChronology.java:307)
	at org.joda.time.LocalDateTime.withPeriodAdded(LocalDateTime.java:1062)
	at org.joda.time.LocalDateTime.plus(LocalDateTime.java:1094)
	at org.joda.time.TestSeconds.testAddToLocalDate(TestSeconds.java:367)

testFactory_secondsBetween_RInstant(org.joda.time.TestSeconds)  Time elapsed: 0.001 sec  <<< ERROR!
java.lang.NullPointerException
	at org.joda.time.base.BaseSingleFieldPeriod.between(BaseSingleFieldPeriod.java:72)
	at org.joda.time.Seconds.secondsBetween(Seconds.java:101)
	at org.joda.time.TestSeconds.testFactory_secondsBetween_RInstant(TestSeconds.java:82)

testFactory_secondsBetween_RPartial(org.joda.time.TestSeconds)  Time elapsed: 0 sec  <<< ERROR!
java.lang.NullPointerException
	at org.joda.time.Seconds.secondsBetween(Seconds.java:120)
	at org.joda.time.TestSeconds.testFactory_secondsBetween_RPartial(TestSeconds.java:95)

testFactory_secondsIn_RInterval(org.joda.time.TestSeconds)  Time elapsed: 0.001 sec  <<< ERROR!
java.lang.NullPointerException
	at org.joda.time.base.BaseSingleFieldPeriod.between(BaseSingleFieldPeriod.java:72)
	at org.joda.time.Seconds.secondsIn(Seconds.java:140)
	at org.joda.time.TestSeconds.testFactory_secondsIn_RInterval(TestSeconds.java:108)

testFactory_standardSecondsIn_RPeriod(org.joda.time.TestSeconds)  Time elapsed: 0 sec  <<< ERROR!
java.lang.NullPointerException
	at org.joda.time.base.BaseSingleFieldPeriod.standardPeriodIn(BaseSingleFieldPeriod.java:139)
	at org.joda.time.Seconds.standardSecondsIn(Seconds.java:165)
	at org.joda.time.TestSeconds.testFactory_standardSecondsIn_RPeriod(TestSeconds.java:117)

testCompareTo(org.joda.time.TestTimeOfDay_Basics)  Time elapsed: 0.001 sec  <<< ERROR!
java.lang.NullPointerException
	at org.joda.time.Partial.<init>(Partial.java:221)
	at org.joda.time.Partial.<init>(Partial.java:177)
	at org.joda.time.TestTimeOfDay_Basics.testCompareTo(TestTimeOfDay_Basics.java:263)

testPropertyGetSecond(org.joda.time.TestTimeOfDay_Properties)  Time elapsed: 0.001 sec  <<< FAILURE!
junit.framework.AssertionFailedError: expected:<null> but was:<DurationField[seconds]>
	at junit.framework.Assert.fail(Assert.java:47)
	at junit.framework.Assert.failNotEquals(Assert.java:280)
	at junit.framework.Assert.assertEquals(Assert.java:64)
	at junit.framework.Assert.assertEquals(Assert.java:71)
	at org.joda.time.TestTimeOfDay_Properties.testPropertyGetSecond(TestTimeOfDay_Properties.java:417)

testPropertyGetMilli(org.joda.time.TestTimeOfDay_Properties)  Time elapsed: 0 sec  <<< FAILURE!
junit.framework.AssertionFailedError: expected:<null> but was:<DurationField[seconds]>
	at junit.framework.Assert.fail(Assert.java:47)
	at junit.framework.Assert.failNotEquals(Assert.java:280)
	at junit.framework.Assert.assertEquals(Assert.java:64)
	at junit.framework.Assert.assertEquals(Assert.java:71)
	at org.joda.time.TestTimeOfDay_Properties.testPropertyGetMilli(TestTimeOfDay_Properties.java:584)

testEqualsHashCode(org.joda.time.TestPartial_Basics)  Time elapsed: 0 sec  <<< ERROR!
java.lang.NullPointerException
	at org.joda.time.Partial.<init>(Partial.java:221)
	at org.joda.time.TestPartial_Basics.createTODPartial(TestPartial_Basics.java:918)
	at org.joda.time.TestPartial_Basics.testEqualsHashCode(TestPartial_Basics.java:204)

testCompareTo(org.joda.time.TestPartial_Basics)  Time elapsed: 0.001 sec  <<< ERROR!
java.lang.NullPointerException
	at org.joda.time.Partial.<init>(Partial.java:221)
	at org.joda.time.TestPartial_Basics.createTODPartial(TestPartial_Basics.java:918)
	at org.joda.time.TestPartial_Basics.testCompareTo(TestPartial_Basics.java:226)

testWith3a(org.joda.time.TestPartial_Basics)  Time elapsed: 0.001 sec  <<< ERROR!
java.lang.NullPointerException
	at org.joda.time.Partial.with(Partial.java:463)
	at org.joda.time.TestPartial_Basics.testWith3a(TestPartial_Basics.java:371)

testPropertyAddWrapFieldHour(org.joda.time.TestPartial_Properties)  Time elapsed: 0 sec  <<< ERROR!
java.lang.NullPointerException
	at org.joda.time.Partial.<init>(Partial.java:221)
	at org.joda.time.Partial.<init>(Partial.java:177)
	at org.joda.time.TestPartial_Properties.testPropertyAddWrapFieldHour(TestPartial_Properties.java:163)

testPropertyAddMinute(org.joda.time.TestPartial_Properties)  Time elapsed: 0 sec  <<< ERROR!
java.lang.NullPointerException
	at org.joda.time.Partial.<init>(Partial.java:221)
	at org.joda.time.Partial.<init>(Partial.java:177)
	at org.joda.time.TestPartial_Properties.testPropertyAddMinute(TestPartial_Properties.java:306)

testPropertyAddWrapFieldMinute(org.joda.time.TestPartial_Properties)  Time elapsed: 0 sec  <<< ERROR!
java.lang.NullPointerException
	at org.joda.time.Partial.<init>(Partial.java:221)
	at org.joda.time.Partial.<init>(Partial.java:177)
	at org.joda.time.TestPartial_Properties.testPropertyAddWrapFieldMinute(TestPartial_Properties.java:352)

testPropertyAddHour(org.joda.time.TestPartial_Properties)  Time elapsed: 0.001 sec  <<< ERROR!
java.lang.NullPointerException
	at org.joda.time.Partial.<init>(Partial.java:221)
	at org.joda.time.Partial.<init>(Partial.java:177)
	at org.joda.time.TestPartial_Properties.testPropertyAddHour(TestPartial_Properties.java:135)

testPropertyWithMaximumValueHour(org.joda.time.TestPartial_Properties)  Time elapsed: 0 sec  <<< ERROR!
java.lang.NullPointerException
	at org.joda.time.Partial.<init>(Partial.java:221)
	at org.joda.time.Partial.<init>(Partial.java:177)
	at org.joda.time.TestPartial_Properties.testPropertyWithMaximumValueHour(TestPartial_Properties.java:202)

testPropertyWithMinimumValueHour(org.joda.time.TestPartial_Properties)  Time elapsed: 0 sec  <<< ERROR!
java.lang.NullPointerException
	at org.joda.time.Partial.<init>(Partial.java:221)
	at org.joda.time.Partial.<init>(Partial.java:177)
	at org.joda.time.TestPartial_Properties.testPropertyWithMinimumValueHour(TestPartial_Properties.java:209)

testPropertyGetMinute(org.joda.time.TestPartial_Properties)  Time elapsed: 0 sec  <<< ERROR!
java.lang.NullPointerException
	at org.joda.time.Partial.<init>(Partial.java:221)
	at org.joda.time.Partial.<init>(Partial.java:177)
	at org.joda.time.TestPartial_Properties.testPropertyGetMinute(TestPartial_Properties.java:239)

testPropertyGetMaxMinValuesMinute(org.joda.time.TestPartial_Properties)  Time elapsed: 0 sec  <<< ERROR!
java.lang.NullPointerException
	at org.joda.time.Partial.<init>(Partial.java:221)
	at org.joda.time.Partial.<init>(Partial.java:177)
	at org.joda.time.TestPartial_Properties.testPropertyGetMaxMinValuesMinute(TestPartial_Properties.java:258)

testPropertySetMinute(org.joda.time.TestPartial_Properties)  Time elapsed: 0.001 sec  <<< ERROR!
java.lang.NullPointerException
	at org.joda.time.Partial.<init>(Partial.java:221)
	at org.joda.time.Partial.<init>(Partial.java:177)
	at org.joda.time.TestPartial_Properties.testPropertySetMinute(TestPartial_Properties.java:365)

testPropertySetTextMinute(org.joda.time.TestPartial_Properties)  Time elapsed: 0 sec  <<< ERROR!
java.lang.NullPointerException
	at org.joda.time.Partial.<init>(Partial.java:221)
	at org.joda.time.Partial.<init>(Partial.java:177)
	at org.joda.time.TestPartial_Properties.testPropertySetTextMinute(TestPartial_Properties.java:381)

testPropertyCompareToMinute(org.joda.time.TestPartial_Properties)  Time elapsed: 0 sec  <<< ERROR!
java.lang.NullPointerException
	at org.joda.time.Partial.<init>(Partial.java:221)
	at org.joda.time.Partial.<init>(Partial.java:177)
	at org.joda.time.TestPartial_Properties.testPropertyCompareToMinute(TestPartial_Properties.java:388)

testPropertyGetHour(org.joda.time.TestPartial_Properties)  Time elapsed: 0 sec  <<< ERROR!
java.lang.NullPointerException
	at org.joda.time.Partial.<init>(Partial.java:221)
	at org.joda.time.Partial.<init>(Partial.java:177)
	at org.joda.time.TestPartial_Properties.testPropertyGetHour(TestPartial_Properties.java:86)

testPropertyGetMaxMinValuesHour(org.joda.time.TestPartial_Properties)  Time elapsed: 0.001 sec  <<< ERROR!
java.lang.NullPointerException
	at org.joda.time.Partial.<init>(Partial.java:221)
	at org.joda.time.Partial.<init>(Partial.java:177)
	at org.joda.time.TestPartial_Properties.testPropertyGetMaxMinValuesHour(TestPartial_Properties.java:105)

testPropertySetHour(org.joda.time.TestPartial_Properties)  Time elapsed: 0 sec  <<< ERROR!
java.lang.NullPointerException
	at org.joda.time.Partial.<init>(Partial.java:221)
	at org.joda.time.Partial.<init>(Partial.java:177)
	at org.joda.time.TestPartial_Properties.testPropertySetHour(TestPartial_Properties.java:179)

testPropertySetTextHour(org.joda.time.TestPartial_Properties)  Time elapsed: 0 sec  <<< ERROR!
java.lang.NullPointerException
	at org.joda.time.Partial.<init>(Partial.java:221)
	at org.joda.time.Partial.<init>(Partial.java:177)
	at org.joda.time.TestPartial_Properties.testPropertySetTextHour(TestPartial_Properties.java:195)

testPropertyCompareToHour(org.joda.time.TestPartial_Properties)  Time elapsed: 0.001 sec  <<< ERROR!
java.lang.NullPointerException
	at org.joda.time.Partial.<init>(Partial.java:221)
	at org.joda.time.Partial.<init>(Partial.java:177)
	at org.joda.time.TestPartial_Properties.testPropertyCompareToHour(TestPartial_Properties.java:216)

testPeriod(org.joda.time.TestDateTimeZoneCutover)  Time elapsed: 0.001 sec  <<< ERROR!
java.lang.NullPointerException
	at org.joda.time.chrono.BaseChronology.get(BaseChronology.java:260)
	at org.joda.time.base.BasePeriod.<init>(BasePeriod.java:132)
	at org.joda.time.Period.<init>(Period.java:548)
	at org.joda.time.TestDateTimeZoneCutover.testPeriod(TestDateTimeZoneCutover.java:1249)

testPlusSecondsInDstChange(org.joda.time.TestDateTimeZoneCutover)  Time elapsed: 0.001 sec  <<< ERROR!
java.lang.NullPointerException
	at org.joda.time.DateTime.plusSeconds(DateTime.java:1203)
	at org.joda.time.TestDateTimeZoneCutover.testPlusSecondsInDstChange(TestDateTimeZoneCutover.java:1197)

testLocalTime(org.joda.time.TestStringConvert)  Time elapsed: 0.001 sec  <<< ERROR!
java.lang.NullPointerException
	at org.joda.time.LocalTime.isSupported(LocalTime.java:646)
	at org.joda.time.LocalTime.isSupported(LocalTime.java:625)
	at org.joda.time.format.DateTimeFormatterBuilder$PaddedNumber.printTo(DateTimeFormatterBuilder.java:1434)
	at org.joda.time.format.DateTimeFormatterBuilder$Composite.printTo(DateTimeFormatterBuilder.java:2446)
	at org.joda.time.format.DateTimeFormatter.printTo(DateTimeFormatter.java:609)
	at org.joda.time.format.DateTimeFormatter.print(DateTimeFormatter.java:663)
	at org.joda.time.LocalTime.toString(LocalTime.java:1299)
	at sun.reflect.NativeMethodAccessorImpl.invoke0(Native Method)
	at sun.reflect.NativeMethodAccessorImpl.invoke(NativeMethodAccessorImpl.java:57)
	at sun.reflect.DelegatingMethodAccessorImpl.invoke(DelegatingMethodAccessorImpl.java:43)
	at java.lang.reflect.Method.invoke(Method.java:606)
	at org.joda.convert.ReflectionStringConverter.convertToString(ReflectionStringConverter.java:63)
	at org.joda.convert.StringConvert.convertToString(StringConvert.java:124)
	at org.joda.time.TestStringConvert.testLocalTime(TestStringConvert.java:90)

testDurationFields(org.joda.time.chrono.TestBuddhistChronology)  Time elapsed: 0 sec  <<< ERROR!
java.lang.NullPointerException
	at org.joda.time.chrono.TestBuddhistChronology.testDurationFields(TestBuddhistChronology.java:157)

testDurationFields(org.joda.time.chrono.TestCopticChronology)  Time elapsed: 0 sec  <<< ERROR!
java.lang.NullPointerException
	at org.joda.time.chrono.TestCopticChronology.testDurationFields(TestCopticChronology.java:160)

testDurationFields(org.joda.time.chrono.TestEthiopicChronology)  Time elapsed: 0 sec  <<< ERROR!
java.lang.NullPointerException
	at org.joda.time.chrono.TestEthiopicChronology.testDurationFields(TestEthiopicChronology.java:160)

testDurationFields(org.joda.time.chrono.TestGJChronology)  Time elapsed: 0 sec  <<< ERROR!
java.lang.NullPointerException
	at org.joda.time.chrono.TestGJChronology.testDurationFields(TestGJChronology.java:211)

testDurationFields(org.joda.time.chrono.TestGregorianChronology)  Time elapsed: 0.001 sec  <<< ERROR!
java.lang.NullPointerException
	at org.joda.time.chrono.TestGregorianChronology.testDurationFields(TestGregorianChronology.java:167)

testDurationFields(org.joda.time.chrono.TestIslamicChronology)  Time elapsed: 0 sec  <<< ERROR!
java.lang.NullPointerException
	at org.joda.time.chrono.TestIslamicChronology.testDurationFields(TestIslamicChronology.java:157)

testDurationFields(org.joda.time.chrono.TestJulianChronology)  Time elapsed: 0.001 sec  <<< ERROR!
java.lang.NullPointerException
	at org.joda.time.chrono.TestJulianChronology.testDurationFields(TestJulianChronology.java:164)

testDurationFields(org.joda.time.chrono.TestISOChronology)  Time elapsed: 0.001 sec  <<< ERROR!
java.lang.NullPointerException
	at org.joda.time.chrono.TestISOChronology.testDurationFields(TestISOChronology.java:157)

testSetInto_Object(org.joda.time.convert.TestReadableDurationConverter)  Time elapsed: 0.001 sec  <<< ERROR!
java.lang.NullPointerException
	at org.joda.time.chrono.BaseChronology.get(BaseChronology.java:284)
	at org.joda.time.convert.ReadableDurationConverter.setInto(ReadableDurationConverter.java:75)
	at org.joda.time.convert.TestReadableDurationConverter.testSetInto_Object(TestReadableDurationConverter.java:112)

testGetPeriodType_Object(org.joda.time.convert.TestReadablePeriodConverter)  Time elapsed: 0 sec  <<< ERROR!
java.lang.NullPointerException
	at org.joda.time.chrono.BaseChronology.get(BaseChronology.java:284)
	at org.joda.time.base.BasePeriod.<init>(BasePeriod.java:258)
	at org.joda.time.Period.<init>(Period.java:402)
	at org.joda.time.convert.TestReadablePeriodConverter.testGetPeriodType_Object(TestReadablePeriodConverter.java:90)

test_compareTo(org.joda.time.field.TestMillisDurationField)  Time elapsed: 0.001 sec  <<< ERROR!
java.lang.NullPointerException
	at org.joda.time.field.MillisDurationField.compareTo(MillisDurationField.java:134)
	at org.joda.time.field.MillisDurationField.compareTo(MillisDurationField.java:32)
	at org.joda.time.field.TestMillisDurationField.test_compareTo(TestMillisDurationField.java:185)

testFormat_time_partial(org.joda.time.format.TestISODateTimeFormat)  Time elapsed: 0 sec  <<< ERROR!
java.lang.NullPointerException
	at org.joda.time.Partial.<init>(Partial.java:221)
	at org.joda.time.Partial.<init>(Partial.java:177)
	at org.joda.time.format.TestISODateTimeFormat.testFormat_time_partial(TestISODateTimeFormat.java:126)

testFormat_timeNoMillis_partial(org.joda.time.format.TestISODateTimeFormat)  Time elapsed: 0.001 sec  <<< ERROR!
java.lang.NullPointerException
	at org.joda.time.Partial.<init>(Partial.java:221)
	at org.joda.time.Partial.<init>(Partial.java:177)
	at org.joda.time.format.TestISODateTimeFormat.testFormat_timeNoMillis_partial(TestISODateTimeFormat.java:145)

testForFields_time_HMSm(org.joda.time.format.TestISODateTimeFormat_Fields)  Time elapsed: 0.001 sec  <<< ERROR!
java.lang.NullPointerException
	at org.joda.time.Partial.<init>(Partial.java:221)
	at org.joda.time.Partial.<init>(Partial.java:177)
	at org.joda.time.format.TestISODateTimeFormat_Fields.testForFields_time_HMSm(TestISODateTimeFormat_Fields.java:608)

testForFields_time_HMS(org.joda.time.format.TestISODateTimeFormat_Fields)  Time elapsed: 0 sec  <<< ERROR!
java.lang.NullPointerException
	at org.joda.time.Partial.<init>(Partial.java:221)
	at org.joda.time.Partial.<init>(Partial.java:177)
	at org.joda.time.format.TestISODateTimeFormat_Fields.testForFields_time_HMS(TestISODateTimeFormat_Fields.java:637)

testForFields_time_MSm(org.joda.time.format.TestISODateTimeFormat_Fields)  Time elapsed: 0 sec  <<< ERROR!
java.lang.NullPointerException
	at org.joda.time.Partial.<init>(Partial.java:221)
	at org.joda.time.Partial.<init>(Partial.java:177)
	at org.joda.time.format.TestISODateTimeFormat_Fields.testForFields_time_MSm(TestISODateTimeFormat_Fields.java:721)

testForFields_time_MS(org.joda.time.format.TestISODateTimeFormat_Fields)  Time elapsed: 0.001 sec  <<< ERROR!
java.lang.NullPointerException
	at org.joda.time.Partial.<init>(Partial.java:221)
	at org.joda.time.Partial.<init>(Partial.java:177)
	at org.joda.time.format.TestISODateTimeFormat_Fields.testForFields_time_MS(TestISODateTimeFormat_Fields.java:749)

testForFields_time_Sm(org.joda.time.format.TestISODateTimeFormat_Fields)  Time elapsed: 0.001 sec  <<< ERROR!
java.lang.NullPointerException
	at org.joda.time.Partial.<init>(Partial.java:230)
	at org.joda.time.Partial.<init>(Partial.java:177)
	at org.joda.time.format.TestISODateTimeFormat_Fields.testForFields_time_Sm(TestISODateTimeFormat_Fields.java:804)

testForFields_time_HS(org.joda.time.format.TestISODateTimeFormat_Fields)  Time elapsed: 0 sec  <<< ERROR!
java.lang.NullPointerException
	at org.joda.time.Partial.<init>(Partial.java:221)
	at org.joda.time.Partial.<init>(Partial.java:177)
	at org.joda.time.format.TestISODateTimeFormat_Fields.testForFields_time_HS(TestISODateTimeFormat_Fields.java:918)

testForFields_time_HSm(org.joda.time.format.TestISODateTimeFormat_Fields)  Time elapsed: 0.001 sec  <<< ERROR!
java.lang.NullPointerException
	at org.joda.time.Partial.<init>(Partial.java:221)
	at org.joda.time.Partial.<init>(Partial.java:177)
	at org.joda.time.format.TestISODateTimeFormat_Fields.testForFields_time_HSm(TestISODateTimeFormat_Fields.java:979)


Results :

Failed tests: 
  org.joda.time.TestDateTime_Properties#testPropertyGetMillisOfSecond AssertionFailedError
  org.joda.time.TestDateTime_Properties#testPropertyGetSecondOfDay AssertionFailedError
  org.joda.time.TestDateTime_Properties#testPropertyGetSecondOfMinute AssertionFailedError
  org.joda.time.TestLocalDateTime_Properties#testPropertyGetMilli AssertionFailedError
  org.joda.time.TestLocalDateTime_Properties#testPropertyGetSecond AssertionFailedError
  org.joda.time.TestLocalTime_Properties#testPropertyGetMilli AssertionFailedError
  org.joda.time.TestLocalTime_Properties#testPropertyGetSecond AssertionFailedError
  org.joda.time.TestMutableDateTime_Properties#testPropertyGetMillisOfSecond AssertionFailedError
  org.joda.time.TestMutableDateTime_Properties#testPropertyGetSecondOfDay AssertionFailedError
  org.joda.time.TestMutableDateTime_Properties#testPropertyGetSecondOfMinute AssertionFailedError
  org.joda.time.TestTimeOfDay_Properties#testPropertyGetMilli AssertionFailedError
  org.joda.time.TestTimeOfDay_Properties#testPropertyGetSecond AssertionFailedError
Tests in error: 
  org.joda.time.TestDateMidnight_Basics#testMinus_RP NullPointerException
  org.joda.time.TestDateMidnight_Basics#testPlus_RP NullPointerException
  org.joda.time.TestDateMidnight_Basics#testWithDurationAdded_RP_int NullPointerException
  org.joda.time.TestDateTimeZoneCutover#testPeriod NullPointerException
  org.joda.time.TestDateTimeZoneCutover#testPlusSecondsInDstChange NullPointerException
  org.joda.time.TestDateTime_Basics#testMinusSeconds_int NullPointerException
  org.joda.time.TestDateTime_Basics#testMinus_RP NullPointerException
  org.joda.time.TestDateTime_Basics#testPlusSeconds_int NullPointerException
  org.joda.time.TestDateTime_Basics#testPlus_RP NullPointerException
  org.joda.time.TestDateTime_Basics#testWithDurationAdded_RP_int NullPointerException
  org.joda.time.TestDurationFieldType#test_seconds NullPointerException
  org.joda.time.TestDuration_Basics#testToPeriod NullPointerException
  org.joda.time.TestDuration_Basics#testToPeriodFrom NullPointerException
  org.joda.time.TestDuration_Basics#testToPeriodFrom_PeriodType NullPointerException
  org.joda.time.TestDuration_Basics#testToPeriodTo NullPointerException
  org.joda.time.TestDuration_Basics#testToPeriodTo_PeriodType NullPointerException
  org.joda.time.TestDuration_Basics#testToPeriod_Chronology NullPointerException
  org.joda.time.TestDuration_Basics#testToPeriod_PeriodType NullPointerException
  org.joda.time.TestDuration_Basics#testToPeriod_PeriodType_Chronology NullPointerException
  org.joda.time.TestDuration_Basics#testToPeriod_fixedZone NullPointerException
  org.joda.time.TestInterval_Basics#testToPeriod NullPointerException
  org.joda.time.TestInterval_Basics#testToPeriod_PeriodType1 NullPointerException
  org.joda.time.TestInterval_Basics#testToPeriod_PeriodType2 NullPointerException
  org.joda.time.TestInterval_Constructors#testConstructor_RI_RP4 NullPointerException
  org.joda.time.TestInterval_Constructors#testConstructor_RP_RI4 NullPointerException
  org.joda.time.TestLocalDateTime_Basics#testIsSupported_DurationFieldType NullPointerException
  org.joda.time.TestLocalDateTime_Basics#testMinusSeconds_int NullPointerException
  org.joda.time.TestLocalDateTime_Basics#testMinus_RP NullPointerException
  org.joda.time.TestLocalDateTime_Basics#testPlusSeconds_int NullPointerException
  org.joda.time.TestLocalDateTime_Basics#testPlus_RP NullPointerException
  org.joda.time.TestLocalDate_Basics#testMinus_RP NullPointerException
  org.joda.time.TestLocalDate_Basics#testPlus_RP NullPointerException
  org.joda.time.TestLocalTime_Basics#testCompareTo NullPointerException
  org.joda.time.TestLocalTime_Basics#testGet_DateTimeFieldType NullPointerException
  org.joda.time.TestLocalTime_Basics#testIsSupported_DateTimeFieldType NullPointerException
  org.joda.time.TestLocalTime_Basics#testIsSupported_DurationFieldType NullPointerException
  org.joda.time.TestLocalTime_Basics#testMinusSeconds_int NullPointerException
  org.joda.time.TestLocalTime_Basics#testMinus_RP NullPointerException
  org.joda.time.TestLocalTime_Basics#testPlusSeconds_int NullPointerException
  org.joda.time.TestLocalTime_Basics#testPlus_RP NullPointerException
  org.joda.time.TestLocalTime_Basics#testProperty NullPointerException
  org.joda.time.TestLocalTime_Basics#testToString NullPointerException
  org.joda.time.TestLocalTime_Basics#testToString_DTFormatter NullPointerException
  org.joda.time.TestLocalTime_Basics#testToString_String NullPointerException
  org.joda.time.TestLocalTime_Basics#testToString_String_Locale NullPointerException
  org.joda.time.TestLocalTime_Basics#testWithFieldAdded_DurationFieldType_int_7 NullPointerException
  org.joda.time.TestLocalTime_Basics#testWithFieldAdded_DurationFieldType_int_8 NullPointerException
  org.joda.time.TestLocalTime_Constructors#testConstructor_ObjectLocalTime NullPointerException
  org.joda.time.TestLocalTime_Properties#testPropertyCompareToMilli NullPointerException
  org.joda.time.TestLocalTime_Properties#testPropertyCompareToSecond NullPointerException
  org.joda.time.TestMinutes#testFactory_standardMinutesIn_RPeriod NullPointerException
  org.joda.time.TestMutableDateTime_Adds#testAddSeconds_int1 NullPointerException
  org.joda.time.TestMutableDateTime_Adds#testAdd_RP1 NullPointerException
  org.joda.time.TestMutableDateTime_Adds#testAdd_RP_int1 NullPointerException
  org.joda.time.TestMutableInterval_Basics#testToPeriod NullPointerException
  org.joda.time.TestMutableInterval_Basics#testToPeriod_PeriodType1 NullPointerException
  org.joda.time.TestMutableInterval_Basics#testToPeriod_PeriodType2 NullPointerException
  org.joda.time.TestMutableInterval_Constructors#testConstructor_RI_RP4 NullPointerException
  org.joda.time.TestMutableInterval_Constructors#testConstructor_RP_RI4 NullPointerException
  org.joda.time.TestMutableInterval_Updates#testSePeriodAfterStart_RI2 NullPointerException
  org.joda.time.TestMutableInterval_Updates#testSePeriodBeforeEnd_RI2 NullPointerException
  org.joda.time.TestMutableInterval_Updates#testSetPeriodAfterStart_RI1 NullPointerException
  org.joda.time.TestMutableInterval_Updates#testSetPeriodBeforeEnd_RI1 NullPointerException
  org.joda.time.TestMutablePeriod_Basics#testClone NullPointerException
  org.joda.time.TestMutablePeriod_Basics#testCopy NullPointerException
  org.joda.time.TestMutablePeriod_Basics#testEqualsHashCode NullPointerException
  org.joda.time.TestMutablePeriod_Basics#testSerialization NullPointerException
  org.joda.time.TestMutablePeriod_Basics#testToDurationFrom NullPointerException
  org.joda.time.TestMutablePeriod_Basics#testToMutablePeriod NullPointerException
  org.joda.time.TestMutablePeriod_Basics#testToPeriod NullPointerException
  org.joda.time.TestMutablePeriod_Basics#testToString NullPointerException
  org.joda.time.TestMutablePeriod_Constructors#testConstructor_Object_Chronology1 NullPointerException
  org.joda.time.TestMutablePeriod_Constructors#testConstructor_Object_Chronology2 NullPointerException
  org.joda.time.TestMutablePeriod_Constructors#testConstructor_RI_RD1 NullPointerException
  org.joda.time.TestMutablePeriod_Constructors#testConstructor_RI_RD_PeriodType1 NullPointerException
  org.joda.time.TestMutablePeriod_Constructors#testConstructor_RI_RI1 NullPointerException
  org.joda.time.TestMutablePeriod_Constructors#testConstructor_RI_RI2 NullPointerException
  org.joda.time.TestMutablePeriod_Constructors#testConstructor_RI_RI3 NullPointerException
  org.joda.time.TestMutablePeriod_Constructors#testConstructor_RI_RI4 NullPointerException
  org.joda.time.TestMutablePeriod_Constructors#testConstructor_RI_RI_PeriodType1 NullPointerException
  org.joda.time.TestMutablePeriod_Constructors#testConstructor_RI_RI_PeriodType2 NullPointerException
  org.joda.time.TestMutablePeriod_Constructors#testConstructor_RI_RI_PeriodType3 NullPointerException
  org.joda.time.TestMutablePeriod_Constructors#testConstructor_RI_RI_PeriodType4 NullPointerException
  org.joda.time.TestMutablePeriod_Constructors#testConstructor_long1 NullPointerException
  org.joda.time.TestMutablePeriod_Constructors#testConstructor_long2 NullPointerException
  org.joda.time.TestMutablePeriod_Constructors#testConstructor_long3 NullPointerException
  org.joda.time.TestMutablePeriod_Constructors#testConstructor_long_Chronology1 NullPointerException
  org.joda.time.TestMutablePeriod_Constructors#testConstructor_long_Chronology2 NullPointerException
  org.joda.time.TestMutablePeriod_Constructors#testConstructor_long_Chronology3 NullPointerException
  org.joda.time.TestMutablePeriod_Constructors#testConstructor_long_PeriodType1 NullPointerException
  org.joda.time.TestMutablePeriod_Constructors#testConstructor_long_PeriodType3 NullPointerException
  org.joda.time.TestMutablePeriod_Constructors#testConstructor_long_PeriodType4 NullPointerException
  org.joda.time.TestMutablePeriod_Constructors#testConstructor_long_PeriodType_Chronology1 NullPointerException
  org.joda.time.TestMutablePeriod_Constructors#testConstructor_long_PeriodType_Chronology2 NullPointerException
  org.joda.time.TestMutablePeriod_Constructors#testConstructor_long_PeriodType_Chronology3 NullPointerException
  org.joda.time.TestMutablePeriod_Constructors#testConstructor_long_PeriodType_Chronology4 NullPointerException
  org.joda.time.TestMutablePeriod_Constructors#testConstructor_long_long1 NullPointerException
  org.joda.time.TestMutablePeriod_Constructors#testConstructor_long_long2 NullPointerException
  org.joda.time.TestMutablePeriod_Constructors#testConstructor_long_long_Chronology1 NullPointerException
  org.joda.time.TestMutablePeriod_Constructors#testConstructor_long_long_Chronology2 NullPointerException
  org.joda.time.TestMutablePeriod_Constructors#testConstructor_long_long_PeriodType1 NullPointerException
  org.joda.time.TestMutablePeriod_Constructors#testConstructor_long_long_PeriodType2 NullPointerException
  org.joda.time.TestMutablePeriod_Constructors#testConstructor_long_long_PeriodType3 NullPointerException
  org.joda.time.TestMutablePeriod_Constructors#testConstructor_long_long_PeriodType_Chronology1 NullPointerException
  org.joda.time.TestMutablePeriod_Constructors#testConstructor_long_long_PeriodType_Chronology2 NullPointerException
  org.joda.time.TestMutablePeriod_Updates#testAdd_8ints1 NullPointerException
  org.joda.time.TestMutablePeriod_Updates#testAdd_8ints2 NullPointerException
  org.joda.time.TestMutablePeriod_Updates#testAdd_RD1 NullPointerException
  org.joda.time.TestMutablePeriod_Updates#testAdd_RD2 NullPointerException
  org.joda.time.TestMutablePeriod_Updates#testAdd_RInterval1 NullPointerException
  org.joda.time.TestMutablePeriod_Updates#testAdd_RInterval2 NullPointerException
  org.joda.time.TestMutablePeriod_Updates#testAdd_RInterval3 NullPointerException
  org.joda.time.TestMutablePeriod_Updates#testAdd_RInterval4 NullPointerException
  org.joda.time.TestMutablePeriod_Updates#testAdd_RP1 NullPointerException
  org.joda.time.TestMutablePeriod_Updates#testAdd_RP2 NullPointerException
  org.joda.time.TestMutablePeriod_Updates#testAdd_RP3 NullPointerException
  org.joda.time.TestMutablePeriod_Updates#testAdd_long1 NullPointerException
  org.joda.time.TestMutablePeriod_Updates#testAdd_long2 NullPointerException
  org.joda.time.TestMutablePeriod_Updates#testAdd_long3 NullPointerException
  org.joda.time.TestMutablePeriod_Updates#testAdd_long_Chronology1 NullPointerException
  org.joda.time.TestMutablePeriod_Updates#testAdd_long_Chronology2 NullPointerException
  org.joda.time.TestMutablePeriod_Updates#testAdd_long_Chronology3 NullPointerException
  org.joda.time.TestMutablePeriod_Updates#testSetPeriod_RD1 NullPointerException
  org.joda.time.TestMutablePeriod_Updates#testSetPeriod_RD2 NullPointerException
  org.joda.time.TestMutablePeriod_Updates#testSetPeriod_RI_RI1 NullPointerException
  org.joda.time.TestMutablePeriod_Updates#testSetPeriod_RI_RI2 NullPointerException
  org.joda.time.TestMutablePeriod_Updates#testSetPeriod_RInterval1 NullPointerException
  org.joda.time.TestMutablePeriod_Updates#testSetPeriod_long1 NullPointerException
  org.joda.time.TestMutablePeriod_Updates#testSetPeriod_long2 NullPointerException
  org.joda.time.TestMutablePeriod_Updates#testSetPeriod_long_long1 NullPointerException
  org.joda.time.TestMutablePeriod_Updates#testSetPeriod_long_long2 NullPointerException
  org.joda.time.TestMutablePeriod_Updates#testSetPeriod_long_long_NoDays NullPointerException
  org.joda.time.TestMutablePeriod_Updates#testSetPeriod_long_long_NoHours NullPointerException
  org.joda.time.TestMutablePeriod_Updates#testSetPeriod_long_long_NoMillis NullPointerException
  org.joda.time.TestMutablePeriod_Updates#testSetPeriod_long_long_NoMinutes NullPointerException
  org.joda.time.TestMutablePeriod_Updates#testSetPeriod_long_long_NoMonths NullPointerException
  org.joda.time.TestMutablePeriod_Updates#testSetPeriod_long_long_NoWeeks NullPointerException
  org.joda.time.TestMutablePeriod_Updates#testSetPeriod_long_long_NoYears NullPointerException
  org.joda.time.TestPartial_Basics#testCompareTo NullPointerException
  org.joda.time.TestPartial_Basics#testEqualsHashCode NullPointerException
  org.joda.time.TestPartial_Basics#testWith3a NullPointerException
  org.joda.time.TestPartial_Properties#testPropertyAddHour NullPointerException
  org.joda.time.TestPartial_Properties#testPropertyAddMinute NullPointerException
  org.joda.time.TestPartial_Properties#testPropertyAddWrapFieldHour NullPointerException
  org.joda.time.TestPartial_Properties#testPropertyAddWrapFieldMinute NullPointerException
  org.joda.time.TestPartial_Properties#testPropertyCompareToHour NullPointerException
  org.joda.time.TestPartial_Properties#testPropertyCompareToMinute NullPointerException
  org.joda.time.TestPartial_Properties#testPropertyGetHour NullPointerException
  org.joda.time.TestPartial_Properties#testPropertyGetMaxMinValuesHour NullPointerException
  org.joda.time.TestPartial_Properties#testPropertyGetMaxMinValuesMinute NullPointerException
  org.joda.time.TestPartial_Properties#testPropertyGetMinute NullPointerException
  org.joda.time.TestPartial_Properties#testPropertySetHour NullPointerException
  org.joda.time.TestPartial_Properties#testPropertySetMinute NullPointerException
  org.joda.time.TestPartial_Properties#testPropertySetTextHour NullPointerException
  org.joda.time.TestPartial_Properties#testPropertySetTextMinute NullPointerException
  org.joda.time.TestPartial_Properties#testPropertyWithMaximumValueHour NullPointerException
  org.joda.time.TestPartial_Properties#testPropertyWithMinimumValueHour NullPointerException
  org.joda.time.TestPeriod_Basics#testEqualsHashCode NullPointerException
  org.joda.time.TestPeriod_Basics#testNormalizedStandard_fullNegative NullPointerException
  org.joda.time.TestPeriod_Basics#testNormalizedStandard_negative NullPointerException
  org.joda.time.TestPeriod_Basics#testNormalizedStandard_periodType_weekDay1 NullPointerException
  org.joda.time.TestPeriod_Basics#testNormalizedStandard_periodType_weekDay3 NullPointerException
  org.joda.time.TestPeriod_Basics#testNormalizedStandard_periodType_yearMonth3 NullPointerException
  org.joda.time.TestPeriod_Basics#testNormalizedStandard_periodType_yearMonthDay NullPointerException
  org.joda.time.TestPeriod_Basics#testNormalizedStandard_periodType_yearMonthWeekDay NullPointerException
  org.joda.time.TestPeriod_Basics#testNormalizedStandard_weekDay1 NullPointerException
  org.joda.time.TestPeriod_Basics#testNormalizedStandard_yearMonthDay NullPointerException
  org.joda.time.TestPeriod_Basics#testNormalizedStandard_yearMonthWeekDay NullPointerException
  org.joda.time.TestPeriod_Basics#testSerialization NullPointerException
  org.joda.time.TestPeriod_Basics#testToDurationFrom NullPointerException
  org.joda.time.TestPeriod_Basics#testToDurationTo NullPointerException
  org.joda.time.TestPeriod_Basics#testToMutablePeriod NullPointerException
  org.joda.time.TestPeriod_Basics#testToPeriod NullPointerException
  org.joda.time.TestPeriod_Basics#testToString NullPointerException
  org.joda.time.TestPeriod_Basics#testWithPeriodType1 NullPointerException
  org.joda.time.TestPeriod_Basics#testWithPeriodType2 NullPointerException
  org.joda.time.TestPeriod_Basics#testWithPeriodType4 NullPointerException
  org.joda.time.TestPeriod_Constructors#testConstructor_RD_RI1 NullPointerException
  org.joda.time.TestPeriod_Constructors#testConstructor_RD_RI_PeriodType1 NullPointerException
  org.joda.time.TestPeriod_Constructors#testConstructor_RI_RD1 NullPointerException
  org.joda.time.TestPeriod_Constructors#testConstructor_RI_RD_PeriodType1 NullPointerException
  org.joda.time.TestPeriod_Constructors#testConstructor_RI_RI1 NullPointerException
  org.joda.time.TestPeriod_Constructors#testConstructor_RI_RI2 NullPointerException
  org.joda.time.TestPeriod_Constructors#testConstructor_RI_RI3 NullPointerException
  org.joda.time.TestPeriod_Constructors#testConstructor_RI_RI4 NullPointerException
  org.joda.time.TestPeriod_Constructors#testConstructor_RI_RI6 NullPointerException
  org.joda.time.TestPeriod_Constructors#testConstructor_RI_RI7 NullPointerException
  org.joda.time.TestPeriod_Constructors#testConstructor_RI_RI_PeriodType1 NullPointerException
  org.joda.time.TestPeriod_Constructors#testConstructor_RI_RI_PeriodType2 NullPointerException
  org.joda.time.TestPeriod_Constructors#testConstructor_RI_RI_PeriodType3 NullPointerException
  org.joda.time.TestPeriod_Constructors#testConstructor_RI_RI_PeriodType4 NullPointerException
  org.joda.time.TestPeriod_Constructors#testConstructor_RP_RP1 NullPointerException
  org.joda.time.TestPeriod_Constructors#testConstructor_RP_RP2 NullPointerException
  org.joda.time.TestPeriod_Constructors#testConstructor_RP_RP2Local NullPointerException
  org.joda.time.TestPeriod_Constructors#testConstructor_RP_RP_PeriodType1 NullPointerException
  org.joda.time.TestPeriod_Constructors#testConstructor_long1 NullPointerException
  org.joda.time.TestPeriod_Constructors#testConstructor_long2 NullPointerException
  org.joda.time.TestPeriod_Constructors#testConstructor_long3 NullPointerException
  org.joda.time.TestPeriod_Constructors#testConstructor_long_Chronology1 NullPointerException
  org.joda.time.TestPeriod_Constructors#testConstructor_long_Chronology2 NullPointerException
  org.joda.time.TestPeriod_Constructors#testConstructor_long_Chronology3 NullPointerException
  org.joda.time.TestPeriod_Constructors#testConstructor_long_PeriodType1 NullPointerException
  org.joda.time.TestPeriod_Constructors#testConstructor_long_PeriodType3 NullPointerException
  org.joda.time.TestPeriod_Constructors#testConstructor_long_PeriodType4 NullPointerException
  org.joda.time.TestPeriod_Constructors#testConstructor_long_PeriodType_Chronology1 NullPointerException
  org.joda.time.TestPeriod_Constructors#testConstructor_long_PeriodType_Chronology2 NullPointerException
  org.joda.time.TestPeriod_Constructors#testConstructor_long_PeriodType_Chronology3 NullPointerException
  org.joda.time.TestPeriod_Constructors#testConstructor_long_PeriodType_Chronology4 NullPointerException
  org.joda.time.TestPeriod_Constructors#testConstructor_long_fixedZone NullPointerException
  org.joda.time.TestPeriod_Constructors#testConstructor_long_long1 NullPointerException
  org.joda.time.TestPeriod_Constructors#testConstructor_long_long2 NullPointerException
  org.joda.time.TestPeriod_Constructors#testConstructor_long_long_Chronology1 NullPointerException
  org.joda.time.TestPeriod_Constructors#testConstructor_long_long_Chronology2 NullPointerException
  org.joda.time.TestPeriod_Constructors#testConstructor_long_long_PeriodType1 NullPointerException
  org.joda.time.TestPeriod_Constructors#testConstructor_long_long_PeriodType2 NullPointerException
  org.joda.time.TestPeriod_Constructors#testConstructor_long_long_PeriodType3 NullPointerException
  org.joda.time.TestPeriod_Constructors#testConstructor_long_long_PeriodType_Chronology1 NullPointerException
  org.joda.time.TestPeriod_Constructors#testConstructor_long_long_PeriodType_Chronology2 NullPointerException
  org.joda.time.TestPeriod_Constructors#testConstructor_trickyDifferences_LD_LD_toFeb_endOfMonth1 NullPointerException
  org.joda.time.TestPeriod_Constructors#testConstructor_trickyDifferences_LD_LD_toFeb_endOfMonth2 NullPointerException
  org.joda.time.TestPeriod_Constructors#testConstructor_trickyDifferences_LD_LD_toFeb_endOfMonth3 NullPointerException
  org.joda.time.TestPeriod_Constructors#testConstructor_trickyDifferences_LD_LD_toFeb_exactMonths NullPointerException
  org.joda.time.TestPeriod_Constructors#testConstructor_trickyDifferences_LD_LD_toFeb_leapYear NullPointerException
  org.joda.time.TestPeriod_Constructors#testConstructor_trickyDifferences_LD_LD_toFeb_standardYear NullPointerException
  org.joda.time.TestPeriod_Constructors#testConstructor_trickyDifferences_LD_LD_toMar_endOfMonth1 NullPointerException
  org.joda.time.TestPeriod_Constructors#testConstructor_trickyDifferences_LD_LD_toMar_endOfMonth2 NullPointerException
  org.joda.time.TestPeriod_Constructors#testConstructor_trickyDifferences_RI_RI_toFeb_endOfMonth1 NullPointerException
  org.joda.time.TestPeriod_Constructors#testConstructor_trickyDifferences_RI_RI_toFeb_endOfMonth2 NullPointerException
  org.joda.time.TestPeriod_Constructors#testConstructor_trickyDifferences_RI_RI_toFeb_endOfMonth3 NullPointerException
  org.joda.time.TestPeriod_Constructors#testConstructor_trickyDifferences_RI_RI_toFeb_exactMonths NullPointerException
  org.joda.time.TestPeriod_Constructors#testConstructor_trickyDifferences_RI_RI_toFeb_leapYear NullPointerException
  org.joda.time.TestPeriod_Constructors#testConstructor_trickyDifferences_RI_RI_toFeb_standardYear NullPointerException
  org.joda.time.TestPeriod_Constructors#testConstructor_trickyDifferences_RI_RI_toMar_endOfMonth1 NullPointerException
  org.joda.time.TestPeriod_Constructors#testConstructor_trickyDifferences_RI_RI_toMar_endOfMonth2 NullPointerException
  org.joda.time.TestPeriod_Constructors#testToPeriod_PeriodType3 NullPointerException
  org.joda.time.TestSeconds#testAddToLocalDate NullPointerException
  org.joda.time.TestSeconds#testFactory_secondsBetween_RInstant NullPointerException
  org.joda.time.TestSeconds#testFactory_secondsBetween_RPartial NullPointerException
  org.joda.time.TestSeconds#testFactory_secondsIn_RInterval NullPointerException
  org.joda.time.TestSeconds#testFactory_standardSecondsIn_RPeriod NullPointerException
  org.joda.time.TestStringConvert#testLocalTime NullPointerException
  org.joda.time.TestTimeOfDay_Basics#testCompareTo NullPointerException
  org.joda.time.chrono.TestBuddhistChronology#testDurationFields NullPointerException
  org.joda.time.chrono.TestCopticChronology#testDurationFields NullPointerException
  org.joda.time.chrono.TestEthiopicChronology#testDurationFields NullPointerException
  org.joda.time.chrono.TestGJChronology#testDurationFields NullPointerException
  org.joda.time.chrono.TestGregorianChronology#testDurationFields NullPointerException
  org.joda.time.chrono.TestISOChronology#testDurationFields NullPointerException
  org.joda.time.chrono.TestIslamicChronology#testDurationFields NullPointerException
  org.joda.time.chrono.TestJulianChronology#testDurationFields NullPointerException
  org.joda.time.convert.TestReadableDurationConverter#testSetInto_Object NullPointerException
  org.joda.time.convert.TestReadablePeriodConverter#testGetPeriodType_Object NullPointerException
  org.joda.time.field.TestMillisDurationField#test_compareTo NullPointerException
  org.joda.time.format.TestISODateTimeFormat#testFormat_timeNoMillis_partial NullPointerException
  org.joda.time.format.TestISODateTimeFormat#testFormat_time_partial NullPointerException
  org.joda.time.format.TestISODateTimeFormat_Fields#testForFields_time_HMS NullPointerException
  org.joda.time.format.TestISODateTimeFormat_Fields#testForFields_time_HMSm NullPointerException
  org.joda.time.format.TestISODateTimeFormat_Fields#testForFields_time_HS NullPointerException
  org.joda.time.format.TestISODateTimeFormat_Fields#testForFields_time_HSm NullPointerException
  org.joda.time.format.TestISODateTimeFormat_Fields#testForFields_time_MS NullPointerException
  org.joda.time.format.TestISODateTimeFormat_Fields#testForFields_time_MSm NullPointerException
  org.joda.time.format.TestISODateTimeFormat_Fields#testForFields_time_Sm NullPointerException

Tests run: 4157, Failures: 12, Errors: 262, Skipped: 0

[INFO] ------------------------------------------------------------------------
[INFO] BUILD FAILURE
[INFO] ------------------------------------------------------------------------
[INFO] Total time: 16.299s
[INFO] Finished at: Wed Aug 05 21:40:52 BST 2015
[INFO] Final Memory: 9M/213M
[INFO] ------------------------------------------------------------------------
[ERROR] Failed to execute goal org.apache.maven.plugins:maven-surefire-plugin:2.18.1:test (default-test) on project joda-time: There are test failures.
[ERROR] 
[ERROR] Please refer to /home/perham/Study/LittleDarwin/Cases/joda-time-2.8.1/target/surefire-reports for the individual test results.
[ERROR] -> [Help 1]
[ERROR] 
[ERROR] To see the full stack trace of the errors, re-run Maven with the -e switch.
[ERROR] Re-run Maven using the -X switch to enable full debug logging.
[ERROR] 
[ERROR] For more information about the errors and possible solutions, please read the following articles:
[ERROR] [Help 1] http://cwiki.apache.org/confluence/display/MAVEN/MojoFailureException
