[INFO] Scanning for projects...
[INFO]                                                                         
[INFO] ------------------------------------------------------------------------
[INFO] Building Joda-Time 2.8.1
[INFO] ------------------------------------------------------------------------
[INFO] 
[INFO] --- maven-resources-plugin:2.7:resources (default-resources) @ joda-time ---
[INFO] Using 'UTF-8' encoding to copy filtered resources.
[INFO] Copying 2 resources to META-INF
[INFO] Copying 10 resources
[INFO] 
[INFO] --- maven-compiler-plugin:3.3:compile (default-compile) @ joda-time ---
[INFO] Changes detected - recompiling the module!
[INFO] Compiling 166 source files to /home/perham/Study/LittleDarwin/Cases/joda-time-2.8.1/target/classes
[INFO] 
[INFO] --- exec-maven-plugin:1.4.0:java (compile-tzdb) @ joda-time ---
Writing zoneinfo files
Writing ZoneInfoMap
[INFO] 
[INFO] --- maven-resources-plugin:2.7:testResources (default-testResources) @ joda-time ---
[INFO] Using 'UTF-8' encoding to copy filtered resources.
[INFO] Copying 34 resources
[INFO] 
[INFO] --- maven-compiler-plugin:3.3:testCompile (default-testCompile) @ joda-time ---
[INFO] Nothing to compile - all classes are up to date
[INFO] 
[INFO] --- maven-surefire-plugin:2.18.1:test (default-test) @ joda-time ---
[INFO] Surefire report directory: /home/perham/Study/LittleDarwin/Cases/joda-time-2.8.1/target/surefire-reports

-------------------------------------------------------
 T E S T S
-------------------------------------------------------
Running org.joda.time.TestAllPackages

TestBuddhistChronology.testCalendar

TestCopticChronology.testCalendar

TestEthiopicChronology.testCalendar

TestIslamicChronology.testCalendar

Testing Gregorian chronology over 1000 iterations
100% complete (i=1000)

Testing Julian chronology over 1000 iterations
100% complete (i=1000)
Writing zoneinfo files
Writing ZoneInfoMap
Tests run: 4157, Failures: 12, Errors: 324, Skipped: 0, Time elapsed: 5.79 sec <<< FAILURE! - in org.joda.time.TestAllPackages
test_minutes(org.joda.time.TestDurationFieldType)  Time elapsed: 0.001 sec  <<< ERROR!
java.lang.NullPointerException
	at org.joda.time.TestDurationFieldType.test_minutes(TestDurationFieldType.java:131)

testWithDurationAdded_RP_int(org.joda.time.TestDateTime_Basics)  Time elapsed: 0.001 sec  <<< ERROR!
java.lang.NullPointerException
	at org.joda.time.chrono.BaseChronology.add(BaseChronology.java:307)
	at org.joda.time.DateTime.withPeriodAdded(DateTime.java:941)
	at org.joda.time.TestDateTime_Basics.testWithDurationAdded_RP_int(TestDateTime_Basics.java:1018)

testPlus_RP(org.joda.time.TestDateTime_Basics)  Time elapsed: 0.002 sec  <<< ERROR!
java.lang.NullPointerException
	at org.joda.time.chrono.BaseChronology.add(BaseChronology.java:307)
	at org.joda.time.DateTime.withPeriodAdded(DateTime.java:941)
	at org.joda.time.DateTime.plus(DateTime.java:997)
	at org.joda.time.TestDateTime_Basics.testPlus_RP(TestDateTime_Basics.java:1057)

testPlusMinutes_int(org.joda.time.TestDateTime_Basics)  Time elapsed: 0.002 sec  <<< ERROR!
java.lang.NullPointerException
	at org.joda.time.DateTime.plusMinutes(DateTime.java:1176)
	at org.joda.time.TestDateTime_Basics.testPlusMinutes_int(TestDateTime_Basics.java:1117)

testMinus_RP(org.joda.time.TestDateTime_Basics)  Time elapsed: 0 sec  <<< ERROR!
java.lang.NullPointerException
	at org.joda.time.chrono.BaseChronology.add(BaseChronology.java:307)
	at org.joda.time.DateTime.withPeriodAdded(DateTime.java:941)
	at org.joda.time.DateTime.minus(DateTime.java:1286)
	at org.joda.time.TestDateTime_Basics.testMinus_RP(TestDateTime_Basics.java:1165)

testMinusMinutes_int(org.joda.time.TestDateTime_Basics)  Time elapsed: 0.001 sec  <<< ERROR!
java.lang.NullPointerException
	at org.joda.time.DateTime.minusMinutes(DateTime.java:1466)
	at org.joda.time.TestDateTime_Basics.testMinusMinutes_int(TestDateTime_Basics.java:1225)

testPropertyGetMinuteOfHour(org.joda.time.TestDateTime_Properties)  Time elapsed: 0 sec  <<< FAILURE!
junit.framework.AssertionFailedError: expected:<null> but was:<DurationField[minutes]>
	at junit.framework.Assert.fail(Assert.java:47)
	at junit.framework.Assert.failNotEquals(Assert.java:280)
	at junit.framework.Assert.assertEquals(Assert.java:64)
	at junit.framework.Assert.assertEquals(Assert.java:71)
	at org.joda.time.TestDateTime_Properties.testPropertyGetMinuteOfHour(TestDateTime_Properties.java:1198)

testPropertyGetMinuteOfDay(org.joda.time.TestDateTime_Properties)  Time elapsed: 0 sec  <<< FAILURE!
junit.framework.AssertionFailedError: expected:<null> but was:<DurationField[minutes]>
	at junit.framework.Assert.fail(Assert.java:47)
	at junit.framework.Assert.failNotEquals(Assert.java:280)
	at junit.framework.Assert.assertEquals(Assert.java:64)
	at junit.framework.Assert.assertEquals(Assert.java:71)
	at org.joda.time.TestDateTime_Properties.testPropertyGetMinuteOfDay(TestDateTime_Properties.java:1217)

testPropertyGetSecondOfMinute(org.joda.time.TestDateTime_Properties)  Time elapsed: 0.001 sec  <<< FAILURE!
junit.framework.AssertionFailedError: expected:<null> but was:<DurationField[minutes]>
	at junit.framework.Assert.fail(Assert.java:47)
	at junit.framework.Assert.failNotEquals(Assert.java:280)
	at junit.framework.Assert.assertEquals(Assert.java:64)
	at junit.framework.Assert.assertEquals(Assert.java:71)
	at org.joda.time.TestDateTime_Properties.testPropertyGetSecondOfMinute(TestDateTime_Properties.java:1237)

testAdd_RP1(org.joda.time.TestMutableDateTime_Adds)  Time elapsed: 0.002 sec  <<< ERROR!
java.lang.NullPointerException
	at org.joda.time.chrono.BaseChronology.add(BaseChronology.java:307)
	at org.joda.time.MutableDateTime.add(MutableDateTime.java:549)
	at org.joda.time.MutableDateTime.add(MutableDateTime.java:535)
	at org.joda.time.TestMutableDateTime_Adds.testAdd_RP1(TestMutableDateTime_Adds.java:144)

testAddMinutes_int1(org.joda.time.TestMutableDateTime_Adds)  Time elapsed: 0 sec  <<< ERROR!
java.lang.NullPointerException
	at org.joda.time.MutableDateTime.addMinutes(MutableDateTime.java:830)
	at org.joda.time.TestMutableDateTime_Adds.testAddMinutes_int1(TestMutableDateTime_Adds.java:328)

testPropertyGetMinuteOfHour(org.joda.time.TestMutableDateTime_Properties)  Time elapsed: 0.001 sec  <<< FAILURE!
junit.framework.AssertionFailedError: expected:<null> but was:<DurationField[minutes]>
	at junit.framework.Assert.fail(Assert.java:47)
	at junit.framework.Assert.failNotEquals(Assert.java:280)
	at junit.framework.Assert.assertEquals(Assert.java:64)
	at junit.framework.Assert.assertEquals(Assert.java:71)
	at org.joda.time.TestMutableDateTime_Properties.testPropertyGetMinuteOfHour(TestMutableDateTime_Properties.java:600)

testPropertyGetMinuteOfDay(org.joda.time.TestMutableDateTime_Properties)  Time elapsed: 0.001 sec  <<< FAILURE!
junit.framework.AssertionFailedError: expected:<null> but was:<DurationField[minutes]>
	at junit.framework.Assert.fail(Assert.java:47)
	at junit.framework.Assert.failNotEquals(Assert.java:280)
	at junit.framework.Assert.assertEquals(Assert.java:64)
	at junit.framework.Assert.assertEquals(Assert.java:71)
	at org.joda.time.TestMutableDateTime_Properties.testPropertyGetMinuteOfDay(TestMutableDateTime_Properties.java:617)

testPropertyGetSecondOfMinute(org.joda.time.TestMutableDateTime_Properties)  Time elapsed: 0.001 sec  <<< FAILURE!
junit.framework.AssertionFailedError: expected:<null> but was:<DurationField[minutes]>
	at junit.framework.Assert.fail(Assert.java:47)
	at junit.framework.Assert.failNotEquals(Assert.java:280)
	at junit.framework.Assert.assertEquals(Assert.java:64)
	at junit.framework.Assert.assertEquals(Assert.java:71)
	at org.joda.time.TestMutableDateTime_Properties.testPropertyGetSecondOfMinute(TestMutableDateTime_Properties.java:635)

testWithDurationAdded_RP_int(org.joda.time.TestDateMidnight_Basics)  Time elapsed: 0.001 sec  <<< ERROR!
java.lang.NullPointerException
	at org.joda.time.chrono.BaseChronology.add(BaseChronology.java:307)
	at org.joda.time.DateMidnight.withPeriodAdded(DateMidnight.java:556)
	at org.joda.time.TestDateMidnight_Basics.testWithDurationAdded_RP_int(TestDateMidnight_Basics.java:831)

testPlus_RP(org.joda.time.TestDateMidnight_Basics)  Time elapsed: 0.002 sec  <<< ERROR!
java.lang.NullPointerException
	at org.joda.time.chrono.BaseChronology.add(BaseChronology.java:307)
	at org.joda.time.DateMidnight.withPeriodAdded(DateMidnight.java:556)
	at org.joda.time.DateMidnight.plus(DateMidnight.java:601)
	at org.joda.time.TestDateMidnight_Basics.testPlus_RP(TestDateMidnight_Basics.java:870)

testMinus_RP(org.joda.time.TestDateMidnight_Basics)  Time elapsed: 0 sec  <<< ERROR!
java.lang.NullPointerException
	at org.joda.time.chrono.BaseChronology.add(BaseChronology.java:307)
	at org.joda.time.DateMidnight.withPeriodAdded(DateMidnight.java:556)
	at org.joda.time.DateMidnight.minus(DateMidnight.java:742)
	at org.joda.time.TestDateMidnight_Basics.testMinus_RP(TestDateMidnight_Basics.java:938)

testToPeriod(org.joda.time.TestDuration_Basics)  Time elapsed: 0.001 sec  <<< ERROR!
java.lang.NullPointerException
	at org.joda.time.chrono.BaseChronology.get(BaseChronology.java:284)
	at org.joda.time.base.BasePeriod.<init>(BasePeriod.java:236)
	at org.joda.time.Period.<init>(Period.java:382)
	at org.joda.time.base.AbstractDuration.toPeriod(AbstractDuration.java:80)
	at org.joda.time.TestDuration_Basics.testToPeriod(TestDuration_Basics.java:456)

testToPeriod_fixedZone(org.joda.time.TestDuration_Basics)  Time elapsed: 0 sec  <<< ERROR!
java.lang.NullPointerException
	at org.joda.time.chrono.BaseChronology.get(BaseChronology.java:284)
	at org.joda.time.base.BasePeriod.<init>(BasePeriod.java:236)
	at org.joda.time.Period.<init>(Period.java:382)
	at org.joda.time.base.AbstractDuration.toPeriod(AbstractDuration.java:80)
	at org.joda.time.TestDuration_Basics.testToPeriod_fixedZone(TestDuration_Basics.java:480)

testToPeriod_PeriodType(org.joda.time.TestDuration_Basics)  Time elapsed: 0.001 sec  <<< ERROR!
java.lang.NullPointerException
	at org.joda.time.chrono.BaseChronology.get(BaseChronology.java:284)
	at org.joda.time.base.BasePeriod.<init>(BasePeriod.java:258)
	at org.joda.time.Period.<init>(Period.java:402)
	at org.joda.time.base.BaseDuration.toPeriod(BaseDuration.java:144)
	at org.joda.time.TestDuration_Basics.testToPeriod_PeriodType(TestDuration_Basics.java:502)

testToPeriod_Chronology(org.joda.time.TestDuration_Basics)  Time elapsed: 0 sec  <<< ERROR!
java.lang.NullPointerException
	at org.joda.time.chrono.BaseChronology.get(BaseChronology.java:284)
	at org.joda.time.base.BasePeriod.<init>(BasePeriod.java:258)
	at org.joda.time.Period.<init>(Period.java:423)
	at org.joda.time.base.BaseDuration.toPeriod(BaseDuration.java:164)
	at org.joda.time.TestDuration_Basics.testToPeriod_Chronology(TestDuration_Basics.java:515)

testToPeriod_PeriodType_Chronology(org.joda.time.TestDuration_Basics)  Time elapsed: 0.001 sec  <<< ERROR!
java.lang.NullPointerException
	at org.joda.time.chrono.BaseChronology.get(BaseChronology.java:284)
	at org.joda.time.base.BasePeriod.<init>(BasePeriod.java:258)
	at org.joda.time.Period.<init>(Period.java:444)
	at org.joda.time.base.BaseDuration.toPeriod(BaseDuration.java:185)
	at org.joda.time.TestDuration_Basics.testToPeriod_PeriodType_Chronology(TestDuration_Basics.java:528)

testToPeriodFrom(org.joda.time.TestDuration_Basics)  Time elapsed: 0.001 sec  <<< ERROR!
java.lang.NullPointerException
	at org.joda.time.chrono.BaseChronology.get(BaseChronology.java:260)
	at org.joda.time.base.BasePeriod.<init>(BasePeriod.java:201)
	at org.joda.time.Period.<init>(Period.java:626)
	at org.joda.time.base.BaseDuration.toPeriodFrom(BaseDuration.java:200)
	at org.joda.time.TestDuration_Basics.testToPeriodFrom(TestDuration_Basics.java:542)

testToPeriodFrom_PeriodType(org.joda.time.TestDuration_Basics)  Time elapsed: 0 sec  <<< ERROR!
java.lang.NullPointerException
	at org.joda.time.chrono.BaseChronology.get(BaseChronology.java:260)
	at org.joda.time.base.BasePeriod.<init>(BasePeriod.java:201)
	at org.joda.time.Period.<init>(Period.java:637)
	at org.joda.time.base.BaseDuration.toPeriodFrom(BaseDuration.java:216)
	at org.joda.time.TestDuration_Basics.testToPeriodFrom_PeriodType(TestDuration_Basics.java:555)

testToPeriodTo(org.joda.time.TestDuration_Basics)  Time elapsed: 0.001 sec  <<< ERROR!
java.lang.NullPointerException
	at org.joda.time.chrono.BaseChronology.get(BaseChronology.java:260)
	at org.joda.time.base.BasePeriod.<init>(BasePeriod.java:219)
	at org.joda.time.Period.<init>(Period.java:647)
	at org.joda.time.base.BaseDuration.toPeriodTo(BaseDuration.java:232)
	at org.joda.time.TestDuration_Basics.testToPeriodTo(TestDuration_Basics.java:568)

testToPeriodTo_PeriodType(org.joda.time.TestDuration_Basics)  Time elapsed: 0.002 sec  <<< ERROR!
java.lang.NullPointerException
	at org.joda.time.chrono.BaseChronology.get(BaseChronology.java:260)
	at org.joda.time.base.BasePeriod.<init>(BasePeriod.java:219)
	at org.joda.time.Period.<init>(Period.java:658)
	at org.joda.time.base.BaseDuration.toPeriodTo(BaseDuration.java:249)
	at org.joda.time.TestDuration_Basics.testToPeriodTo_PeriodType(TestDuration_Basics.java:581)

testConstructor_RI_RP4(org.joda.time.TestInterval_Constructors)  Time elapsed: 0.003 sec  <<< ERROR!
java.lang.NullPointerException
	at org.joda.time.chrono.BaseChronology.get(BaseChronology.java:284)
	at org.joda.time.base.BasePeriod.<init>(BasePeriod.java:236)
	at org.joda.time.Period.<init>(Period.java:382)
	at org.joda.time.TestInterval_Constructors.testConstructor_RI_RP4(TestInterval_Constructors.java:308)

testConstructor_RP_RI4(org.joda.time.TestInterval_Constructors)  Time elapsed: 0 sec  <<< ERROR!
java.lang.NullPointerException
	at org.joda.time.chrono.BaseChronology.get(BaseChronology.java:284)
	at org.joda.time.base.BasePeriod.<init>(BasePeriod.java:236)
	at org.joda.time.Period.<init>(Period.java:382)
	at org.joda.time.TestInterval_Constructors.testConstructor_RP_RI4(TestInterval_Constructors.java:392)

testToPeriod(org.joda.time.TestInterval_Basics)  Time elapsed: 0.001 sec  <<< ERROR!
java.lang.NullPointerException
	at org.joda.time.chrono.BaseChronology.get(BaseChronology.java:260)
	at org.joda.time.base.BasePeriod.<init>(BasePeriod.java:110)
	at org.joda.time.Period.<init>(Period.java:478)
	at org.joda.time.base.AbstractInterval.toPeriod(AbstractInterval.java:433)
	at org.joda.time.TestInterval_Basics.testToPeriod(TestInterval_Basics.java:997)

testToPeriod_PeriodType1(org.joda.time.TestInterval_Basics)  Time elapsed: 0 sec  <<< ERROR!
java.lang.NullPointerException
	at org.joda.time.chrono.BaseChronology.get(BaseChronology.java:260)
	at org.joda.time.base.BasePeriod.<init>(BasePeriod.java:110)
	at org.joda.time.Period.<init>(Period.java:490)
	at org.joda.time.base.AbstractInterval.toPeriod(AbstractInterval.java:447)
	at org.joda.time.TestInterval_Basics.testToPeriod_PeriodType1(TestInterval_Basics.java:1008)

testToPeriod_PeriodType2(org.joda.time.TestInterval_Basics)  Time elapsed: 0 sec  <<< ERROR!
java.lang.NullPointerException
	at org.joda.time.chrono.BaseChronology.get(BaseChronology.java:260)
	at org.joda.time.base.BasePeriod.<init>(BasePeriod.java:110)
	at org.joda.time.Period.<init>(Period.java:490)
	at org.joda.time.base.AbstractInterval.toPeriod(AbstractInterval.java:447)
	at org.joda.time.TestInterval_Basics.testToPeriod_PeriodType2(TestInterval_Basics.java:1018)

testPlus_RP(org.joda.time.TestLocalDateTime_Basics)  Time elapsed: 0.001 sec  <<< ERROR!
java.lang.NullPointerException
	at org.joda.time.chrono.BaseChronology.add(BaseChronology.java:307)
	at org.joda.time.LocalDateTime.withPeriodAdded(LocalDateTime.java:1062)
	at org.joda.time.LocalDateTime.plus(LocalDateTime.java:1094)
	at org.joda.time.TestLocalDateTime_Basics.testPlus_RP(TestLocalDateTime_Basics.java:535)

testPlusMinutes_int(org.joda.time.TestLocalDateTime_Basics)  Time elapsed: 0 sec  <<< ERROR!
java.lang.NullPointerException
	at org.joda.time.LocalDateTime.plusMinutes(LocalDateTime.java:1233)
	at org.joda.time.TestLocalDateTime_Basics.testPlusMinutes_int(TestLocalDateTime_Basics.java:595)

testMinus_RP(org.joda.time.TestLocalDateTime_Basics)  Time elapsed: 0.001 sec  <<< ERROR!
java.lang.NullPointerException
	at org.joda.time.chrono.BaseChronology.add(BaseChronology.java:307)
	at org.joda.time.LocalDateTime.withPeriodAdded(LocalDateTime.java:1062)
	at org.joda.time.LocalDateTime.minus(LocalDateTime.java:1311)
	at org.joda.time.TestLocalDateTime_Basics.testMinus_RP(TestLocalDateTime_Basics.java:626)

testMinusMinutes_int(org.joda.time.TestLocalDateTime_Basics)  Time elapsed: 0 sec  <<< ERROR!
java.lang.NullPointerException
	at org.joda.time.LocalDateTime.minusMinutes(LocalDateTime.java:1450)
	at org.joda.time.TestLocalDateTime_Basics.testMinusMinutes_int(TestLocalDateTime_Basics.java:687)

testIsSupported_DurationFieldType(org.joda.time.TestLocalDateTime_Basics)  Time elapsed: 0.001 sec  <<< ERROR!
java.lang.NullPointerException
	at org.joda.time.LocalDateTime.isSupported(LocalDateTime.java:639)
	at org.joda.time.TestLocalDateTime_Basics.testIsSupported_DurationFieldType(TestLocalDateTime_Basics.java:274)

testPropertyGetMinute(org.joda.time.TestLocalDateTime_Properties)  Time elapsed: 0 sec  <<< FAILURE!
junit.framework.AssertionFailedError: expected:<null> but was:<DurationField[minutes]>
	at junit.framework.Assert.fail(Assert.java:47)
	at junit.framework.Assert.failNotEquals(Assert.java:280)
	at junit.framework.Assert.assertEquals(Assert.java:64)
	at junit.framework.Assert.assertEquals(Assert.java:71)
	at org.joda.time.TestLocalDateTime_Properties.testPropertyGetMinute(TestLocalDateTime_Properties.java:703)

testPropertyGetSecond(org.joda.time.TestLocalDateTime_Properties)  Time elapsed: 0 sec  <<< FAILURE!
junit.framework.AssertionFailedError: expected:<null> but was:<DurationField[minutes]>
	at junit.framework.Assert.fail(Assert.java:47)
	at junit.framework.Assert.failNotEquals(Assert.java:280)
	at junit.framework.Assert.assertEquals(Assert.java:64)
	at junit.framework.Assert.assertEquals(Assert.java:71)
	at org.joda.time.TestLocalDateTime_Properties.testPropertyGetSecond(TestLocalDateTime_Properties.java:835)

testPlus_RP(org.joda.time.TestLocalDate_Basics)  Time elapsed: 0.001 sec  <<< ERROR!
java.lang.NullPointerException
	at org.joda.time.LocalDate.isSupported(LocalDate.java:594)
	at org.joda.time.LocalDate.withPeriodAdded(LocalDate.java:1168)
	at org.joda.time.LocalDate.plus(LocalDate.java:1193)
	at org.joda.time.TestLocalDate_Basics.testPlus_RP(TestLocalDate_Basics.java:519)

testMinus_RP(org.joda.time.TestLocalDate_Basics)  Time elapsed: 0 sec  <<< ERROR!
java.lang.NullPointerException
	at org.joda.time.LocalDate.isSupported(LocalDate.java:594)
	at org.joda.time.LocalDate.withPeriodAdded(LocalDate.java:1168)
	at org.joda.time.LocalDate.minus(LocalDate.java:1312)
	at org.joda.time.TestLocalDate_Basics.testMinus_RP(TestLocalDate_Basics.java:570)

testConstructor_ObjectLocalTime(org.joda.time.TestLocalTime_Constructors)  Time elapsed: 0 sec  <<< ERROR!
java.lang.NullPointerException
	at org.joda.time.LocalTime.isSupported(LocalTime.java:646)
	at org.joda.time.LocalTime.isSupported(LocalTime.java:625)
	at org.joda.time.LocalTime.get(LocalTime.java:607)
	at org.joda.time.convert.ReadablePartialConverter.getPartialValues(ReadablePartialConverter.java:91)
	at org.joda.time.convert.AbstractConverter.getPartialValues(AbstractConverter.java:123)
	at org.joda.time.LocalTime.<init>(LocalTime.java:435)
	at org.joda.time.LocalTime.<init>(LocalTime.java:383)
	at org.joda.time.TestLocalTime_Constructors.testConstructor_ObjectLocalTime(TestLocalTime_Constructors.java:462)

testCompareTo(org.joda.time.TestLocalTime_Basics)  Time elapsed: 0.001 sec  <<< ERROR!
java.lang.NullPointerException
	at org.joda.time.Partial.<init>(Partial.java:221)
	at org.joda.time.Partial.<init>(Partial.java:177)
	at org.joda.time.TestLocalTime_Basics.testCompareTo(TestLocalTime_Basics.java:338)

testToString(org.joda.time.TestLocalTime_Basics)  Time elapsed: 0 sec  <<< ERROR!
java.lang.NullPointerException
	at org.joda.time.LocalTime.isSupported(LocalTime.java:646)
	at org.joda.time.LocalTime.isSupported(LocalTime.java:625)
	at org.joda.time.format.DateTimeFormatterBuilder$PaddedNumber.printTo(DateTimeFormatterBuilder.java:1434)
	at org.joda.time.format.DateTimeFormatterBuilder$Composite.printTo(DateTimeFormatterBuilder.java:2446)
	at org.joda.time.format.DateTimeFormatter.printTo(DateTimeFormatter.java:609)
	at org.joda.time.format.DateTimeFormatter.print(DateTimeFormatter.java:663)
	at org.joda.time.LocalTime.toString(LocalTime.java:1299)
	at org.joda.time.TestLocalTime_Basics.testToString(TestLocalTime_Basics.java:786)

testIsSupported_DateTimeFieldType(org.joda.time.TestLocalTime_Basics)  Time elapsed: 0.001 sec  <<< ERROR!
java.lang.NullPointerException
	at org.joda.time.LocalTime.isSupported(LocalTime.java:646)
	at org.joda.time.LocalTime.isSupported(LocalTime.java:625)
	at org.joda.time.TestLocalTime_Basics.testIsSupported_DateTimeFieldType(TestLocalTime_Basics.java:212)

testToString_String(org.joda.time.TestLocalTime_Basics)  Time elapsed: 0.001 sec  <<< ERROR!
java.lang.NullPointerException
	at org.joda.time.LocalTime.isSupported(LocalTime.java:646)
	at org.joda.time.LocalTime.isSupported(LocalTime.java:625)
	at org.joda.time.format.DateTimeFormatterBuilder$PaddedNumber.printTo(DateTimeFormatterBuilder.java:1434)
	at org.joda.time.format.DateTimeFormatterBuilder$Composite.printTo(DateTimeFormatterBuilder.java:2446)
	at org.joda.time.format.DateTimeFormatter.printTo(DateTimeFormatter.java:609)
	at org.joda.time.format.DateTimeFormatter.print(DateTimeFormatter.java:663)
	at org.joda.time.LocalTime.toString(LocalTime.java:1299)
	at org.joda.time.LocalTime.toString(LocalTime.java:1310)
	at org.joda.time.TestLocalTime_Basics.testToString_String(TestLocalTime_Basics.java:793)

testToString_String_Locale(org.joda.time.TestLocalTime_Basics)  Time elapsed: 0 sec  <<< ERROR!
java.lang.NullPointerException
	at org.joda.time.LocalTime.isSupported(LocalTime.java:646)
	at org.joda.time.LocalTime.isSupported(LocalTime.java:625)
	at org.joda.time.format.DateTimeFormatterBuilder$UnpaddedNumber.printTo(DateTimeFormatterBuilder.java:1394)
	at org.joda.time.format.DateTimeFormatterBuilder$Composite.printTo(DateTimeFormatterBuilder.java:2446)
	at org.joda.time.format.DateTimeFormatter.printTo(DateTimeFormatter.java:609)
	at org.joda.time.format.DateTimeFormatter.print(DateTimeFormatter.java:663)
	at org.joda.time.LocalTime.toString(LocalTime.java:1326)
	at org.joda.time.TestLocalTime_Basics.testToString_String_Locale(TestLocalTime_Basics.java:799)

testToString_DTFormatter(org.joda.time.TestLocalTime_Basics)  Time elapsed: 0.001 sec  <<< ERROR!
java.lang.NullPointerException
	at org.joda.time.LocalTime.isSupported(LocalTime.java:646)
	at org.joda.time.LocalTime.isSupported(LocalTime.java:625)
	at org.joda.time.format.DateTimeFormatterBuilder$PaddedNumber.printTo(DateTimeFormatterBuilder.java:1434)
	at org.joda.time.format.DateTimeFormatterBuilder$Composite.printTo(DateTimeFormatterBuilder.java:2446)
	at org.joda.time.format.DateTimeFormatter.printTo(DateTimeFormatter.java:609)
	at org.joda.time.format.DateTimeFormatter.print(DateTimeFormatter.java:663)
	at org.joda.time.LocalTime.toString(LocalTime.java:1299)
	at org.joda.time.base.AbstractPartial.toString(AbstractPartial.java:410)
	at org.joda.time.TestLocalTime_Basics.testToString_DTFormatter(TestLocalTime_Basics.java:809)

testGet_DateTimeFieldType(org.joda.time.TestLocalTime_Basics)  Time elapsed: 0.001 sec  <<< ERROR!
java.lang.NullPointerException
	at org.joda.time.LocalTime.isSupported(LocalTime.java:646)
	at org.joda.time.LocalTime.isSupported(LocalTime.java:625)
	at org.joda.time.LocalTime.get(LocalTime.java:607)
	at org.joda.time.TestLocalTime_Basics.testGet_DateTimeFieldType(TestLocalTime_Basics.java:99)

testPlus_RP(org.joda.time.TestLocalTime_Basics)  Time elapsed: 0 sec  <<< ERROR!
java.lang.NullPointerException
	at org.joda.time.chrono.BaseChronology.add(BaseChronology.java:307)
	at org.joda.time.LocalTime.withPeriodAdded(LocalTime.java:848)
	at org.joda.time.LocalTime.plus(LocalTime.java:867)
	at org.joda.time.TestLocalTime_Basics.testPlus_RP(TestLocalTime_Basics.java:540)

testPlusMinutes_int(org.joda.time.TestLocalTime_Basics)  Time elapsed: 0.001 sec  <<< ERROR!
java.lang.NullPointerException
	at org.joda.time.LocalTime.plusMinutes(LocalTime.java:913)
	at org.joda.time.TestLocalTime_Basics.testPlusMinutes_int(TestLocalTime_Basics.java:560)

testMinus_RP(org.joda.time.TestLocalTime_Basics)  Time elapsed: 0 sec  <<< ERROR!
java.lang.NullPointerException
	at org.joda.time.chrono.BaseChronology.add(BaseChronology.java:307)
	at org.joda.time.LocalTime.withPeriodAdded(LocalTime.java:848)
	at org.joda.time.LocalTime.minus(LocalTime.java:978)
	at org.joda.time.TestLocalTime_Basics.testMinus_RP(TestLocalTime_Basics.java:591)

testMinusMinutes_int(org.joda.time.TestLocalTime_Basics)  Time elapsed: 0.001 sec  <<< ERROR!
java.lang.NullPointerException
	at org.joda.time.LocalTime.minusMinutes(LocalTime.java:1024)
	at org.joda.time.TestLocalTime_Basics.testMinusMinutes_int(TestLocalTime_Basics.java:611)

testProperty(org.joda.time.TestLocalTime_Basics)  Time elapsed: 0.001 sec  <<< ERROR!
java.lang.NullPointerException
	at org.joda.time.LocalTime.isSupported(LocalTime.java:646)
	at org.joda.time.LocalTime.isSupported(LocalTime.java:625)
	at org.joda.time.LocalTime.property(LocalTime.java:1087)
	at org.joda.time.TestLocalTime_Basics.testProperty(TestLocalTime_Basics.java:739)

testWithFieldAdded_DurationFieldType_int_7(org.joda.time.TestLocalTime_Basics)  Time elapsed: 0 sec  <<< ERROR!
java.lang.NullPointerException
	at org.joda.time.LocalTime.isSupported(LocalTime.java:646)
	at org.joda.time.LocalTime.withFieldAdded(LocalTime.java:818)
	at org.joda.time.TestLocalTime_Basics.testWithFieldAdded_DurationFieldType_int_7(TestLocalTime_Basics.java:511)

testWithFieldAdded_DurationFieldType_int_8(org.joda.time.TestLocalTime_Basics)  Time elapsed: 0.001 sec  <<< ERROR!
java.lang.NullPointerException
	at org.joda.time.LocalTime.isSupported(LocalTime.java:646)
	at org.joda.time.LocalTime.withFieldAdded(LocalTime.java:818)
	at org.joda.time.TestLocalTime_Basics.testWithFieldAdded_DurationFieldType_int_8(TestLocalTime_Basics.java:529)

testIsSupported_DurationFieldType(org.joda.time.TestLocalTime_Basics)  Time elapsed: 0 sec  <<< ERROR!
java.lang.NullPointerException
	at org.joda.time.LocalTime.isSupported(LocalTime.java:646)
	at org.joda.time.TestLocalTime_Basics.testIsSupported_DurationFieldType(TestLocalTime_Basics.java:259)

testPropertyGetMinute(org.joda.time.TestLocalTime_Properties)  Time elapsed: 0 sec  <<< FAILURE!
junit.framework.AssertionFailedError: expected:<null> but was:<DurationField[minutes]>
	at junit.framework.Assert.fail(Assert.java:47)
	at junit.framework.Assert.failNotEquals(Assert.java:280)
	at junit.framework.Assert.assertEquals(Assert.java:64)
	at junit.framework.Assert.assertEquals(Assert.java:71)
	at org.joda.time.TestLocalTime_Properties.testPropertyGetMinute(TestLocalTime_Properties.java:278)

testPropertyCompareToMinute(org.joda.time.TestLocalTime_Properties)  Time elapsed: 0 sec  <<< ERROR!
java.lang.NullPointerException
	at org.joda.time.LocalTime.isSupported(LocalTime.java:646)
	at org.joda.time.LocalTime.isSupported(LocalTime.java:625)
	at org.joda.time.LocalTime.get(LocalTime.java:607)
	at org.joda.time.field.AbstractReadableInstantFieldProperty.compareTo(AbstractReadableInstantFieldProperty.java:424)
	at org.joda.time.TestLocalTime_Properties.testPropertyCompareToMinute(TestLocalTime_Properties.java:423)

testPropertyGetSecond(org.joda.time.TestLocalTime_Properties)  Time elapsed: 0 sec  <<< FAILURE!
junit.framework.AssertionFailedError: expected:<null> but was:<DurationField[minutes]>
	at junit.framework.Assert.fail(Assert.java:47)
	at junit.framework.Assert.failNotEquals(Assert.java:280)
	at junit.framework.Assert.assertEquals(Assert.java:64)
	at junit.framework.Assert.assertEquals(Assert.java:71)
	at org.joda.time.TestLocalTime_Properties.testPropertyGetSecond(TestLocalTime_Properties.java:456)

testPropertyCompareToSecond(org.joda.time.TestLocalTime_Properties)  Time elapsed: 0.001 sec  <<< ERROR!
java.lang.NullPointerException
	at org.joda.time.LocalTime.isSupported(LocalTime.java:646)
	at org.joda.time.LocalTime.isSupported(LocalTime.java:629)
	at org.joda.time.LocalTime.get(LocalTime.java:607)
	at org.joda.time.field.AbstractReadableInstantFieldProperty.compareTo(AbstractReadableInstantFieldProperty.java:424)
	at org.joda.time.TestLocalTime_Properties.testPropertyCompareToSecond(TestLocalTime_Properties.java:594)

testConstructor_RI_RP4(org.joda.time.TestMutableInterval_Constructors)  Time elapsed: 0 sec  <<< ERROR!
java.lang.NullPointerException
	at org.joda.time.chrono.BaseChronology.get(BaseChronology.java:284)
	at org.joda.time.base.BasePeriod.<init>(BasePeriod.java:236)
	at org.joda.time.Period.<init>(Period.java:382)
	at org.joda.time.TestMutableInterval_Constructors.testConstructor_RI_RP4(TestMutableInterval_Constructors.java:284)

testConstructor_RP_RI4(org.joda.time.TestMutableInterval_Constructors)  Time elapsed: 0 sec  <<< ERROR!
java.lang.NullPointerException
	at org.joda.time.chrono.BaseChronology.get(BaseChronology.java:284)
	at org.joda.time.base.BasePeriod.<init>(BasePeriod.java:236)
	at org.joda.time.Period.<init>(Period.java:382)
	at org.joda.time.TestMutableInterval_Constructors.testConstructor_RP_RI4(TestMutableInterval_Constructors.java:368)

testToPeriod(org.joda.time.TestMutableInterval_Basics)  Time elapsed: 0 sec  <<< ERROR!
java.lang.NullPointerException
	at org.joda.time.chrono.BaseChronology.get(BaseChronology.java:260)
	at org.joda.time.base.BasePeriod.<init>(BasePeriod.java:110)
	at org.joda.time.Period.<init>(Period.java:478)
	at org.joda.time.base.AbstractInterval.toPeriod(AbstractInterval.java:433)
	at org.joda.time.TestMutableInterval_Basics.testToPeriod(TestMutableInterval_Basics.java:422)

testToPeriod_PeriodType1(org.joda.time.TestMutableInterval_Basics)  Time elapsed: 0 sec  <<< ERROR!
java.lang.NullPointerException
	at org.joda.time.chrono.BaseChronology.get(BaseChronology.java:260)
	at org.joda.time.base.BasePeriod.<init>(BasePeriod.java:110)
	at org.joda.time.Period.<init>(Period.java:490)
	at org.joda.time.base.AbstractInterval.toPeriod(AbstractInterval.java:447)
	at org.joda.time.TestMutableInterval_Basics.testToPeriod_PeriodType1(TestMutableInterval_Basics.java:433)

testToPeriod_PeriodType2(org.joda.time.TestMutableInterval_Basics)  Time elapsed: 0.001 sec  <<< ERROR!
java.lang.NullPointerException
	at org.joda.time.chrono.BaseChronology.get(BaseChronology.java:260)
	at org.joda.time.base.BasePeriod.<init>(BasePeriod.java:110)
	at org.joda.time.Period.<init>(Period.java:490)
	at org.joda.time.base.AbstractInterval.toPeriod(AbstractInterval.java:447)
	at org.joda.time.TestMutableInterval_Basics.testToPeriod_PeriodType2(TestMutableInterval_Basics.java:443)

testSetPeriodAfterStart_RI1(org.joda.time.TestMutableInterval_Updates)  Time elapsed: 0.001 sec  <<< ERROR!
java.lang.NullPointerException
	at org.joda.time.chrono.BaseChronology.get(BaseChronology.java:284)
	at org.joda.time.base.BasePeriod.<init>(BasePeriod.java:236)
	at org.joda.time.Period.<init>(Period.java:382)
	at org.joda.time.TestMutableInterval_Updates.testSetPeriodAfterStart_RI1(TestMutableInterval_Updates.java:355)

testSePeriodAfterStart_RI2(org.joda.time.TestMutableInterval_Updates)  Time elapsed: 0 sec  <<< ERROR!
java.lang.NullPointerException
	at org.joda.time.chrono.BaseChronology.get(BaseChronology.java:284)
	at org.joda.time.base.BasePeriod.<init>(BasePeriod.java:236)
	at org.joda.time.Period.<init>(Period.java:382)
	at org.joda.time.TestMutableInterval_Updates.testSePeriodAfterStart_RI2(TestMutableInterval_Updates.java:363)

testSetPeriodBeforeEnd_RI1(org.joda.time.TestMutableInterval_Updates)  Time elapsed: 0.001 sec  <<< ERROR!
java.lang.NullPointerException
	at org.joda.time.chrono.BaseChronology.get(BaseChronology.java:284)
	at org.joda.time.base.BasePeriod.<init>(BasePeriod.java:236)
	at org.joda.time.Period.<init>(Period.java:382)
	at org.joda.time.TestMutableInterval_Updates.testSetPeriodBeforeEnd_RI1(TestMutableInterval_Updates.java:378)

testSePeriodBeforeEnd_RI2(org.joda.time.TestMutableInterval_Updates)  Time elapsed: 0.001 sec  <<< ERROR!
java.lang.NullPointerException
	at org.joda.time.chrono.BaseChronology.get(BaseChronology.java:284)
	at org.joda.time.base.BasePeriod.<init>(BasePeriod.java:236)
	at org.joda.time.Period.<init>(Period.java:382)
	at org.joda.time.TestMutableInterval_Updates.testSePeriodBeforeEnd_RI2(TestMutableInterval_Updates.java:386)

testConstructor_long1(org.joda.time.TestPeriod_Constructors)  Time elapsed: 0.013 sec  <<< ERROR!
java.lang.NullPointerException
	at org.joda.time.chrono.BaseChronology.get(BaseChronology.java:284)
	at org.joda.time.base.BasePeriod.<init>(BasePeriod.java:236)
	at org.joda.time.Period.<init>(Period.java:382)
	at org.joda.time.TestPeriod_Constructors.testConstructor_long1(TestPeriod_Constructors.java:127)

testConstructor_long2(org.joda.time.TestPeriod_Constructors)  Time elapsed: 0 sec  <<< ERROR!
java.lang.NullPointerException
	at org.joda.time.chrono.BaseChronology.get(BaseChronology.java:284)
	at org.joda.time.base.BasePeriod.<init>(BasePeriod.java:236)
	at org.joda.time.Period.<init>(Period.java:382)
	at org.joda.time.TestPeriod_Constructors.testConstructor_long2(TestPeriod_Constructors.java:144)

testConstructor_long3(org.joda.time.TestPeriod_Constructors)  Time elapsed: 0 sec  <<< ERROR!
java.lang.NullPointerException
	at org.joda.time.chrono.BaseChronology.get(BaseChronology.java:284)
	at org.joda.time.base.BasePeriod.<init>(BasePeriod.java:236)
	at org.joda.time.Period.<init>(Period.java:382)
	at org.joda.time.TestPeriod_Constructors.testConstructor_long3(TestPeriod_Constructors.java:162)

testConstructor_long_fixedZone(org.joda.time.TestPeriod_Constructors)  Time elapsed: 0.003 sec  <<< ERROR!
java.lang.NullPointerException
	at org.joda.time.chrono.BaseChronology.get(BaseChronology.java:284)
	at org.joda.time.base.BasePeriod.<init>(BasePeriod.java:236)
	at org.joda.time.Period.<init>(Period.java:382)
	at org.joda.time.TestPeriod_Constructors.testConstructor_long_fixedZone(TestPeriod_Constructors.java:184)

testConstructor_long_PeriodType1(org.joda.time.TestPeriod_Constructors)  Time elapsed: 0 sec  <<< ERROR!
java.lang.NullPointerException
	at org.joda.time.chrono.BaseChronology.get(BaseChronology.java:284)
	at org.joda.time.base.BasePeriod.<init>(BasePeriod.java:258)
	at org.joda.time.Period.<init>(Period.java:402)
	at org.joda.time.TestPeriod_Constructors.testConstructor_long_PeriodType1(TestPeriod_Constructors.java:206)

testConstructor_long_long_Chronology1(org.joda.time.TestPeriod_Constructors)  Time elapsed: 0.001 sec  <<< ERROR!
java.lang.NullPointerException
	at org.joda.time.chrono.BaseChronology.get(BaseChronology.java:260)
	at org.joda.time.base.BasePeriod.<init>(BasePeriod.java:110)
	at org.joda.time.Period.<init>(Period.java:478)
	at org.joda.time.TestPeriod_Constructors.testConstructor_long_long_Chronology1(TestPeriod_Constructors.java:558)

testConstructor_long_long1(org.joda.time.TestPeriod_Constructors)  Time elapsed: 0.008 sec  <<< ERROR!
java.lang.NullPointerException
	at org.joda.time.chrono.BaseChronology.get(BaseChronology.java:260)
	at org.joda.time.base.BasePeriod.<init>(BasePeriod.java:110)
	at org.joda.time.Period.<init>(Period.java:455)
	at org.joda.time.TestPeriod_Constructors.testConstructor_long_long1(TestPeriod_Constructors.java:465)

testConstructor_RI_RI1(org.joda.time.TestPeriod_Constructors)  Time elapsed: 0 sec  <<< ERROR!
java.lang.NullPointerException
	at org.joda.time.chrono.BaseChronology.get(BaseChronology.java:260)
	at org.joda.time.base.BasePeriod.<init>(BasePeriod.java:132)
	at org.joda.time.Period.<init>(Period.java:519)
	at org.joda.time.TestPeriod_Constructors.testConstructor_RI_RI1(TestPeriod_Constructors.java:620)

testConstructor_RI_RI2(org.joda.time.TestPeriod_Constructors)  Time elapsed: 0 sec  <<< ERROR!
java.lang.NullPointerException
	at org.joda.time.chrono.BaseChronology.get(BaseChronology.java:260)
	at org.joda.time.base.BasePeriod.<init>(BasePeriod.java:132)
	at org.joda.time.Period.<init>(Period.java:519)
	at org.joda.time.TestPeriod_Constructors.testConstructor_RI_RI2(TestPeriod_Constructors.java:635)

testConstructor_RI_RI3(org.joda.time.TestPeriod_Constructors)  Time elapsed: 0.001 sec  <<< ERROR!
java.lang.NullPointerException
	at org.joda.time.chrono.BaseChronology.get(BaseChronology.java:260)
	at org.joda.time.base.BasePeriod.<init>(BasePeriod.java:132)
	at org.joda.time.Period.<init>(Period.java:519)
	at org.joda.time.TestPeriod_Constructors.testConstructor_RI_RI3(TestPeriod_Constructors.java:650)

testConstructor_RI_RI4(org.joda.time.TestPeriod_Constructors)  Time elapsed: 0 sec  <<< ERROR!
java.lang.NullPointerException
	at org.joda.time.chrono.BaseChronology.get(BaseChronology.java:260)
	at org.joda.time.base.BasePeriod.<init>(BasePeriod.java:132)
	at org.joda.time.Period.<init>(Period.java:519)
	at org.joda.time.TestPeriod_Constructors.testConstructor_RI_RI4(TestPeriod_Constructors.java:665)

testConstructor_long_long2(org.joda.time.TestPeriod_Constructors)  Time elapsed: 0 sec  <<< ERROR!
java.lang.NullPointerException
	at org.joda.time.chrono.BaseChronology.get(BaseChronology.java:260)
	at org.joda.time.base.BasePeriod.<init>(BasePeriod.java:110)
	at org.joda.time.Period.<init>(Period.java:455)
	at org.joda.time.TestPeriod_Constructors.testConstructor_long_long2(TestPeriod_Constructors.java:480)

testConstructor_RI_RD1(org.joda.time.TestPeriod_Constructors)  Time elapsed: 0.001 sec  <<< ERROR!
java.lang.NullPointerException
	at org.joda.time.chrono.BaseChronology.get(BaseChronology.java:260)
	at org.joda.time.base.BasePeriod.<init>(BasePeriod.java:201)
	at org.joda.time.Period.<init>(Period.java:626)
	at org.joda.time.TestPeriod_Constructors.testConstructor_RI_RD1(TestPeriod_Constructors.java:1017)

testConstructor_RD_RI1(org.joda.time.TestPeriod_Constructors)  Time elapsed: 0 sec  <<< ERROR!
java.lang.NullPointerException
	at org.joda.time.chrono.BaseChronology.get(BaseChronology.java:260)
	at org.joda.time.base.BasePeriod.<init>(BasePeriod.java:219)
	at org.joda.time.Period.<init>(Period.java:647)
	at org.joda.time.TestPeriod_Constructors.testConstructor_RD_RI1(TestPeriod_Constructors.java:1081)

testConstructor_RI_RI6(org.joda.time.TestPeriod_Constructors)  Time elapsed: 0.001 sec  <<< ERROR!
java.lang.NullPointerException
	at org.joda.time.chrono.BaseChronology.get(BaseChronology.java:260)
	at org.joda.time.base.BasePeriod.<init>(BasePeriod.java:132)
	at org.joda.time.Period.<init>(Period.java:519)
	at org.joda.time.TestPeriod_Constructors.testConstructor_RI_RI6(TestPeriod_Constructors.java:696)

testConstructor_RI_RI7(org.joda.time.TestPeriod_Constructors)  Time elapsed: 0 sec  <<< ERROR!
java.lang.NullPointerException
	at org.joda.time.chrono.BaseChronology.get(BaseChronology.java:260)
	at org.joda.time.base.BasePeriod.<init>(BasePeriod.java:132)
	at org.joda.time.Period.<init>(Period.java:519)
	at org.joda.time.TestPeriod_Constructors.testConstructor_RI_RI7(TestPeriod_Constructors.java:712)

testConstructor_long_long_PeriodType_Chronology2(org.joda.time.TestPeriod_Constructors)  Time elapsed: 0.001 sec  <<< ERROR!
java.lang.NullPointerException
	at org.joda.time.chrono.BaseChronology.get(BaseChronology.java:260)
	at org.joda.time.base.BasePeriod.<init>(BasePeriod.java:110)
	at org.joda.time.Period.<init>(Period.java:490)
	at org.joda.time.TestPeriod_Constructors.testConstructor_long_long_PeriodType_Chronology2(TestPeriod_Constructors.java:604)

testConstructor_RI_RI_PeriodType1(org.joda.time.TestPeriod_Constructors)  Time elapsed: 0 sec  <<< ERROR!
java.lang.NullPointerException
	at org.joda.time.chrono.BaseChronology.get(BaseChronology.java:260)
	at org.joda.time.base.BasePeriod.<init>(BasePeriod.java:132)
	at org.joda.time.Period.<init>(Period.java:548)
	at org.joda.time.TestPeriod_Constructors.testConstructor_RI_RI_PeriodType1(TestPeriod_Constructors.java:728)

testConstructor_RI_RI_PeriodType2(org.joda.time.TestPeriod_Constructors)  Time elapsed: 0.001 sec  <<< ERROR!
java.lang.NullPointerException
	at org.joda.time.chrono.BaseChronology.get(BaseChronology.java:260)
	at org.joda.time.base.BasePeriod.<init>(BasePeriod.java:132)
	at org.joda.time.Period.<init>(Period.java:548)
	at org.joda.time.TestPeriod_Constructors.testConstructor_RI_RI_PeriodType2(TestPeriod_Constructors.java:743)

testConstructor_RI_RI_PeriodType3(org.joda.time.TestPeriod_Constructors)  Time elapsed: 0 sec  <<< ERROR!
java.lang.NullPointerException
	at org.joda.time.chrono.BaseChronology.get(BaseChronology.java:260)
	at org.joda.time.base.BasePeriod.<init>(BasePeriod.java:132)
	at org.joda.time.Period.<init>(Period.java:548)
	at org.joda.time.TestPeriod_Constructors.testConstructor_RI_RI_PeriodType3(TestPeriod_Constructors.java:758)

testConstructor_RI_RI_PeriodType4(org.joda.time.TestPeriod_Constructors)  Time elapsed: 0.001 sec  <<< ERROR!
java.lang.NullPointerException
	at org.joda.time.chrono.BaseChronology.get(BaseChronology.java:260)
	at org.joda.time.base.BasePeriod.<init>(BasePeriod.java:132)
	at org.joda.time.Period.<init>(Period.java:548)
	at org.joda.time.TestPeriod_Constructors.testConstructor_RI_RI_PeriodType4(TestPeriod_Constructors.java:773)

testConstructor_RP_RP1(org.joda.time.TestPeriod_Constructors)  Time elapsed: 0 sec  <<< ERROR!
java.lang.NullPointerException
	at org.joda.time.chrono.BaseChronology.get(BaseChronology.java:260)
	at org.joda.time.base.BasePeriod.<init>(BasePeriod.java:182)
	at org.joda.time.Period.<init>(Period.java:582)
	at org.joda.time.TestPeriod_Constructors.testConstructor_RP_RP1(TestPeriod_Constructors.java:805)

testConstructor_RP_RP2(org.joda.time.TestPeriod_Constructors)  Time elapsed: 0.001 sec  <<< ERROR!
java.lang.NullPointerException
	at org.joda.time.chrono.BaseChronology.get(BaseChronology.java:260)
	at org.joda.time.base.BasePeriod.<init>(BasePeriod.java:182)
	at org.joda.time.Period.<init>(Period.java:582)
	at org.joda.time.TestPeriod_Constructors.testConstructor_RP_RP2(TestPeriod_Constructors.java:821)

testConstructor_RP_RP2Local(org.joda.time.TestPeriod_Constructors)  Time elapsed: 0 sec  <<< ERROR!
java.lang.NullPointerException
	at org.joda.time.chrono.BaseChronology.get(BaseChronology.java:260)
	at org.joda.time.base.BasePeriod.<init>(BasePeriod.java:167)
	at org.joda.time.Period.<init>(Period.java:582)
	at org.joda.time.TestPeriod_Constructors.testConstructor_RP_RP2Local(TestPeriod_Constructors.java:836)

testConstructor_RP_RP_PeriodType1(org.joda.time.TestPeriod_Constructors)  Time elapsed: 0.001 sec  <<< ERROR!
java.lang.NullPointerException
	at org.joda.time.chrono.BaseChronology.get(BaseChronology.java:260)
	at org.joda.time.base.BasePeriod.<init>(BasePeriod.java:182)
	at org.joda.time.Period.<init>(Period.java:616)
	at org.joda.time.TestPeriod_Constructors.testConstructor_RP_RP_PeriodType1(TestPeriod_Constructors.java:911)

testConstructor_long_PeriodType_Chronology2(org.joda.time.TestPeriod_Constructors)  Time elapsed: 0.001 sec  <<< ERROR!
java.lang.NullPointerException
	at org.joda.time.chrono.BaseChronology.get(BaseChronology.java:284)
	at org.joda.time.base.BasePeriod.<init>(BasePeriod.java:258)
	at org.joda.time.Period.<init>(Period.java:444)
	at org.joda.time.TestPeriod_Constructors.testConstructor_long_PeriodType_Chronology2(TestPeriod_Constructors.java:344)

testConstructor_long_PeriodType_Chronology3(org.joda.time.TestPeriod_Constructors)  Time elapsed: 0 sec  <<< ERROR!
java.lang.NullPointerException
	at org.joda.time.chrono.BaseChronology.get(BaseChronology.java:284)
	at org.joda.time.base.BasePeriod.<init>(BasePeriod.java:258)
	at org.joda.time.Period.<init>(Period.java:444)
	at org.joda.time.TestPeriod_Constructors.testConstructor_long_PeriodType_Chronology3(TestPeriod_Constructors.java:361)

testConstructor_long_PeriodType_Chronology4(org.joda.time.TestPeriod_Constructors)  Time elapsed: 0.001 sec  <<< ERROR!
java.lang.NullPointerException
	at org.joda.time.chrono.BaseChronology.get(BaseChronology.java:284)
	at org.joda.time.base.BasePeriod.<init>(BasePeriod.java:258)
	at org.joda.time.Period.<init>(Period.java:444)
	at org.joda.time.TestPeriod_Constructors.testConstructor_long_PeriodType_Chronology4(TestPeriod_Constructors.java:378)

testConstructor_long_long_PeriodType1(org.joda.time.TestPeriod_Constructors)  Time elapsed: 0.001 sec  <<< ERROR!
java.lang.NullPointerException
	at org.joda.time.chrono.BaseChronology.get(BaseChronology.java:260)
	at org.joda.time.base.BasePeriod.<init>(BasePeriod.java:110)
	at org.joda.time.Period.<init>(Period.java:466)
	at org.joda.time.TestPeriod_Constructors.testConstructor_long_long_PeriodType1(TestPeriod_Constructors.java:496)

testConstructor_long_long_PeriodType2(org.joda.time.TestPeriod_Constructors)  Time elapsed: 0.001 sec  <<< ERROR!
java.lang.NullPointerException
	at org.joda.time.chrono.BaseChronology.get(BaseChronology.java:260)
	at org.joda.time.base.BasePeriod.<init>(BasePeriod.java:110)
	at org.joda.time.Period.<init>(Period.java:466)
	at org.joda.time.TestPeriod_Constructors.testConstructor_long_long_PeriodType2(TestPeriod_Constructors.java:511)

testConstructor_long_long_PeriodType3(org.joda.time.TestPeriod_Constructors)  Time elapsed: 0 sec  <<< ERROR!
java.lang.NullPointerException
	at org.joda.time.chrono.BaseChronology.get(BaseChronology.java:260)
	at org.joda.time.base.BasePeriod.<init>(BasePeriod.java:110)
	at org.joda.time.Period.<init>(Period.java:466)
	at org.joda.time.TestPeriod_Constructors.testConstructor_long_long_PeriodType3(TestPeriod_Constructors.java:526)

testToPeriod_PeriodType3(org.joda.time.TestPeriod_Constructors)  Time elapsed: 0.001 sec  <<< ERROR!
java.lang.NullPointerException
	at org.joda.time.chrono.BaseChronology.get(BaseChronology.java:260)
	at org.joda.time.base.BasePeriod.<init>(BasePeriod.java:110)
	at org.joda.time.Period.<init>(Period.java:466)
	at org.joda.time.TestPeriod_Constructors.testToPeriod_PeriodType3(TestPeriod_Constructors.java:541)

testConstructor_long_long_PeriodType_Chronology1(org.joda.time.TestPeriod_Constructors)  Time elapsed: 0.001 sec  <<< ERROR!
java.lang.NullPointerException
	at org.joda.time.chrono.BaseChronology.get(BaseChronology.java:260)
	at org.joda.time.base.BasePeriod.<init>(BasePeriod.java:110)
	at org.joda.time.Period.<init>(Period.java:490)
	at org.joda.time.TestPeriod_Constructors.testConstructor_long_long_PeriodType_Chronology1(TestPeriod_Constructors.java:589)

testConstructor_long_PeriodType3(org.joda.time.TestPeriod_Constructors)  Time elapsed: 0 sec  <<< ERROR!
java.lang.NullPointerException
	at org.joda.time.chrono.BaseChronology.get(BaseChronology.java:284)
	at org.joda.time.base.BasePeriod.<init>(BasePeriod.java:258)
	at org.joda.time.Period.<init>(Period.java:402)
	at org.joda.time.TestPeriod_Constructors.testConstructor_long_PeriodType3(TestPeriod_Constructors.java:240)

testConstructor_long_PeriodType4(org.joda.time.TestPeriod_Constructors)  Time elapsed: 0.001 sec  <<< ERROR!
java.lang.NullPointerException
	at org.joda.time.chrono.BaseChronology.get(BaseChronology.java:284)
	at org.joda.time.base.BasePeriod.<init>(BasePeriod.java:258)
	at org.joda.time.Period.<init>(Period.java:402)
	at org.joda.time.TestPeriod_Constructors.testConstructor_long_PeriodType4(TestPeriod_Constructors.java:257)

testConstructor_long_Chronology1(org.joda.time.TestPeriod_Constructors)  Time elapsed: 0 sec  <<< ERROR!
java.lang.NullPointerException
	at org.joda.time.chrono.BaseChronology.get(BaseChronology.java:284)
	at org.joda.time.base.BasePeriod.<init>(BasePeriod.java:258)
	at org.joda.time.Period.<init>(Period.java:423)
	at org.joda.time.TestPeriod_Constructors.testConstructor_long_Chronology1(TestPeriod_Constructors.java:275)

testConstructor_long_Chronology2(org.joda.time.TestPeriod_Constructors)  Time elapsed: 0 sec  <<< ERROR!
java.lang.NullPointerException
	at org.joda.time.chrono.BaseChronology.get(BaseChronology.java:284)
	at org.joda.time.base.BasePeriod.<init>(BasePeriod.java:258)
	at org.joda.time.Period.<init>(Period.java:423)
	at org.joda.time.TestPeriod_Constructors.testConstructor_long_Chronology2(TestPeriod_Constructors.java:292)

testConstructor_long_Chronology3(org.joda.time.TestPeriod_Constructors)  Time elapsed: 0.001 sec  <<< ERROR!
java.lang.NullPointerException
	at org.joda.time.chrono.BaseChronology.get(BaseChronology.java:284)
	at org.joda.time.base.BasePeriod.<init>(BasePeriod.java:258)
	at org.joda.time.Period.<init>(Period.java:423)
	at org.joda.time.TestPeriod_Constructors.testConstructor_long_Chronology3(TestPeriod_Constructors.java:309)

testConstructor_long_PeriodType_Chronology1(org.joda.time.TestPeriod_Constructors)  Time elapsed: 0 sec  <<< ERROR!
java.lang.NullPointerException
	at org.joda.time.chrono.BaseChronology.get(BaseChronology.java:284)
	at org.joda.time.base.BasePeriod.<init>(BasePeriod.java:258)
	at org.joda.time.Period.<init>(Period.java:444)
	at org.joda.time.TestPeriod_Constructors.testConstructor_long_PeriodType_Chronology1(TestPeriod_Constructors.java:327)

testConstructor_long_long_Chronology2(org.joda.time.TestPeriod_Constructors)  Time elapsed: 0.001 sec  <<< ERROR!
java.lang.NullPointerException
	at org.joda.time.chrono.BaseChronology.get(BaseChronology.java:260)
	at org.joda.time.base.BasePeriod.<init>(BasePeriod.java:110)
	at org.joda.time.Period.<init>(Period.java:478)
	at org.joda.time.TestPeriod_Constructors.testConstructor_long_long_Chronology2(TestPeriod_Constructors.java:573)

testConstructor_RI_RD_PeriodType1(org.joda.time.TestPeriod_Constructors)  Time elapsed: 0.001 sec  <<< ERROR!
java.lang.NullPointerException
	at org.joda.time.chrono.BaseChronology.get(BaseChronology.java:260)
	at org.joda.time.base.BasePeriod.<init>(BasePeriod.java:201)
	at org.joda.time.Period.<init>(Period.java:637)
	at org.joda.time.TestPeriod_Constructors.testConstructor_RI_RD_PeriodType1(TestPeriod_Constructors.java:1049)

testConstructor_RD_RI_PeriodType1(org.joda.time.TestPeriod_Constructors)  Time elapsed: 0 sec  <<< ERROR!
java.lang.NullPointerException
	at org.joda.time.chrono.BaseChronology.get(BaseChronology.java:260)
	at org.joda.time.base.BasePeriod.<init>(BasePeriod.java:219)
	at org.joda.time.Period.<init>(Period.java:658)
	at org.joda.time.TestPeriod_Constructors.testConstructor_RD_RI_PeriodType1(TestPeriod_Constructors.java:1113)

testConstructor_trickyDifferences_RI_RI_toFeb_standardYear(org.joda.time.TestPeriod_Constructors)  Time elapsed: 0.001 sec  <<< ERROR!
java.lang.NullPointerException
	at org.joda.time.chrono.BaseChronology.get(BaseChronology.java:260)
	at org.joda.time.base.BasePeriod.<init>(BasePeriod.java:132)
	at org.joda.time.Period.<init>(Period.java:519)
	at org.joda.time.TestPeriod_Constructors.testConstructor_trickyDifferences_RI_RI_toFeb_standardYear(TestPeriod_Constructors.java:1362)

testConstructor_trickyDifferences_RI_RI_toFeb_leapYear(org.joda.time.TestPeriod_Constructors)  Time elapsed: 0 sec  <<< ERROR!
java.lang.NullPointerException
	at org.joda.time.chrono.BaseChronology.get(BaseChronology.java:260)
	at org.joda.time.base.BasePeriod.<init>(BasePeriod.java:132)
	at org.joda.time.Period.<init>(Period.java:519)
	at org.joda.time.TestPeriod_Constructors.testConstructor_trickyDifferences_RI_RI_toFeb_leapYear(TestPeriod_Constructors.java:1370)

testConstructor_trickyDifferences_RI_RI_toFeb_exactMonths(org.joda.time.TestPeriod_Constructors)  Time elapsed: 0.001 sec  <<< ERROR!
java.lang.NullPointerException
	at org.joda.time.chrono.BaseChronology.get(BaseChronology.java:260)
	at org.joda.time.base.BasePeriod.<init>(BasePeriod.java:132)
	at org.joda.time.Period.<init>(Period.java:519)
	at org.joda.time.TestPeriod_Constructors.testConstructor_trickyDifferences_RI_RI_toFeb_exactMonths(TestPeriod_Constructors.java:1378)

testConstructor_trickyDifferences_RI_RI_toFeb_endOfMonth1(org.joda.time.TestPeriod_Constructors)  Time elapsed: 0 sec  <<< ERROR!
java.lang.NullPointerException
	at org.joda.time.chrono.BaseChronology.get(BaseChronology.java:260)
	at org.joda.time.base.BasePeriod.<init>(BasePeriod.java:132)
	at org.joda.time.Period.<init>(Period.java:519)
	at org.joda.time.TestPeriod_Constructors.testConstructor_trickyDifferences_RI_RI_toFeb_endOfMonth1(TestPeriod_Constructors.java:1386)

testConstructor_trickyDifferences_RI_RI_toFeb_endOfMonth2(org.joda.time.TestPeriod_Constructors)  Time elapsed: 0.001 sec  <<< ERROR!
java.lang.NullPointerException
	at org.joda.time.chrono.BaseChronology.get(BaseChronology.java:260)
	at org.joda.time.base.BasePeriod.<init>(BasePeriod.java:132)
	at org.joda.time.Period.<init>(Period.java:519)
	at org.joda.time.TestPeriod_Constructors.testConstructor_trickyDifferences_RI_RI_toFeb_endOfMonth2(TestPeriod_Constructors.java:1394)

testConstructor_trickyDifferences_RI_RI_toFeb_endOfMonth3(org.joda.time.TestPeriod_Constructors)  Time elapsed: 0 sec  <<< ERROR!
java.lang.NullPointerException
	at org.joda.time.chrono.BaseChronology.get(BaseChronology.java:260)
	at org.joda.time.base.BasePeriod.<init>(BasePeriod.java:132)
	at org.joda.time.Period.<init>(Period.java:519)
	at org.joda.time.TestPeriod_Constructors.testConstructor_trickyDifferences_RI_RI_toFeb_endOfMonth3(TestPeriod_Constructors.java:1402)

testConstructor_trickyDifferences_RI_RI_toMar_endOfMonth1(org.joda.time.TestPeriod_Constructors)  Time elapsed: 0.001 sec  <<< ERROR!
java.lang.NullPointerException
	at org.joda.time.chrono.BaseChronology.get(BaseChronology.java:260)
	at org.joda.time.base.BasePeriod.<init>(BasePeriod.java:132)
	at org.joda.time.Period.<init>(Period.java:519)
	at org.joda.time.TestPeriod_Constructors.testConstructor_trickyDifferences_RI_RI_toMar_endOfMonth1(TestPeriod_Constructors.java:1410)

testConstructor_trickyDifferences_RI_RI_toMar_endOfMonth2(org.joda.time.TestPeriod_Constructors)  Time elapsed: 0 sec  <<< ERROR!
java.lang.NullPointerException
	at org.joda.time.chrono.BaseChronology.get(BaseChronology.java:260)
	at org.joda.time.base.BasePeriod.<init>(BasePeriod.java:132)
	at org.joda.time.Period.<init>(Period.java:519)
	at org.joda.time.TestPeriod_Constructors.testConstructor_trickyDifferences_RI_RI_toMar_endOfMonth2(TestPeriod_Constructors.java:1418)

testConstructor_trickyDifferences_LD_LD_toFeb_standardYear(org.joda.time.TestPeriod_Constructors)  Time elapsed: 0 sec  <<< ERROR!
java.lang.NullPointerException
	at org.joda.time.chrono.BaseChronology.get(BaseChronology.java:260)
	at org.joda.time.base.BasePeriod.<init>(BasePeriod.java:167)
	at org.joda.time.Period.<init>(Period.java:582)
	at org.joda.time.TestPeriod_Constructors.testConstructor_trickyDifferences_LD_LD_toFeb_standardYear(TestPeriod_Constructors.java:1427)

testConstructor_trickyDifferences_LD_LD_toFeb_leapYear(org.joda.time.TestPeriod_Constructors)  Time elapsed: 0 sec  <<< ERROR!
java.lang.NullPointerException
	at org.joda.time.chrono.BaseChronology.get(BaseChronology.java:260)
	at org.joda.time.base.BasePeriod.<init>(BasePeriod.java:167)
	at org.joda.time.Period.<init>(Period.java:582)
	at org.joda.time.TestPeriod_Constructors.testConstructor_trickyDifferences_LD_LD_toFeb_leapYear(TestPeriod_Constructors.java:1435)

testConstructor_trickyDifferences_LD_LD_toFeb_exactMonths(org.joda.time.TestPeriod_Constructors)  Time elapsed: 0.001 sec  <<< ERROR!
java.lang.NullPointerException
	at org.joda.time.chrono.BaseChronology.get(BaseChronology.java:260)
	at org.joda.time.base.BasePeriod.<init>(BasePeriod.java:167)
	at org.joda.time.Period.<init>(Period.java:582)
	at org.joda.time.TestPeriod_Constructors.testConstructor_trickyDifferences_LD_LD_toFeb_exactMonths(TestPeriod_Constructors.java:1443)

testConstructor_trickyDifferences_LD_LD_toFeb_endOfMonth1(org.joda.time.TestPeriod_Constructors)  Time elapsed: 0 sec  <<< ERROR!
java.lang.NullPointerException
	at org.joda.time.chrono.BaseChronology.get(BaseChronology.java:260)
	at org.joda.time.base.BasePeriod.<init>(BasePeriod.java:167)
	at org.joda.time.Period.<init>(Period.java:582)
	at org.joda.time.TestPeriod_Constructors.testConstructor_trickyDifferences_LD_LD_toFeb_endOfMonth1(TestPeriod_Constructors.java:1451)

testConstructor_trickyDifferences_LD_LD_toFeb_endOfMonth2(org.joda.time.TestPeriod_Constructors)  Time elapsed: 0 sec  <<< ERROR!
java.lang.NullPointerException
	at org.joda.time.chrono.BaseChronology.get(BaseChronology.java:260)
	at org.joda.time.base.BasePeriod.<init>(BasePeriod.java:167)
	at org.joda.time.Period.<init>(Period.java:582)
	at org.joda.time.TestPeriod_Constructors.testConstructor_trickyDifferences_LD_LD_toFeb_endOfMonth2(TestPeriod_Constructors.java:1459)

testConstructor_trickyDifferences_LD_LD_toFeb_endOfMonth3(org.joda.time.TestPeriod_Constructors)  Time elapsed: 0.001 sec  <<< ERROR!
java.lang.NullPointerException
	at org.joda.time.chrono.BaseChronology.get(BaseChronology.java:260)
	at org.joda.time.base.BasePeriod.<init>(BasePeriod.java:167)
	at org.joda.time.Period.<init>(Period.java:582)
	at org.joda.time.TestPeriod_Constructors.testConstructor_trickyDifferences_LD_LD_toFeb_endOfMonth3(TestPeriod_Constructors.java:1467)

testConstructor_trickyDifferences_LD_LD_toMar_endOfMonth1(org.joda.time.TestPeriod_Constructors)  Time elapsed: 0 sec  <<< ERROR!
java.lang.NullPointerException
	at org.joda.time.chrono.BaseChronology.get(BaseChronology.java:260)
	at org.joda.time.base.BasePeriod.<init>(BasePeriod.java:167)
	at org.joda.time.Period.<init>(Period.java:582)
	at org.joda.time.TestPeriod_Constructors.testConstructor_trickyDifferences_LD_LD_toMar_endOfMonth1(TestPeriod_Constructors.java:1475)

testConstructor_trickyDifferences_LD_LD_toMar_endOfMonth2(org.joda.time.TestPeriod_Constructors)  Time elapsed: 0.001 sec  <<< ERROR!
java.lang.NullPointerException
	at org.joda.time.chrono.BaseChronology.get(BaseChronology.java:260)
	at org.joda.time.base.BasePeriod.<init>(BasePeriod.java:167)
	at org.joda.time.Period.<init>(Period.java:582)
	at org.joda.time.TestPeriod_Constructors.testConstructor_trickyDifferences_LD_LD_toMar_endOfMonth2(TestPeriod_Constructors.java:1483)

testEqualsHashCode(org.joda.time.TestPeriod_Basics)  Time elapsed: 0.001 sec  <<< ERROR!
java.lang.NullPointerException
	at org.joda.time.chrono.BaseChronology.get(BaseChronology.java:284)
	at org.joda.time.base.BasePeriod.<init>(BasePeriod.java:236)
	at org.joda.time.Period.<init>(Period.java:382)
	at org.joda.time.TestPeriod_Basics.testEqualsHashCode(TestPeriod_Basics.java:196)

testToString(org.joda.time.TestPeriod_Basics)  Time elapsed: 0 sec  <<< ERROR!
java.lang.NullPointerException
	at org.joda.time.chrono.BaseChronology.get(BaseChronology.java:284)
	at org.joda.time.base.BasePeriod.<init>(BasePeriod.java:236)
	at org.joda.time.Period.<init>(Period.java:382)
	at org.joda.time.TestPeriod_Basics.testToString(TestPeriod_Basics.java:477)

testSerialization(org.joda.time.TestPeriod_Basics)  Time elapsed: 0.001 sec  <<< ERROR!
java.lang.NullPointerException
	at org.joda.time.chrono.BaseChronology.get(BaseChronology.java:284)
	at org.joda.time.base.BasePeriod.<init>(BasePeriod.java:236)
	at org.joda.time.Period.<init>(Period.java:382)
	at org.joda.time.TestPeriod_Basics.testSerialization(TestPeriod_Basics.java:228)

testToPeriod(org.joda.time.TestPeriod_Basics)  Time elapsed: 0.001 sec  <<< ERROR!
java.lang.NullPointerException
	at org.joda.time.chrono.BaseChronology.get(BaseChronology.java:284)
	at org.joda.time.base.BasePeriod.<init>(BasePeriod.java:236)
	at org.joda.time.Period.<init>(Period.java:382)
	at org.joda.time.TestPeriod_Basics.testToPeriod(TestPeriod_Basics.java:497)

testToMutablePeriod(org.joda.time.TestPeriod_Basics)  Time elapsed: 0.001 sec  <<< ERROR!
java.lang.NullPointerException
	at org.joda.time.chrono.BaseChronology.get(BaseChronology.java:284)
	at org.joda.time.base.BasePeriod.<init>(BasePeriod.java:236)
	at org.joda.time.Period.<init>(Period.java:382)
	at org.joda.time.TestPeriod_Basics.testToMutablePeriod(TestPeriod_Basics.java:503)

testToDurationFrom(org.joda.time.TestPeriod_Basics)  Time elapsed: 0 sec  <<< ERROR!
java.lang.NullPointerException
	at org.joda.time.chrono.BaseChronology.get(BaseChronology.java:284)
	at org.joda.time.base.BasePeriod.<init>(BasePeriod.java:236)
	at org.joda.time.Period.<init>(Period.java:382)
	at org.joda.time.TestPeriod_Basics.testToDurationFrom(TestPeriod_Basics.java:515)

testNormalizedStandard_weekDay1(org.joda.time.TestPeriod_Basics)  Time elapsed: 0 sec  <<< ERROR!
java.lang.NullPointerException
	at org.joda.time.chrono.BaseChronology.get(BaseChronology.java:284)
	at org.joda.time.base.BasePeriod.<init>(BasePeriod.java:258)
	at org.joda.time.Period.<init>(Period.java:444)
	at org.joda.time.Period.normalizedStandard(Period.java:1644)
	at org.joda.time.Period.normalizedStandard(Period.java:1601)
	at org.joda.time.TestPeriod_Basics.testNormalizedStandard_weekDay1(TestPeriod_Basics.java:1419)

testNormalizedStandard_yearMonthWeekDay(org.joda.time.TestPeriod_Basics)  Time elapsed: 0 sec  <<< ERROR!
java.lang.NullPointerException
	at org.joda.time.chrono.BaseChronology.get(BaseChronology.java:284)
	at org.joda.time.base.BasePeriod.<init>(BasePeriod.java:258)
	at org.joda.time.Period.<init>(Period.java:444)
	at org.joda.time.Period.normalizedStandard(Period.java:1644)
	at org.joda.time.Period.normalizedStandard(Period.java:1601)
	at org.joda.time.TestPeriod_Basics.testNormalizedStandard_yearMonthWeekDay(TestPeriod_Basics.java:1434)

testNormalizedStandard_yearMonthDay(org.joda.time.TestPeriod_Basics)  Time elapsed: 0.001 sec  <<< ERROR!
java.lang.NullPointerException
	at org.joda.time.chrono.BaseChronology.get(BaseChronology.java:284)
	at org.joda.time.base.BasePeriod.<init>(BasePeriod.java:258)
	at org.joda.time.Period.<init>(Period.java:444)
	at org.joda.time.Period.normalizedStandard(Period.java:1644)
	at org.joda.time.Period.normalizedStandard(Period.java:1601)
	at org.joda.time.TestPeriod_Basics.testNormalizedStandard_yearMonthDay(TestPeriod_Basics.java:1441)

testNormalizedStandard_negative(org.joda.time.TestPeriod_Basics)  Time elapsed: 0 sec  <<< ERROR!
java.lang.NullPointerException
	at org.joda.time.chrono.BaseChronology.get(BaseChronology.java:284)
	at org.joda.time.base.BasePeriod.<init>(BasePeriod.java:258)
	at org.joda.time.Period.<init>(Period.java:444)
	at org.joda.time.Period.normalizedStandard(Period.java:1644)
	at org.joda.time.Period.normalizedStandard(Period.java:1601)
	at org.joda.time.TestPeriod_Basics.testNormalizedStandard_negative(TestPeriod_Basics.java:1448)

testNormalizedStandard_fullNegative(org.joda.time.TestPeriod_Basics)  Time elapsed: 0 sec  <<< ERROR!
java.lang.NullPointerException
	at org.joda.time.chrono.BaseChronology.get(BaseChronology.java:284)
	at org.joda.time.base.BasePeriod.<init>(BasePeriod.java:258)
	at org.joda.time.Period.<init>(Period.java:444)
	at org.joda.time.Period.normalizedStandard(Period.java:1644)
	at org.joda.time.Period.normalizedStandard(Period.java:1601)
	at org.joda.time.TestPeriod_Basics.testNormalizedStandard_fullNegative(TestPeriod_Basics.java:1455)

testNormalizedStandard_periodType_yearMonth3(org.joda.time.TestPeriod_Basics)  Time elapsed: 0 sec  <<< ERROR!
java.lang.NullPointerException
	at org.joda.time.chrono.BaseChronology.get(BaseChronology.java:284)
	at org.joda.time.base.BasePeriod.<init>(BasePeriod.java:258)
	at org.joda.time.Period.<init>(Period.java:444)
	at org.joda.time.Period.normalizedStandard(Period.java:1644)
	at org.joda.time.TestPeriod_Basics.testNormalizedStandard_periodType_yearMonth3(TestPeriod_Basics.java:1479)

testNormalizedStandard_periodType_weekDay1(org.joda.time.TestPeriod_Basics)  Time elapsed: 0.001 sec  <<< ERROR!
java.lang.NullPointerException
	at org.joda.time.chrono.BaseChronology.get(BaseChronology.java:284)
	at org.joda.time.base.BasePeriod.<init>(BasePeriod.java:258)
	at org.joda.time.Period.<init>(Period.java:444)
	at org.joda.time.Period.normalizedStandard(Period.java:1644)
	at org.joda.time.TestPeriod_Basics.testNormalizedStandard_periodType_weekDay1(TestPeriod_Basics.java:1486)

testNormalizedStandard_periodType_weekDay3(org.joda.time.TestPeriod_Basics)  Time elapsed: 0 sec  <<< ERROR!
java.lang.NullPointerException
	at org.joda.time.chrono.BaseChronology.get(BaseChronology.java:284)
	at org.joda.time.base.BasePeriod.<init>(BasePeriod.java:258)
	at org.joda.time.Period.<init>(Period.java:444)
	at org.joda.time.Period.normalizedStandard(Period.java:1644)
	at org.joda.time.TestPeriod_Basics.testNormalizedStandard_periodType_weekDay3(TestPeriod_Basics.java:1501)

testNormalizedStandard_periodType_yearMonthWeekDay(org.joda.time.TestPeriod_Basics)  Time elapsed: 0.001 sec  <<< ERROR!
java.lang.NullPointerException
	at org.joda.time.chrono.BaseChronology.get(BaseChronology.java:284)
	at org.joda.time.base.BasePeriod.<init>(BasePeriod.java:258)
	at org.joda.time.Period.<init>(Period.java:444)
	at org.joda.time.Period.normalizedStandard(Period.java:1644)
	at org.joda.time.TestPeriod_Basics.testNormalizedStandard_periodType_yearMonthWeekDay(TestPeriod_Basics.java:1508)

testNormalizedStandard_periodType_yearMonthDay(org.joda.time.TestPeriod_Basics)  Time elapsed: 0 sec  <<< ERROR!
java.lang.NullPointerException
	at org.joda.time.chrono.BaseChronology.get(BaseChronology.java:284)
	at org.joda.time.base.BasePeriod.<init>(BasePeriod.java:258)
	at org.joda.time.Period.<init>(Period.java:444)
	at org.joda.time.Period.normalizedStandard(Period.java:1644)
	at org.joda.time.TestPeriod_Basics.testNormalizedStandard_periodType_yearMonthDay(TestPeriod_Basics.java:1515)

testToDurationTo(org.joda.time.TestPeriod_Basics)  Time elapsed: 0 sec  <<< ERROR!
java.lang.NullPointerException
	at org.joda.time.chrono.BaseChronology.get(BaseChronology.java:284)
	at org.joda.time.base.BasePeriod.<init>(BasePeriod.java:236)
	at org.joda.time.Period.<init>(Period.java:382)
	at org.joda.time.TestPeriod_Basics.testToDurationTo(TestPeriod_Basics.java:520)

testWithPeriodType1(org.joda.time.TestPeriod_Basics)  Time elapsed: 0.001 sec  <<< ERROR!
java.lang.NullPointerException
	at org.joda.time.chrono.BaseChronology.get(BaseChronology.java:284)
	at org.joda.time.base.BasePeriod.<init>(BasePeriod.java:236)
	at org.joda.time.Period.<init>(Period.java:382)
	at org.joda.time.TestPeriod_Basics.testWithPeriodType1(TestPeriod_Basics.java:526)

testWithPeriodType2(org.joda.time.TestPeriod_Basics)  Time elapsed: 0 sec  <<< ERROR!
java.lang.NullPointerException
	at org.joda.time.chrono.BaseChronology.get(BaseChronology.java:284)
	at org.joda.time.base.BasePeriod.<init>(BasePeriod.java:236)
	at org.joda.time.Period.<init>(Period.java:382)
	at org.joda.time.TestPeriod_Basics.testWithPeriodType2(TestPeriod_Basics.java:532)

testWithPeriodType4(org.joda.time.TestPeriod_Basics)  Time elapsed: 0.001 sec  <<< ERROR!
java.lang.NullPointerException
	at org.joda.time.chrono.BaseChronology.get(BaseChronology.java:284)
	at org.joda.time.base.BasePeriod.<init>(BasePeriod.java:236)
	at org.joda.time.Period.<init>(Period.java:382)
	at org.joda.time.TestPeriod_Basics.testWithPeriodType4(TestPeriod_Basics.java:548)

testConstructor_long1(org.joda.time.TestMutablePeriod_Constructors)  Time elapsed: 0 sec  <<< ERROR!
java.lang.NullPointerException
	at org.joda.time.chrono.BaseChronology.get(BaseChronology.java:284)
	at org.joda.time.base.BasePeriod.<init>(BasePeriod.java:236)
	at org.joda.time.MutablePeriod.<init>(MutablePeriod.java:180)
	at org.joda.time.TestMutablePeriod_Constructors.testConstructor_long1(TestMutablePeriod_Constructors.java:158)

testConstructor_long2(org.joda.time.TestMutablePeriod_Constructors)  Time elapsed: 0 sec  <<< ERROR!
java.lang.NullPointerException
	at org.joda.time.chrono.BaseChronology.get(BaseChronology.java:284)
	at org.joda.time.base.BasePeriod.<init>(BasePeriod.java:236)
	at org.joda.time.MutablePeriod.<init>(MutablePeriod.java:180)
	at org.joda.time.TestMutablePeriod_Constructors.testConstructor_long2(TestMutablePeriod_Constructors.java:175)

testConstructor_Object_Chronology1(org.joda.time.TestMutablePeriod_Constructors)  Time elapsed: 0 sec  <<< ERROR!
java.lang.NullPointerException
	at org.joda.time.chrono.BaseChronology.get(BaseChronology.java:284)
	at org.joda.time.convert.ReadableDurationConverter.setInto(ReadableDurationConverter.java:75)
	at org.joda.time.base.BasePeriod.<init>(BasePeriod.java:279)
	at org.joda.time.MutablePeriod.<init>(MutablePeriod.java:408)
	at org.joda.time.TestMutablePeriod_Constructors.testConstructor_Object_Chronology1(TestMutablePeriod_Constructors.java:942)

testConstructor_Object_Chronology2(org.joda.time.TestMutablePeriod_Constructors)  Time elapsed: 0 sec  <<< ERROR!
java.lang.NullPointerException
	at org.joda.time.chrono.BaseChronology.get(BaseChronology.java:284)
	at org.joda.time.convert.ReadableDurationConverter.setInto(ReadableDurationConverter.java:75)
	at org.joda.time.base.BasePeriod.<init>(BasePeriod.java:279)
	at org.joda.time.MutablePeriod.<init>(MutablePeriod.java:408)
	at org.joda.time.TestMutablePeriod_Constructors.testConstructor_Object_Chronology2(TestMutablePeriod_Constructors.java:960)

testConstructor_long3(org.joda.time.TestMutablePeriod_Constructors)  Time elapsed: 0.001 sec  <<< ERROR!
java.lang.NullPointerException
	at org.joda.time.chrono.BaseChronology.get(BaseChronology.java:284)
	at org.joda.time.base.BasePeriod.<init>(BasePeriod.java:236)
	at org.joda.time.MutablePeriod.<init>(MutablePeriod.java:180)
	at org.joda.time.TestMutablePeriod_Constructors.testConstructor_long3(TestMutablePeriod_Constructors.java:193)

testConstructor_long_PeriodType1(org.joda.time.TestMutablePeriod_Constructors)  Time elapsed: 0 sec  <<< ERROR!
java.lang.NullPointerException
	at org.joda.time.chrono.BaseChronology.get(BaseChronology.java:284)
	at org.joda.time.base.BasePeriod.<init>(BasePeriod.java:258)
	at org.joda.time.MutablePeriod.<init>(MutablePeriod.java:200)
	at org.joda.time.TestMutablePeriod_Constructors.testConstructor_long_PeriodType1(TestMutablePeriod_Constructors.java:212)

testConstructor_long_long_Chronology1(org.joda.time.TestMutablePeriod_Constructors)  Time elapsed: 0.001 sec  <<< ERROR!
java.lang.NullPointerException
	at org.joda.time.chrono.BaseChronology.get(BaseChronology.java:260)
	at org.joda.time.base.BasePeriod.<init>(BasePeriod.java:110)
	at org.joda.time.MutablePeriod.<init>(MutablePeriod.java:276)
	at org.joda.time.TestMutablePeriod_Constructors.testConstructor_long_long_Chronology1(TestMutablePeriod_Constructors.java:548)

testConstructor_long_long1(org.joda.time.TestMutablePeriod_Constructors)  Time elapsed: 0.001 sec  <<< ERROR!
java.lang.NullPointerException
	at org.joda.time.chrono.BaseChronology.get(BaseChronology.java:260)
	at org.joda.time.base.BasePeriod.<init>(BasePeriod.java:110)
	at org.joda.time.MutablePeriod.<init>(MutablePeriod.java:253)
	at org.joda.time.TestMutablePeriod_Constructors.testConstructor_long_long1(TestMutablePeriod_Constructors.java:471)

testConstructor_RI_RI1(org.joda.time.TestMutablePeriod_Constructors)  Time elapsed: 0 sec  <<< ERROR!
java.lang.NullPointerException
	at org.joda.time.chrono.BaseChronology.get(BaseChronology.java:260)
	at org.joda.time.base.BasePeriod.<init>(BasePeriod.java:132)
	at org.joda.time.MutablePeriod.<init>(MutablePeriod.java:302)
	at org.joda.time.TestMutablePeriod_Constructors.testConstructor_RI_RI1(TestMutablePeriod_Constructors.java:610)

testConstructor_RI_RI2(org.joda.time.TestMutablePeriod_Constructors)  Time elapsed: 0.001 sec  <<< ERROR!
java.lang.NullPointerException
	at org.joda.time.chrono.BaseChronology.get(BaseChronology.java:260)
	at org.joda.time.base.BasePeriod.<init>(BasePeriod.java:132)
	at org.joda.time.MutablePeriod.<init>(MutablePeriod.java:302)
	at org.joda.time.TestMutablePeriod_Constructors.testConstructor_RI_RI2(TestMutablePeriod_Constructors.java:625)

testConstructor_RI_RI3(org.joda.time.TestMutablePeriod_Constructors)  Time elapsed: 0 sec  <<< ERROR!
java.lang.NullPointerException
	at org.joda.time.chrono.BaseChronology.get(BaseChronology.java:260)
	at org.joda.time.base.BasePeriod.<init>(BasePeriod.java:132)
	at org.joda.time.MutablePeriod.<init>(MutablePeriod.java:302)
	at org.joda.time.TestMutablePeriod_Constructors.testConstructor_RI_RI3(TestMutablePeriod_Constructors.java:640)

testConstructor_RI_RI4(org.joda.time.TestMutablePeriod_Constructors)  Time elapsed: 0.001 sec  <<< ERROR!
java.lang.NullPointerException
	at org.joda.time.chrono.BaseChronology.get(BaseChronology.java:260)
	at org.joda.time.base.BasePeriod.<init>(BasePeriod.java:132)
	at org.joda.time.MutablePeriod.<init>(MutablePeriod.java:302)
	at org.joda.time.TestMutablePeriod_Constructors.testConstructor_RI_RI4(TestMutablePeriod_Constructors.java:655)

testConstructor_long_long2(org.joda.time.TestMutablePeriod_Constructors)  Time elapsed: 0 sec  <<< ERROR!
java.lang.NullPointerException
	at org.joda.time.chrono.BaseChronology.get(BaseChronology.java:260)
	at org.joda.time.base.BasePeriod.<init>(BasePeriod.java:110)
	at org.joda.time.MutablePeriod.<init>(MutablePeriod.java:253)
	at org.joda.time.TestMutablePeriod_Constructors.testConstructor_long_long2(TestMutablePeriod_Constructors.java:486)

testConstructor_RI_RD1(org.joda.time.TestMutablePeriod_Constructors)  Time elapsed: 0.001 sec  <<< ERROR!
java.lang.NullPointerException
	at org.joda.time.chrono.BaseChronology.get(BaseChronology.java:260)
	at org.joda.time.base.BasePeriod.<init>(BasePeriod.java:201)
	at org.joda.time.MutablePeriod.<init>(MutablePeriod.java:326)
	at org.joda.time.TestMutablePeriod_Constructors.testConstructor_RI_RD1(TestMutablePeriod_Constructors.java:763)

testConstructor_long_long_PeriodType_Chronology2(org.joda.time.TestMutablePeriod_Constructors)  Time elapsed: 0.001 sec  <<< ERROR!
java.lang.NullPointerException
	at org.joda.time.chrono.BaseChronology.get(BaseChronology.java:260)
	at org.joda.time.base.BasePeriod.<init>(BasePeriod.java:110)
	at org.joda.time.MutablePeriod.<init>(MutablePeriod.java:288)
	at org.joda.time.TestMutablePeriod_Constructors.testConstructor_long_long_PeriodType_Chronology2(TestMutablePeriod_Constructors.java:594)

testConstructor_RI_RI_PeriodType1(org.joda.time.TestMutablePeriod_Constructors)  Time elapsed: 0.001 sec  <<< ERROR!
java.lang.NullPointerException
	at org.joda.time.chrono.BaseChronology.get(BaseChronology.java:260)
	at org.joda.time.base.BasePeriod.<init>(BasePeriod.java:132)
	at org.joda.time.MutablePeriod.<init>(MutablePeriod.java:316)
	at org.joda.time.TestMutablePeriod_Constructors.testConstructor_RI_RI_PeriodType1(TestMutablePeriod_Constructors.java:686)

testConstructor_RI_RI_PeriodType2(org.joda.time.TestMutablePeriod_Constructors)  Time elapsed: 0 sec  <<< ERROR!
java.lang.NullPointerException
	at org.joda.time.chrono.BaseChronology.get(BaseChronology.java:260)
	at org.joda.time.base.BasePeriod.<init>(BasePeriod.java:132)
	at org.joda.time.MutablePeriod.<init>(MutablePeriod.java:316)
	at org.joda.time.TestMutablePeriod_Constructors.testConstructor_RI_RI_PeriodType2(TestMutablePeriod_Constructors.java:701)

testConstructor_RI_RI_PeriodType3(org.joda.time.TestMutablePeriod_Constructors)  Time elapsed: 0 sec  <<< ERROR!
java.lang.NullPointerException
	at org.joda.time.chrono.BaseChronology.get(BaseChronology.java:260)
	at org.joda.time.base.BasePeriod.<init>(BasePeriod.java:132)
	at org.joda.time.MutablePeriod.<init>(MutablePeriod.java:316)
	at org.joda.time.TestMutablePeriod_Constructors.testConstructor_RI_RI_PeriodType3(TestMutablePeriod_Constructors.java:716)

testConstructor_RI_RI_PeriodType4(org.joda.time.TestMutablePeriod_Constructors)  Time elapsed: 0.004 sec  <<< ERROR!
java.lang.NullPointerException
	at org.joda.time.chrono.BaseChronology.get(BaseChronology.java:260)
	at org.joda.time.base.BasePeriod.<init>(BasePeriod.java:132)
	at org.joda.time.MutablePeriod.<init>(MutablePeriod.java:316)
	at org.joda.time.TestMutablePeriod_Constructors.testConstructor_RI_RI_PeriodType4(TestMutablePeriod_Constructors.java:731)

testConstructor_long_PeriodType_Chronology2(org.joda.time.TestMutablePeriod_Constructors)  Time elapsed: 0 sec  <<< ERROR!
java.lang.NullPointerException
	at org.joda.time.chrono.BaseChronology.get(BaseChronology.java:284)
	at org.joda.time.base.BasePeriod.<init>(BasePeriod.java:258)
	at org.joda.time.MutablePeriod.<init>(MutablePeriod.java:242)
	at org.joda.time.TestMutablePeriod_Constructors.testConstructor_long_PeriodType_Chronology2(TestMutablePeriod_Constructors.java:350)

testConstructor_long_PeriodType_Chronology3(org.joda.time.TestMutablePeriod_Constructors)  Time elapsed: 0 sec  <<< ERROR!
java.lang.NullPointerException
	at org.joda.time.chrono.BaseChronology.get(BaseChronology.java:284)
	at org.joda.time.base.BasePeriod.<init>(BasePeriod.java:258)
	at org.joda.time.MutablePeriod.<init>(MutablePeriod.java:242)
	at org.joda.time.TestMutablePeriod_Constructors.testConstructor_long_PeriodType_Chronology3(TestMutablePeriod_Constructors.java:367)

testConstructor_long_PeriodType_Chronology4(org.joda.time.TestMutablePeriod_Constructors)  Time elapsed: 0 sec  <<< ERROR!
java.lang.NullPointerException
	at org.joda.time.chrono.BaseChronology.get(BaseChronology.java:284)
	at org.joda.time.base.BasePeriod.<init>(BasePeriod.java:258)
	at org.joda.time.MutablePeriod.<init>(MutablePeriod.java:242)
	at org.joda.time.TestMutablePeriod_Constructors.testConstructor_long_PeriodType_Chronology4(TestMutablePeriod_Constructors.java:384)

testConstructor_long_long_PeriodType1(org.joda.time.TestMutablePeriod_Constructors)  Time elapsed: 0 sec  <<< ERROR!
java.lang.NullPointerException
	at org.joda.time.chrono.BaseChronology.get(BaseChronology.java:260)
	at org.joda.time.base.BasePeriod.<init>(BasePeriod.java:110)
	at org.joda.time.MutablePeriod.<init>(MutablePeriod.java:264)
	at org.joda.time.TestMutablePeriod_Constructors.testConstructor_long_long_PeriodType1(TestMutablePeriod_Constructors.java:502)

testConstructor_long_long_PeriodType2(org.joda.time.TestMutablePeriod_Constructors)  Time elapsed: 0 sec  <<< ERROR!
java.lang.NullPointerException
	at org.joda.time.chrono.BaseChronology.get(BaseChronology.java:260)
	at org.joda.time.base.BasePeriod.<init>(BasePeriod.java:110)
	at org.joda.time.MutablePeriod.<init>(MutablePeriod.java:264)
	at org.joda.time.TestMutablePeriod_Constructors.testConstructor_long_long_PeriodType2(TestMutablePeriod_Constructors.java:517)

testConstructor_long_long_PeriodType3(org.joda.time.TestMutablePeriod_Constructors)  Time elapsed: 0 sec  <<< ERROR!
java.lang.NullPointerException
	at org.joda.time.chrono.BaseChronology.get(BaseChronology.java:260)
	at org.joda.time.base.BasePeriod.<init>(BasePeriod.java:110)
	at org.joda.time.MutablePeriod.<init>(MutablePeriod.java:264)
	at org.joda.time.TestMutablePeriod_Constructors.testConstructor_long_long_PeriodType3(TestMutablePeriod_Constructors.java:532)

testConstructor_long_long_PeriodType_Chronology1(org.joda.time.TestMutablePeriod_Constructors)  Time elapsed: 0 sec  <<< ERROR!
java.lang.NullPointerException
	at org.joda.time.chrono.BaseChronology.get(BaseChronology.java:260)
	at org.joda.time.base.BasePeriod.<init>(BasePeriod.java:110)
	at org.joda.time.MutablePeriod.<init>(MutablePeriod.java:288)
	at org.joda.time.TestMutablePeriod_Constructors.testConstructor_long_long_PeriodType_Chronology1(TestMutablePeriod_Constructors.java:579)

testConstructor_long_PeriodType3(org.joda.time.TestMutablePeriod_Constructors)  Time elapsed: 0 sec  <<< ERROR!
java.lang.NullPointerException
	at org.joda.time.chrono.BaseChronology.get(BaseChronology.java:284)
	at org.joda.time.base.BasePeriod.<init>(BasePeriod.java:258)
	at org.joda.time.MutablePeriod.<init>(MutablePeriod.java:200)
	at org.joda.time.TestMutablePeriod_Constructors.testConstructor_long_PeriodType3(TestMutablePeriod_Constructors.java:246)

testConstructor_long_PeriodType4(org.joda.time.TestMutablePeriod_Constructors)  Time elapsed: 0.001 sec  <<< ERROR!
java.lang.NullPointerException
	at org.joda.time.chrono.BaseChronology.get(BaseChronology.java:284)
	at org.joda.time.base.BasePeriod.<init>(BasePeriod.java:258)
	at org.joda.time.MutablePeriod.<init>(MutablePeriod.java:200)
	at org.joda.time.TestMutablePeriod_Constructors.testConstructor_long_PeriodType4(TestMutablePeriod_Constructors.java:263)

testConstructor_long_Chronology1(org.joda.time.TestMutablePeriod_Constructors)  Time elapsed: 0 sec  <<< ERROR!
java.lang.NullPointerException
	at org.joda.time.chrono.BaseChronology.get(BaseChronology.java:284)
	at org.joda.time.base.BasePeriod.<init>(BasePeriod.java:258)
	at org.joda.time.MutablePeriod.<init>(MutablePeriod.java:221)
	at org.joda.time.TestMutablePeriod_Constructors.testConstructor_long_Chronology1(TestMutablePeriod_Constructors.java:281)

testConstructor_long_Chronology2(org.joda.time.TestMutablePeriod_Constructors)  Time elapsed: 0 sec  <<< ERROR!
java.lang.NullPointerException
	at org.joda.time.chrono.BaseChronology.get(BaseChronology.java:284)
	at org.joda.time.base.BasePeriod.<init>(BasePeriod.java:258)
	at org.joda.time.MutablePeriod.<init>(MutablePeriod.java:221)
	at org.joda.time.TestMutablePeriod_Constructors.testConstructor_long_Chronology2(TestMutablePeriod_Constructors.java:298)

testConstructor_long_Chronology3(org.joda.time.TestMutablePeriod_Constructors)  Time elapsed: 0.001 sec  <<< ERROR!
java.lang.NullPointerException
	at org.joda.time.chrono.BaseChronology.get(BaseChronology.java:284)
	at org.joda.time.base.BasePeriod.<init>(BasePeriod.java:258)
	at org.joda.time.MutablePeriod.<init>(MutablePeriod.java:221)
	at org.joda.time.TestMutablePeriod_Constructors.testConstructor_long_Chronology3(TestMutablePeriod_Constructors.java:315)

testConstructor_long_PeriodType_Chronology1(org.joda.time.TestMutablePeriod_Constructors)  Time elapsed: 0 sec  <<< ERROR!
java.lang.NullPointerException
	at org.joda.time.chrono.BaseChronology.get(BaseChronology.java:284)
	at org.joda.time.base.BasePeriod.<init>(BasePeriod.java:258)
	at org.joda.time.MutablePeriod.<init>(MutablePeriod.java:242)
	at org.joda.time.TestMutablePeriod_Constructors.testConstructor_long_PeriodType_Chronology1(TestMutablePeriod_Constructors.java:333)

testConstructor_long_long_Chronology2(org.joda.time.TestMutablePeriod_Constructors)  Time elapsed: 0.001 sec  <<< ERROR!
java.lang.NullPointerException
	at org.joda.time.chrono.BaseChronology.get(BaseChronology.java:260)
	at org.joda.time.base.BasePeriod.<init>(BasePeriod.java:110)
	at org.joda.time.MutablePeriod.<init>(MutablePeriod.java:276)
	at org.joda.time.TestMutablePeriod_Constructors.testConstructor_long_long_Chronology2(TestMutablePeriod_Constructors.java:563)

testConstructor_RI_RD_PeriodType1(org.joda.time.TestMutablePeriod_Constructors)  Time elapsed: 0 sec  <<< ERROR!
java.lang.NullPointerException
	at org.joda.time.chrono.BaseChronology.get(BaseChronology.java:260)
	at org.joda.time.base.BasePeriod.<init>(BasePeriod.java:201)
	at org.joda.time.MutablePeriod.<init>(MutablePeriod.java:337)
	at org.joda.time.TestMutablePeriod_Constructors.testConstructor_RI_RD_PeriodType1(TestMutablePeriod_Constructors.java:795)

testEqualsHashCode(org.joda.time.TestMutablePeriod_Basics)  Time elapsed: 0 sec  <<< ERROR!
java.lang.NullPointerException
	at org.joda.time.chrono.BaseChronology.get(BaseChronology.java:284)
	at org.joda.time.base.BasePeriod.<init>(BasePeriod.java:236)
	at org.joda.time.MutablePeriod.<init>(MutablePeriod.java:180)
	at org.joda.time.TestMutablePeriod_Basics.testEqualsHashCode(TestMutablePeriod_Basics.java:130)

testToString(org.joda.time.TestMutablePeriod_Basics)  Time elapsed: 0 sec  <<< ERROR!
java.lang.NullPointerException
	at org.joda.time.chrono.BaseChronology.get(BaseChronology.java:284)
	at org.joda.time.base.BasePeriod.<init>(BasePeriod.java:236)
	at org.joda.time.MutablePeriod.<init>(MutablePeriod.java:180)
	at org.joda.time.TestMutablePeriod_Basics.testToString(TestMutablePeriod_Basics.java:410)

testSerialization(org.joda.time.TestMutablePeriod_Basics)  Time elapsed: 0 sec  <<< ERROR!
java.lang.NullPointerException
	at org.joda.time.chrono.BaseChronology.get(BaseChronology.java:284)
	at org.joda.time.base.BasePeriod.<init>(BasePeriod.java:236)
	at org.joda.time.MutablePeriod.<init>(MutablePeriod.java:180)
	at org.joda.time.TestMutablePeriod_Basics.testSerialization(TestMutablePeriod_Basics.java:161)

testClone(org.joda.time.TestMutablePeriod_Basics)  Time elapsed: 0.001 sec  <<< ERROR!
java.lang.NullPointerException
	at org.joda.time.chrono.BaseChronology.get(BaseChronology.java:284)
	at org.joda.time.base.BasePeriod.<init>(BasePeriod.java:236)
	at org.joda.time.MutablePeriod.<init>(MutablePeriod.java:180)
	at org.joda.time.TestMutablePeriod_Basics.testClone(TestMutablePeriod_Basics.java:448)

testCopy(org.joda.time.TestMutablePeriod_Basics)  Time elapsed: 0 sec  <<< ERROR!
java.lang.NullPointerException
	at org.joda.time.chrono.BaseChronology.get(BaseChronology.java:284)
	at org.joda.time.base.BasePeriod.<init>(BasePeriod.java:236)
	at org.joda.time.MutablePeriod.<init>(MutablePeriod.java:180)
	at org.joda.time.TestMutablePeriod_Basics.testCopy(TestMutablePeriod_Basics.java:440)

testToPeriod(org.joda.time.TestMutablePeriod_Basics)  Time elapsed: 0.001 sec  <<< ERROR!
java.lang.NullPointerException
	at org.joda.time.chrono.BaseChronology.get(BaseChronology.java:284)
	at org.joda.time.base.BasePeriod.<init>(BasePeriod.java:236)
	at org.joda.time.MutablePeriod.<init>(MutablePeriod.java:180)
	at org.joda.time.TestMutablePeriod_Basics.testToPeriod(TestMutablePeriod_Basics.java:416)

testToMutablePeriod(org.joda.time.TestMutablePeriod_Basics)  Time elapsed: 0 sec  <<< ERROR!
java.lang.NullPointerException
	at org.joda.time.chrono.BaseChronology.get(BaseChronology.java:284)
	at org.joda.time.base.BasePeriod.<init>(BasePeriod.java:236)
	at org.joda.time.MutablePeriod.<init>(MutablePeriod.java:180)
	at org.joda.time.TestMutablePeriod_Basics.testToMutablePeriod(TestMutablePeriod_Basics.java:422)

testToDurationFrom(org.joda.time.TestMutablePeriod_Basics)  Time elapsed: 0 sec  <<< ERROR!
java.lang.NullPointerException
	at org.joda.time.chrono.BaseChronology.get(BaseChronology.java:284)
	at org.joda.time.base.BasePeriod.<init>(BasePeriod.java:236)
	at org.joda.time.MutablePeriod.<init>(MutablePeriod.java:180)
	at org.joda.time.TestMutablePeriod_Basics.testToDurationFrom(TestMutablePeriod_Basics.java:434)

testAdd_RD2(org.joda.time.TestMutablePeriod_Updates)  Time elapsed: 0.001 sec  <<< ERROR!
java.lang.NullPointerException
	at org.joda.time.chrono.BaseChronology.get(BaseChronology.java:284)
	at org.joda.time.base.BasePeriod.<init>(BasePeriod.java:258)
	at org.joda.time.MutablePeriod.<init>(MutablePeriod.java:200)
	at org.joda.time.TestMutablePeriod_Updates.testAdd_RD2(TestMutablePeriod_Updates.java:1203)

testAdd_RP1(org.joda.time.TestMutablePeriod_Updates)  Time elapsed: 0 sec  <<< ERROR!
java.lang.NullPointerException
	at org.joda.time.chrono.BaseChronology.get(BaseChronology.java:284)
	at org.joda.time.base.BasePeriod.<init>(BasePeriod.java:236)
	at org.joda.time.MutablePeriod.<init>(MutablePeriod.java:180)
	at org.joda.time.TestMutablePeriod_Updates.testAdd_RP1(TestMutablePeriod_Updates.java:1235)

testAdd_RP2(org.joda.time.TestMutablePeriod_Updates)  Time elapsed: 0.001 sec  <<< ERROR!
java.lang.NullPointerException
	at org.joda.time.chrono.BaseChronology.get(BaseChronology.java:284)
	at org.joda.time.base.BasePeriod.<init>(BasePeriod.java:258)
	at org.joda.time.MutablePeriod.<init>(MutablePeriod.java:200)
	at org.joda.time.TestMutablePeriod_Updates.testAdd_RP2(TestMutablePeriod_Updates.java:1248)

testAdd_long1(org.joda.time.TestMutablePeriod_Updates)  Time elapsed: 0 sec  <<< ERROR!
java.lang.NullPointerException
	at org.joda.time.chrono.BaseChronology.get(BaseChronology.java:284)
	at org.joda.time.base.BasePeriod.<init>(BasePeriod.java:236)
	at org.joda.time.MutablePeriod.<init>(MutablePeriod.java:180)
	at org.joda.time.TestMutablePeriod_Updates.testAdd_long1(TestMutablePeriod_Updates.java:1092)

testAdd_RD1(org.joda.time.TestMutablePeriod_Updates)  Time elapsed: 0.001 sec  <<< ERROR!
java.lang.NullPointerException
	at org.joda.time.chrono.BaseChronology.get(BaseChronology.java:284)
	at org.joda.time.base.BasePeriod.<init>(BasePeriod.java:236)
	at org.joda.time.MutablePeriod.<init>(MutablePeriod.java:180)
	at org.joda.time.TestMutablePeriod_Updates.testAdd_RD1(TestMutablePeriod_Updates.java:1190)

testSetPeriod_long_long1(org.joda.time.TestMutablePeriod_Updates)  Time elapsed: 0 sec  <<< ERROR!
java.lang.NullPointerException
	at org.joda.time.chrono.BaseChronology.get(BaseChronology.java:260)
	at org.joda.time.MutablePeriod.setPeriod(MutablePeriod.java:548)
	at org.joda.time.MutablePeriod.setPeriod(MutablePeriod.java:535)
	at org.joda.time.TestMutablePeriod_Updates.testSetPeriod_long_long1(TestMutablePeriod_Updates.java:562)

testSetPeriod_long_long2(org.joda.time.TestMutablePeriod_Updates)  Time elapsed: 0 sec  <<< ERROR!
java.lang.NullPointerException
	at org.joda.time.chrono.BaseChronology.get(BaseChronology.java:260)
	at org.joda.time.MutablePeriod.setPeriod(MutablePeriod.java:548)
	at org.joda.time.MutablePeriod.setPeriod(MutablePeriod.java:535)
	at org.joda.time.TestMutablePeriod_Updates.testSetPeriod_long_long2(TestMutablePeriod_Updates.java:577)

testSetPeriod_long_long_NoYears(org.joda.time.TestMutablePeriod_Updates)  Time elapsed: 0 sec  <<< ERROR!
java.lang.NullPointerException
	at org.joda.time.chrono.BaseChronology.get(BaseChronology.java:260)
	at org.joda.time.MutablePeriod.setPeriod(MutablePeriod.java:548)
	at org.joda.time.MutablePeriod.setPeriod(MutablePeriod.java:535)
	at org.joda.time.TestMutablePeriod_Updates.testSetPeriod_long_long_NoYears(TestMutablePeriod_Updates.java:606)

testSetPeriod_long_long_NoMonths(org.joda.time.TestMutablePeriod_Updates)  Time elapsed: 0 sec  <<< ERROR!
java.lang.NullPointerException
	at org.joda.time.chrono.BaseChronology.get(BaseChronology.java:260)
	at org.joda.time.MutablePeriod.setPeriod(MutablePeriod.java:548)
	at org.joda.time.MutablePeriod.setPeriod(MutablePeriod.java:535)
	at org.joda.time.TestMutablePeriod_Updates.testSetPeriod_long_long_NoMonths(TestMutablePeriod_Updates.java:621)

testSetPeriod_long_long_NoWeeks(org.joda.time.TestMutablePeriod_Updates)  Time elapsed: 0 sec  <<< ERROR!
java.lang.NullPointerException
	at org.joda.time.chrono.BaseChronology.get(BaseChronology.java:260)
	at org.joda.time.MutablePeriod.setPeriod(MutablePeriod.java:548)
	at org.joda.time.MutablePeriod.setPeriod(MutablePeriod.java:535)
	at org.joda.time.TestMutablePeriod_Updates.testSetPeriod_long_long_NoWeeks(TestMutablePeriod_Updates.java:636)

testSetPeriod_long_long_NoDays(org.joda.time.TestMutablePeriod_Updates)  Time elapsed: 0.001 sec  <<< ERROR!
java.lang.NullPointerException
	at org.joda.time.chrono.BaseChronology.get(BaseChronology.java:260)
	at org.joda.time.MutablePeriod.setPeriod(MutablePeriod.java:548)
	at org.joda.time.MutablePeriod.setPeriod(MutablePeriod.java:535)
	at org.joda.time.TestMutablePeriod_Updates.testSetPeriod_long_long_NoDays(TestMutablePeriod_Updates.java:651)

testSetPeriod_long_long_NoHours(org.joda.time.TestMutablePeriod_Updates)  Time elapsed: 0.001 sec  <<< ERROR!
java.lang.NullPointerException
	at org.joda.time.chrono.BaseChronology.get(BaseChronology.java:260)
	at org.joda.time.MutablePeriod.setPeriod(MutablePeriod.java:548)
	at org.joda.time.MutablePeriod.setPeriod(MutablePeriod.java:535)
	at org.joda.time.TestMutablePeriod_Updates.testSetPeriod_long_long_NoHours(TestMutablePeriod_Updates.java:666)

testSetPeriod_long_long_NoSeconds(org.joda.time.TestMutablePeriod_Updates)  Time elapsed: 0.004 sec  <<< ERROR!
java.lang.NullPointerException
	at org.joda.time.chrono.BaseChronology.get(BaseChronology.java:260)
	at org.joda.time.MutablePeriod.setPeriod(MutablePeriod.java:548)
	at org.joda.time.MutablePeriod.setPeriod(MutablePeriod.java:535)
	at org.joda.time.TestMutablePeriod_Updates.testSetPeriod_long_long_NoSeconds(TestMutablePeriod_Updates.java:696)

testSetPeriod_long_long_NoMillis(org.joda.time.TestMutablePeriod_Updates)  Time elapsed: 0 sec  <<< ERROR!
java.lang.NullPointerException
	at org.joda.time.chrono.BaseChronology.get(BaseChronology.java:260)
	at org.joda.time.MutablePeriod.setPeriod(MutablePeriod.java:548)
	at org.joda.time.MutablePeriod.setPeriod(MutablePeriod.java:535)
	at org.joda.time.TestMutablePeriod_Updates.testSetPeriod_long_long_NoMillis(TestMutablePeriod_Updates.java:711)

testSetPeriod_RI_RI1(org.joda.time.TestMutablePeriod_Updates)  Time elapsed: 0 sec  <<< ERROR!
java.lang.NullPointerException
	at org.joda.time.chrono.BaseChronology.get(BaseChronology.java:260)
	at org.joda.time.MutablePeriod.setPeriod(MutablePeriod.java:548)
	at org.joda.time.MutablePeriod.setPeriod(MutablePeriod.java:522)
	at org.joda.time.TestMutablePeriod_Updates.testSetPeriod_RI_RI1(TestMutablePeriod_Updates.java:727)

testSetPeriod_RI_RI2(org.joda.time.TestMutablePeriod_Updates)  Time elapsed: 0 sec  <<< ERROR!
java.lang.NullPointerException
	at org.joda.time.chrono.BaseChronology.get(BaseChronology.java:260)
	at org.joda.time.MutablePeriod.setPeriod(MutablePeriod.java:548)
	at org.joda.time.MutablePeriod.setPeriod(MutablePeriod.java:522)
	at org.joda.time.TestMutablePeriod_Updates.testSetPeriod_RI_RI2(TestMutablePeriod_Updates.java:742)

testSetPeriod_RInterval1(org.joda.time.TestMutablePeriod_Updates)  Time elapsed: 0 sec  <<< ERROR!
java.lang.NullPointerException
	at org.joda.time.chrono.BaseChronology.get(BaseChronology.java:260)
	at org.joda.time.MutablePeriod.setPeriod(MutablePeriod.java:548)
	at org.joda.time.MutablePeriod.setPeriod(MutablePeriod.java:501)
	at org.joda.time.TestMutablePeriod_Updates.testSetPeriod_RInterval1(TestMutablePeriod_Updates.java:772)

testSetPeriod_long1(org.joda.time.TestMutablePeriod_Updates)  Time elapsed: 0 sec  <<< ERROR!
java.lang.NullPointerException
	at org.joda.time.chrono.BaseChronology.get(BaseChronology.java:284)
	at org.joda.time.MutablePeriod.setPeriod(MutablePeriod.java:611)
	at org.joda.time.MutablePeriod.setPeriod(MutablePeriod.java:595)
	at org.joda.time.TestMutablePeriod_Updates.testSetPeriod_long1(TestMutablePeriod_Updates.java:799)

testSetPeriod_long2(org.joda.time.TestMutablePeriod_Updates)  Time elapsed: 0 sec  <<< ERROR!
java.lang.NullPointerException
	at org.joda.time.chrono.BaseChronology.get(BaseChronology.java:284)
	at org.joda.time.MutablePeriod.setPeriod(MutablePeriod.java:611)
	at org.joda.time.MutablePeriod.setPeriod(MutablePeriod.java:595)
	at org.joda.time.TestMutablePeriod_Updates.testSetPeriod_long2(TestMutablePeriod_Updates.java:812)

testSetPeriod_RD1(org.joda.time.TestMutablePeriod_Updates)  Time elapsed: 0 sec  <<< ERROR!
java.lang.NullPointerException
	at org.joda.time.chrono.BaseChronology.get(BaseChronology.java:284)
	at org.joda.time.MutablePeriod.setPeriod(MutablePeriod.java:611)
	at org.joda.time.MutablePeriod.setPeriod(MutablePeriod.java:580)
	at org.joda.time.MutablePeriod.setPeriod(MutablePeriod.java:563)
	at org.joda.time.TestMutablePeriod_Updates.testSetPeriod_RD1(TestMutablePeriod_Updates.java:1017)

testSetPeriod_RD2(org.joda.time.TestMutablePeriod_Updates)  Time elapsed: 0.001 sec  <<< ERROR!
java.lang.NullPointerException
	at org.joda.time.chrono.BaseChronology.get(BaseChronology.java:284)
	at org.joda.time.MutablePeriod.setPeriod(MutablePeriod.java:611)
	at org.joda.time.MutablePeriod.setPeriod(MutablePeriod.java:580)
	at org.joda.time.MutablePeriod.setPeriod(MutablePeriod.java:563)
	at org.joda.time.TestMutablePeriod_Updates.testSetPeriod_RD2(TestMutablePeriod_Updates.java:1035)

testAdd_8ints1(org.joda.time.TestMutablePeriod_Updates)  Time elapsed: 0 sec  <<< ERROR!
java.lang.NullPointerException
	at org.joda.time.chrono.BaseChronology.get(BaseChronology.java:284)
	at org.joda.time.base.BasePeriod.<init>(BasePeriod.java:236)
	at org.joda.time.MutablePeriod.<init>(MutablePeriod.java:180)
	at org.joda.time.TestMutablePeriod_Updates.testAdd_8ints1(TestMutablePeriod_Updates.java:1062)

testAdd_8ints2(org.joda.time.TestMutablePeriod_Updates)  Time elapsed: 0.001 sec  <<< ERROR!
java.lang.NullPointerException
	at org.joda.time.chrono.BaseChronology.get(BaseChronology.java:284)
	at org.joda.time.base.BasePeriod.<init>(BasePeriod.java:258)
	at org.joda.time.MutablePeriod.<init>(MutablePeriod.java:200)
	at org.joda.time.TestMutablePeriod_Updates.testAdd_8ints2(TestMutablePeriod_Updates.java:1075)

testAdd_long2(org.joda.time.TestMutablePeriod_Updates)  Time elapsed: 0 sec  <<< ERROR!
java.lang.NullPointerException
	at org.joda.time.chrono.BaseChronology.get(BaseChronology.java:284)
	at org.joda.time.base.BasePeriod.<init>(BasePeriod.java:258)
	at org.joda.time.MutablePeriod.<init>(MutablePeriod.java:200)
	at org.joda.time.TestMutablePeriod_Updates.testAdd_long2(TestMutablePeriod_Updates.java:1105)

testAdd_long3(org.joda.time.TestMutablePeriod_Updates)  Time elapsed: 0.001 sec  <<< ERROR!
java.lang.NullPointerException
	at org.joda.time.chrono.BaseChronology.get(BaseChronology.java:284)
	at org.joda.time.base.BasePeriod.<init>(BasePeriod.java:258)
	at org.joda.time.Period.<init>(Period.java:402)
	at org.joda.time.MutablePeriod.add(MutablePeriod.java:707)
	at org.joda.time.TestMutablePeriod_Updates.testAdd_long3(TestMutablePeriod_Updates.java:1125)

testAdd_long_Chronology1(org.joda.time.TestMutablePeriod_Updates)  Time elapsed: 0 sec  <<< ERROR!
java.lang.NullPointerException
	at org.joda.time.chrono.BaseChronology.get(BaseChronology.java:284)
	at org.joda.time.base.BasePeriod.<init>(BasePeriod.java:236)
	at org.joda.time.MutablePeriod.<init>(MutablePeriod.java:180)
	at org.joda.time.TestMutablePeriod_Updates.testAdd_long_Chronology1(TestMutablePeriod_Updates.java:1138)

testAdd_long_Chronology2(org.joda.time.TestMutablePeriod_Updates)  Time elapsed: 0 sec  <<< ERROR!
java.lang.NullPointerException
	at org.joda.time.chrono.BaseChronology.get(BaseChronology.java:284)
	at org.joda.time.base.BasePeriod.<init>(BasePeriod.java:258)
	at org.joda.time.MutablePeriod.<init>(MutablePeriod.java:200)
	at org.joda.time.TestMutablePeriod_Updates.testAdd_long_Chronology2(TestMutablePeriod_Updates.java:1151)

testAdd_long_Chronology3(org.joda.time.TestMutablePeriod_Updates)  Time elapsed: 0.001 sec  <<< ERROR!
java.lang.NullPointerException
	at org.joda.time.chrono.BaseChronology.get(BaseChronology.java:284)
	at org.joda.time.base.BasePeriod.<init>(BasePeriod.java:258)
	at org.joda.time.MutablePeriod.<init>(MutablePeriod.java:200)
	at org.joda.time.TestMutablePeriod_Updates.testAdd_long_Chronology3(TestMutablePeriod_Updates.java:1170)

testAdd_RP3(org.joda.time.TestMutablePeriod_Updates)  Time elapsed: 0 sec  <<< ERROR!
java.lang.NullPointerException
	at org.joda.time.chrono.BaseChronology.get(BaseChronology.java:284)
	at org.joda.time.base.BasePeriod.<init>(BasePeriod.java:258)
	at org.joda.time.MutablePeriod.<init>(MutablePeriod.java:200)
	at org.joda.time.TestMutablePeriod_Updates.testAdd_RP3(TestMutablePeriod_Updates.java:1262)

testAdd_RInterval1(org.joda.time.TestMutablePeriod_Updates)  Time elapsed: 0 sec  <<< ERROR!
java.lang.NullPointerException
	at org.joda.time.chrono.BaseChronology.get(BaseChronology.java:284)
	at org.joda.time.base.BasePeriod.<init>(BasePeriod.java:236)
	at org.joda.time.MutablePeriod.<init>(MutablePeriod.java:180)
	at org.joda.time.TestMutablePeriod_Updates.testAdd_RInterval1(TestMutablePeriod_Updates.java:1318)

testAdd_RInterval2(org.joda.time.TestMutablePeriod_Updates)  Time elapsed: 0.001 sec  <<< ERROR!
java.lang.NullPointerException
	at org.joda.time.chrono.BaseChronology.get(BaseChronology.java:284)
	at org.joda.time.base.BasePeriod.<init>(BasePeriod.java:236)
	at org.joda.time.MutablePeriod.<init>(MutablePeriod.java:180)
	at org.joda.time.TestMutablePeriod_Updates.testAdd_RInterval2(TestMutablePeriod_Updates.java:1333)

testAdd_RInterval3(org.joda.time.TestMutablePeriod_Updates)  Time elapsed: 0.001 sec  <<< ERROR!
java.lang.NullPointerException
	at org.joda.time.chrono.BaseChronology.get(BaseChronology.java:284)
	at org.joda.time.base.BasePeriod.<init>(BasePeriod.java:258)
	at org.joda.time.MutablePeriod.<init>(MutablePeriod.java:200)
	at org.joda.time.TestMutablePeriod_Updates.testAdd_RInterval3(TestMutablePeriod_Updates.java:1346)

testAdd_RInterval4(org.joda.time.TestMutablePeriod_Updates)  Time elapsed: 0 sec  <<< ERROR!
java.lang.NullPointerException
	at org.joda.time.chrono.BaseChronology.get(BaseChronology.java:284)
	at org.joda.time.base.BasePeriod.<init>(BasePeriod.java:258)
	at org.joda.time.MutablePeriod.<init>(MutablePeriod.java:200)
	at org.joda.time.TestMutablePeriod_Updates.testAdd_RInterval4(TestMutablePeriod_Updates.java:1361)

testFactory_standardHoursIn_RPeriod(org.joda.time.TestHours)  Time elapsed: 0 sec  <<< ERROR!
java.lang.NullPointerException
	at org.joda.time.base.BaseSingleFieldPeriod.standardPeriodIn(BaseSingleFieldPeriod.java:139)
	at org.joda.time.Hours.standardHoursIn(Hours.java:185)
	at org.joda.time.TestHours.testFactory_standardHoursIn_RPeriod(TestHours.java:130)

testFactory_minutesBetween_RInstant(org.joda.time.TestMinutes)  Time elapsed: 0 sec  <<< ERROR!
java.lang.NullPointerException
	at org.joda.time.base.BaseSingleFieldPeriod.between(BaseSingleFieldPeriod.java:72)
	at org.joda.time.Minutes.minutesBetween(Minutes.java:101)
	at org.joda.time.TestMinutes.testFactory_minutesBetween_RInstant(TestMinutes.java:82)

testFactory_minutesBetween_RPartial(org.joda.time.TestMinutes)  Time elapsed: 0 sec  <<< ERROR!
java.lang.NullPointerException
	at org.joda.time.Minutes.minutesBetween(Minutes.java:120)
	at org.joda.time.TestMinutes.testFactory_minutesBetween_RPartial(TestMinutes.java:95)

testFactory_minutesIn_RInterval(org.joda.time.TestMinutes)  Time elapsed: 0 sec  <<< ERROR!
java.lang.NullPointerException
	at org.joda.time.base.BaseSingleFieldPeriod.between(BaseSingleFieldPeriod.java:72)
	at org.joda.time.Minutes.minutesIn(Minutes.java:140)
	at org.joda.time.TestMinutes.testFactory_minutesIn_RInterval(TestMinutes.java:108)

testFactory_standardMinutesIn_RPeriod(org.joda.time.TestMinutes)  Time elapsed: 0.001 sec  <<< ERROR!
java.lang.NullPointerException
	at org.joda.time.base.BaseSingleFieldPeriod.standardPeriodIn(BaseSingleFieldPeriod.java:139)
	at org.joda.time.Minutes.standardMinutesIn(Minutes.java:165)
	at org.joda.time.TestMinutes.testFactory_standardMinutesIn_RPeriod(TestMinutes.java:117)

testAddToLocalDate(org.joda.time.TestMinutes)  Time elapsed: 0 sec  <<< ERROR!
java.lang.NullPointerException
	at org.joda.time.chrono.BaseChronology.add(BaseChronology.java:307)
	at org.joda.time.LocalDateTime.withPeriodAdded(LocalDateTime.java:1062)
	at org.joda.time.LocalDateTime.plus(LocalDateTime.java:1094)
	at org.joda.time.TestMinutes.testAddToLocalDate(TestMinutes.java:377)

testCompareTo(org.joda.time.TestTimeOfDay_Basics)  Time elapsed: 0 sec  <<< ERROR!
java.lang.NullPointerException
	at org.joda.time.Partial.<init>(Partial.java:221)
	at org.joda.time.Partial.<init>(Partial.java:177)
	at org.joda.time.TestTimeOfDay_Basics.testCompareTo(TestTimeOfDay_Basics.java:263)

testPropertyGetMinute(org.joda.time.TestTimeOfDay_Properties)  Time elapsed: 0 sec  <<< FAILURE!
junit.framework.AssertionFailedError: expected:<null> but was:<DurationField[minutes]>
	at junit.framework.Assert.fail(Assert.java:47)
	at junit.framework.Assert.failNotEquals(Assert.java:280)
	at junit.framework.Assert.assertEquals(Assert.java:64)
	at junit.framework.Assert.assertEquals(Assert.java:71)
	at org.joda.time.TestTimeOfDay_Properties.testPropertyGetMinute(TestTimeOfDay_Properties.java:245)

testPropertyGetSecond(org.joda.time.TestTimeOfDay_Properties)  Time elapsed: 0 sec  <<< FAILURE!
junit.framework.AssertionFailedError: expected:<null> but was:<DurationField[minutes]>
	at junit.framework.Assert.fail(Assert.java:47)
	at junit.framework.Assert.failNotEquals(Assert.java:280)
	at junit.framework.Assert.assertEquals(Assert.java:64)
	at junit.framework.Assert.assertEquals(Assert.java:71)
	at org.joda.time.TestTimeOfDay_Properties.testPropertyGetSecond(TestTimeOfDay_Properties.java:418)

testEqualsHashCode(org.joda.time.TestPartial_Basics)  Time elapsed: 0 sec  <<< ERROR!
java.lang.NullPointerException
	at org.joda.time.Partial.<init>(Partial.java:221)
	at org.joda.time.TestPartial_Basics.createHourMinPartial(TestPartial_Basics.java:911)
	at org.joda.time.TestPartial_Basics.createHourMinPartial(TestPartial_Basics.java:903)
	at org.joda.time.TestPartial_Basics.testEqualsHashCode(TestPartial_Basics.java:184)

testCompareTo(org.joda.time.TestPartial_Basics)  Time elapsed: 0 sec  <<< ERROR!
java.lang.NullPointerException
	at org.joda.time.Partial.<init>(Partial.java:221)
	at org.joda.time.TestPartial_Basics.createHourMinPartial(TestPartial_Basics.java:911)
	at org.joda.time.TestPartial_Basics.createHourMinPartial(TestPartial_Basics.java:903)
	at org.joda.time.TestPartial_Basics.createHourMinPartial(TestPartial_Basics.java:899)
	at org.joda.time.TestPartial_Basics.testCompareTo(TestPartial_Basics.java:210)

testToString_String(org.joda.time.TestPartial_Basics)  Time elapsed: 0.001 sec  <<< ERROR!
java.lang.NullPointerException
	at org.joda.time.Partial.<init>(Partial.java:221)
	at org.joda.time.TestPartial_Basics.createHourMinPartial(TestPartial_Basics.java:911)
	at org.joda.time.TestPartial_Basics.createHourMinPartial(TestPartial_Basics.java:903)
	at org.joda.time.TestPartial_Basics.createHourMinPartial(TestPartial_Basics.java:899)
	at org.joda.time.TestPartial_Basics.testToString_String(TestPartial_Basics.java:876)

testToString_String_Locale(org.joda.time.TestPartial_Basics)  Time elapsed: 0 sec  <<< ERROR!
java.lang.NullPointerException
	at org.joda.time.Partial.<init>(Partial.java:221)
	at org.joda.time.TestPartial_Basics.createHourMinPartial(TestPartial_Basics.java:911)
	at org.joda.time.TestPartial_Basics.createHourMinPartial(TestPartial_Basics.java:903)
	at org.joda.time.TestPartial_Basics.createHourMinPartial(TestPartial_Basics.java:899)
	at org.joda.time.TestPartial_Basics.testToString_String_Locale(TestPartial_Basics.java:883)

testToString_DTFormatter(org.joda.time.TestPartial_Basics)  Time elapsed: 0.001 sec  <<< ERROR!
java.lang.NullPointerException
	at org.joda.time.Partial.<init>(Partial.java:221)
	at org.joda.time.TestPartial_Basics.createHourMinPartial(TestPartial_Basics.java:911)
	at org.joda.time.TestPartial_Basics.createHourMinPartial(TestPartial_Basics.java:903)
	at org.joda.time.TestPartial_Basics.createHourMinPartial(TestPartial_Basics.java:899)
	at org.joda.time.TestPartial_Basics.testToString_DTFormatter(TestPartial_Basics.java:892)

testSerialization(org.joda.time.TestPartial_Basics)  Time elapsed: 0 sec  <<< ERROR!
java.lang.NullPointerException
	at org.joda.time.Partial.<init>(Partial.java:221)
	at org.joda.time.TestPartial_Basics.createHourMinPartial(TestPartial_Basics.java:911)
	at org.joda.time.TestPartial_Basics.createHourMinPartial(TestPartial_Basics.java:903)
	at org.joda.time.TestPartial_Basics.testSerialization(TestPartial_Basics.java:779)

testWithField1(org.joda.time.TestPartial_Basics)  Time elapsed: 0.001 sec  <<< ERROR!
java.lang.NullPointerException
	at org.joda.time.Partial.<init>(Partial.java:221)
	at org.joda.time.TestPartial_Basics.createHourMinPartial(TestPartial_Basics.java:911)
	at org.joda.time.TestPartial_Basics.createHourMinPartial(TestPartial_Basics.java:903)
	at org.joda.time.TestPartial_Basics.createHourMinPartial(TestPartial_Basics.java:899)
	at org.joda.time.TestPartial_Basics.testWithField1(TestPartial_Basics.java:519)

testWithField2(org.joda.time.TestPartial_Basics)  Time elapsed: 0 sec  <<< ERROR!
java.lang.NullPointerException
	at org.joda.time.Partial.<init>(Partial.java:221)
	at org.joda.time.TestPartial_Basics.createHourMinPartial(TestPartial_Basics.java:911)
	at org.joda.time.TestPartial_Basics.createHourMinPartial(TestPartial_Basics.java:903)
	at org.joda.time.TestPartial_Basics.createHourMinPartial(TestPartial_Basics.java:899)
	at org.joda.time.TestPartial_Basics.testWithField2(TestPartial_Basics.java:526)

testWithFieldAdded1(org.joda.time.TestPartial_Basics)  Time elapsed: 0.001 sec  <<< ERROR!
java.lang.NullPointerException
	at org.joda.time.Partial.<init>(Partial.java:221)
	at org.joda.time.TestPartial_Basics.createHourMinPartial(TestPartial_Basics.java:911)
	at org.joda.time.TestPartial_Basics.createHourMinPartial(TestPartial_Basics.java:903)
	at org.joda.time.TestPartial_Basics.createHourMinPartial(TestPartial_Basics.java:899)
	at org.joda.time.TestPartial_Basics.testWithFieldAdded1(TestPartial_Basics.java:551)

testWithFieldAdded2(org.joda.time.TestPartial_Basics)  Time elapsed: 0 sec  <<< ERROR!
java.lang.NullPointerException
	at org.joda.time.Partial.<init>(Partial.java:221)
	at org.joda.time.TestPartial_Basics.createHourMinPartial(TestPartial_Basics.java:911)
	at org.joda.time.TestPartial_Basics.createHourMinPartial(TestPartial_Basics.java:903)
	at org.joda.time.TestPartial_Basics.createHourMinPartial(TestPartial_Basics.java:899)
	at org.joda.time.TestPartial_Basics.testWithFieldAdded2(TestPartial_Basics.java:560)

testWithFieldAdded3(org.joda.time.TestPartial_Basics)  Time elapsed: 0.001 sec  <<< ERROR!
java.lang.NullPointerException
	at org.joda.time.Partial.<init>(Partial.java:221)
	at org.joda.time.TestPartial_Basics.createHourMinPartial(TestPartial_Basics.java:911)
	at org.joda.time.TestPartial_Basics.createHourMinPartial(TestPartial_Basics.java:903)
	at org.joda.time.TestPartial_Basics.createHourMinPartial(TestPartial_Basics.java:899)
	at org.joda.time.TestPartial_Basics.testWithFieldAdded3(TestPartial_Basics.java:569)

testWithFieldAdded4(org.joda.time.TestPartial_Basics)  Time elapsed: 0 sec  <<< ERROR!
java.lang.NullPointerException
	at org.joda.time.Partial.<init>(Partial.java:221)
	at org.joda.time.TestPartial_Basics.createHourMinPartial(TestPartial_Basics.java:911)
	at org.joda.time.TestPartial_Basics.createHourMinPartial(TestPartial_Basics.java:903)
	at org.joda.time.TestPartial_Basics.createHourMinPartial(TestPartial_Basics.java:899)
	at org.joda.time.TestPartial_Basics.testWithFieldAdded4(TestPartial_Basics.java:578)

testPlus_RP(org.joda.time.TestPartial_Basics)  Time elapsed: 0 sec  <<< ERROR!
java.lang.NullPointerException
	at org.joda.time.Partial.<init>(Partial.java:221)
	at org.joda.time.TestPartial_Basics.createHourMinPartial(TestPartial_Basics.java:911)
	at org.joda.time.TestPartial_Basics.createHourMinPartial(TestPartial_Basics.java:903)
	at org.joda.time.TestPartial_Basics.testPlus_RP(TestPartial_Basics.java:721)

testMinus_RP(org.joda.time.TestPartial_Basics)  Time elapsed: 0.001 sec  <<< ERROR!
java.lang.NullPointerException
	at org.joda.time.Partial.<init>(Partial.java:221)
	at org.joda.time.TestPartial_Basics.createHourMinPartial(TestPartial_Basics.java:911)
	at org.joda.time.TestPartial_Basics.createHourMinPartial(TestPartial_Basics.java:903)
	at org.joda.time.TestPartial_Basics.testMinus_RP(TestPartial_Basics.java:732)

testProperty(org.joda.time.TestPartial_Basics)  Time elapsed: 0 sec  <<< ERROR!
java.lang.NullPointerException
	at org.joda.time.Partial.<init>(Partial.java:221)
	at org.joda.time.TestPartial_Basics.createHourMinPartial(TestPartial_Basics.java:911)
	at org.joda.time.TestPartial_Basics.createHourMinPartial(TestPartial_Basics.java:903)
	at org.joda.time.TestPartial_Basics.createHourMinPartial(TestPartial_Basics.java:899)
	at org.joda.time.TestPartial_Basics.testProperty(TestPartial_Basics.java:764)

testIsSupported(org.joda.time.TestPartial_Basics)  Time elapsed: 0.001 sec  <<< ERROR!
java.lang.NullPointerException
	at org.joda.time.Partial.<init>(Partial.java:221)
	at org.joda.time.TestPartial_Basics.createHourMinPartial(TestPartial_Basics.java:911)
	at org.joda.time.TestPartial_Basics.createHourMinPartial(TestPartial_Basics.java:903)
	at org.joda.time.TestPartial_Basics.testIsSupported(TestPartial_Basics.java:174)

testWithFieldAdded6(org.joda.time.TestPartial_Basics)  Time elapsed: 0 sec  <<< ERROR!
java.lang.NullPointerException
	at org.joda.time.Partial.<init>(Partial.java:221)
	at org.joda.time.TestPartial_Basics.createHourMinPartial(TestPartial_Basics.java:911)
	at org.joda.time.TestPartial_Basics.createHourMinPartial(TestPartial_Basics.java:903)
	at org.joda.time.TestPartial_Basics.createHourMinPartial(TestPartial_Basics.java:899)
	at org.joda.time.TestPartial_Basics.testWithFieldAdded6(TestPartial_Basics.java:593)

testWithFieldAdded7(org.joda.time.TestPartial_Basics)  Time elapsed: 0.001 sec  <<< ERROR!
java.lang.NullPointerException
	at org.joda.time.Partial.<init>(Partial.java:221)
	at org.joda.time.TestPartial_Basics.createHourMinPartial(TestPartial_Basics.java:911)
	at org.joda.time.TestPartial_Basics.testWithFieldAdded7(TestPartial_Basics.java:604)

testWithFieldAdded8(org.joda.time.TestPartial_Basics)  Time elapsed: 0 sec  <<< ERROR!
java.lang.NullPointerException
	at org.joda.time.Partial.<init>(Partial.java:221)
	at org.joda.time.TestPartial_Basics.createHourMinPartial(TestPartial_Basics.java:911)
	at org.joda.time.TestPartial_Basics.testWithFieldAdded8(TestPartial_Basics.java:624)

testIsBefore_TOD(org.joda.time.TestPartial_Basics)  Time elapsed: 0.001 sec  <<< ERROR!
java.lang.NullPointerException
	at org.joda.time.Partial.<init>(Partial.java:221)
	at org.joda.time.TestPartial_Basics.createHourMinPartial(TestPartial_Basics.java:911)
	at org.joda.time.TestPartial_Basics.createHourMinPartial(TestPartial_Basics.java:903)
	at org.joda.time.TestPartial_Basics.createHourMinPartial(TestPartial_Basics.java:899)
	at org.joda.time.TestPartial_Basics.testIsBefore_TOD(TestPartial_Basics.java:272)

testIsAfter_TOD(org.joda.time.TestPartial_Basics)  Time elapsed: 0 sec  <<< ERROR!
java.lang.NullPointerException
	at org.joda.time.Partial.<init>(Partial.java:221)
	at org.joda.time.TestPartial_Basics.createHourMinPartial(TestPartial_Basics.java:911)
	at org.joda.time.TestPartial_Basics.createHourMinPartial(TestPartial_Basics.java:903)
	at org.joda.time.TestPartial_Basics.createHourMinPartial(TestPartial_Basics.java:899)
	at org.joda.time.TestPartial_Basics.testIsAfter_TOD(TestPartial_Basics.java:296)

testWithChronologyRetainFields_Chrono(org.joda.time.TestPartial_Basics)  Time elapsed: 0.001 sec  <<< ERROR!
java.lang.NullPointerException
	at org.joda.time.Partial.<init>(Partial.java:221)
	at org.joda.time.TestPartial_Basics.createHourMinPartial(TestPartial_Basics.java:911)
	at org.joda.time.TestPartial_Basics.createHourMinPartial(TestPartial_Basics.java:903)
	at org.joda.time.TestPartial_Basics.testWithChronologyRetainFields_Chrono(TestPartial_Basics.java:320)

testWithChronologyRetainFields_sameChrono(org.joda.time.TestPartial_Basics)  Time elapsed: 0 sec  <<< ERROR!
java.lang.NullPointerException
	at org.joda.time.Partial.<init>(Partial.java:221)
	at org.joda.time.TestPartial_Basics.createHourMinPartial(TestPartial_Basics.java:911)
	at org.joda.time.TestPartial_Basics.createHourMinPartial(TestPartial_Basics.java:903)
	at org.joda.time.TestPartial_Basics.testWithChronologyRetainFields_sameChrono(TestPartial_Basics.java:329)

testWithChronologyRetainFields_nullChrono(org.joda.time.TestPartial_Basics)  Time elapsed: 0.001 sec  <<< ERROR!
java.lang.NullPointerException
	at org.joda.time.Partial.<init>(Partial.java:221)
	at org.joda.time.TestPartial_Basics.createHourMinPartial(TestPartial_Basics.java:911)
	at org.joda.time.TestPartial_Basics.createHourMinPartial(TestPartial_Basics.java:903)
	at org.joda.time.TestPartial_Basics.testWithChronologyRetainFields_nullChrono(TestPartial_Basics.java:335)

testWithFieldAdded5(org.joda.time.TestPartial_Basics)  Time elapsed: 0 sec  <<< ERROR!
java.lang.NullPointerException
	at org.joda.time.Partial.<init>(Partial.java:221)
	at org.joda.time.TestPartial_Basics.createHourMinPartial(TestPartial_Basics.java:911)
	at org.joda.time.TestPartial_Basics.createHourMinPartial(TestPartial_Basics.java:903)
	at org.joda.time.TestPartial_Basics.createHourMinPartial(TestPartial_Basics.java:899)
	at org.joda.time.TestPartial_Basics.testWithFieldAdded5(TestPartial_Basics.java:584)

testGetField(org.joda.time.TestPartial_Basics)  Time elapsed: 0.001 sec  <<< ERROR!
java.lang.NullPointerException
	at org.joda.time.Partial.<init>(Partial.java:221)
	at org.joda.time.TestPartial_Basics.createHourMinPartial(TestPartial_Basics.java:911)
	at org.joda.time.TestPartial_Basics.createHourMinPartial(TestPartial_Basics.java:903)
	at org.joda.time.TestPartial_Basics.testGetField(TestPartial_Basics.java:132)

testGetValue(org.joda.time.TestPartial_Basics)  Time elapsed: 0 sec  <<< ERROR!
java.lang.NullPointerException
	at org.joda.time.Partial.<init>(Partial.java:221)
	at org.joda.time.TestPartial_Basics.createHourMinPartial(TestPartial_Basics.java:911)
	at org.joda.time.TestPartial_Basics.createHourMinPartial(TestPartial_Basics.java:903)
	at org.joda.time.TestPartial_Basics.testGetValue(TestPartial_Basics.java:153)

testIsEqual_TOD(org.joda.time.TestPartial_Basics)  Time elapsed: 0 sec  <<< ERROR!
java.lang.NullPointerException
	at org.joda.time.Partial.<init>(Partial.java:221)
	at org.joda.time.TestPartial_Basics.createHourMinPartial(TestPartial_Basics.java:911)
	at org.joda.time.TestPartial_Basics.createHourMinPartial(TestPartial_Basics.java:903)
	at org.joda.time.TestPartial_Basics.createHourMinPartial(TestPartial_Basics.java:899)
	at org.joda.time.TestPartial_Basics.testIsEqual_TOD(TestPartial_Basics.java:248)

testGet(org.joda.time.TestPartial_Basics)  Time elapsed: 0.001 sec  <<< ERROR!
java.lang.NullPointerException
	at org.joda.time.Partial.<init>(Partial.java:221)
	at org.joda.time.TestPartial_Basics.createHourMinPartial(TestPartial_Basics.java:911)
	at org.joda.time.TestPartial_Basics.createHourMinPartial(TestPartial_Basics.java:903)
	at org.joda.time.TestPartial_Basics.createHourMinPartial(TestPartial_Basics.java:899)
	at org.joda.time.TestPartial_Basics.testGet(TestPartial_Basics.java:92)

testToDateTime_RI(org.joda.time.TestPartial_Basics)  Time elapsed: 0 sec  <<< ERROR!
java.lang.NullPointerException
	at org.joda.time.Partial.<init>(Partial.java:221)
	at org.joda.time.TestPartial_Basics.createHourMinPartial(TestPartial_Basics.java:911)
	at org.joda.time.TestPartial_Basics.createHourMinPartial(TestPartial_Basics.java:903)
	at org.joda.time.TestPartial_Basics.testToDateTime_RI(TestPartial_Basics.java:743)

testToDateTime_nullRI(org.joda.time.TestPartial_Basics)  Time elapsed: 0.001 sec  <<< ERROR!
java.lang.NullPointerException
	at org.joda.time.Partial.<init>(Partial.java:221)
	at org.joda.time.TestPartial_Basics.createHourMinPartial(TestPartial_Basics.java:911)
	at org.joda.time.TestPartial_Basics.testToDateTime_nullRI(TestPartial_Basics.java:754)

testSize(org.joda.time.TestPartial_Basics)  Time elapsed: 0.001 sec  <<< ERROR!
java.lang.NullPointerException
	at org.joda.time.Partial.<init>(Partial.java:221)
	at org.joda.time.TestPartial_Basics.createHourMinPartial(TestPartial_Basics.java:911)
	at org.joda.time.TestPartial_Basics.createHourMinPartial(TestPartial_Basics.java:903)
	at org.joda.time.TestPartial_Basics.createHourMinPartial(TestPartial_Basics.java:899)
	at org.joda.time.TestPartial_Basics.testSize(TestPartial_Basics.java:106)

testGetFieldTypes(org.joda.time.TestPartial_Basics)  Time elapsed: 0 sec  <<< ERROR!
java.lang.NullPointerException
	at org.joda.time.Partial.<init>(Partial.java:221)
	at org.joda.time.TestPartial_Basics.createHourMinPartial(TestPartial_Basics.java:911)
	at org.joda.time.TestPartial_Basics.createHourMinPartial(TestPartial_Basics.java:903)
	at org.joda.time.TestPartial_Basics.createHourMinPartial(TestPartial_Basics.java:899)
	at org.joda.time.TestPartial_Basics.testGetFieldTypes(TestPartial_Basics.java:123)

testGetFields(org.joda.time.TestPartial_Basics)  Time elapsed: 0.001 sec  <<< ERROR!
java.lang.NullPointerException
	at org.joda.time.Partial.<init>(Partial.java:221)
	at org.joda.time.TestPartial_Basics.createHourMinPartial(TestPartial_Basics.java:911)
	at org.joda.time.TestPartial_Basics.createHourMinPartial(TestPartial_Basics.java:903)
	at org.joda.time.TestPartial_Basics.testGetFields(TestPartial_Basics.java:144)

testGetValues(org.joda.time.TestPartial_Basics)  Time elapsed: 0 sec  <<< ERROR!
java.lang.NullPointerException
	at org.joda.time.Partial.<init>(Partial.java:221)
	at org.joda.time.TestPartial_Basics.createHourMinPartial(TestPartial_Basics.java:911)
	at org.joda.time.TestPartial_Basics.createHourMinPartial(TestPartial_Basics.java:903)
	at org.joda.time.TestPartial_Basics.testGetValues(TestPartial_Basics.java:165)

testToString1(org.joda.time.TestPartial_Basics)  Time elapsed: 0 sec  <<< ERROR!
java.lang.NullPointerException
	at org.joda.time.Partial.<init>(Partial.java:221)
	at org.joda.time.TestPartial_Basics.createHourMinPartial(TestPartial_Basics.java:911)
	at org.joda.time.TestPartial_Basics.createHourMinPartial(TestPartial_Basics.java:903)
	at org.joda.time.TestPartial_Basics.createHourMinPartial(TestPartial_Basics.java:899)
	at org.joda.time.TestPartial_Basics.testToString1(TestPartial_Basics.java:835)

testWithFieldAddWrapped1(org.joda.time.TestPartial_Basics)  Time elapsed: 0 sec  <<< ERROR!
java.lang.NullPointerException
	at org.joda.time.Partial.<init>(Partial.java:221)
	at org.joda.time.TestPartial_Basics.createHourMinPartial(TestPartial_Basics.java:911)
	at org.joda.time.TestPartial_Basics.createHourMinPartial(TestPartial_Basics.java:903)
	at org.joda.time.TestPartial_Basics.createHourMinPartial(TestPartial_Basics.java:899)
	at org.joda.time.TestPartial_Basics.testWithFieldAddWrapped1(TestPartial_Basics.java:645)

testWithFieldAddWrapped2(org.joda.time.TestPartial_Basics)  Time elapsed: 0.001 sec  <<< ERROR!
java.lang.NullPointerException
	at org.joda.time.Partial.<init>(Partial.java:221)
	at org.joda.time.TestPartial_Basics.createHourMinPartial(TestPartial_Basics.java:911)
	at org.joda.time.TestPartial_Basics.createHourMinPartial(TestPartial_Basics.java:903)
	at org.joda.time.TestPartial_Basics.createHourMinPartial(TestPartial_Basics.java:899)
	at org.joda.time.TestPartial_Basics.testWithFieldAddWrapped2(TestPartial_Basics.java:654)

testWithFieldAddWrapped3(org.joda.time.TestPartial_Basics)  Time elapsed: 0 sec  <<< ERROR!
java.lang.NullPointerException
	at org.joda.time.Partial.<init>(Partial.java:221)
	at org.joda.time.TestPartial_Basics.createHourMinPartial(TestPartial_Basics.java:911)
	at org.joda.time.TestPartial_Basics.createHourMinPartial(TestPartial_Basics.java:903)
	at org.joda.time.TestPartial_Basics.createHourMinPartial(TestPartial_Basics.java:899)
	at org.joda.time.TestPartial_Basics.testWithFieldAddWrapped3(TestPartial_Basics.java:663)

testWithFieldAddWrapped4(org.joda.time.TestPartial_Basics)  Time elapsed: 0.001 sec  <<< ERROR!
java.lang.NullPointerException
	at org.joda.time.Partial.<init>(Partial.java:221)
	at org.joda.time.TestPartial_Basics.createHourMinPartial(TestPartial_Basics.java:911)
	at org.joda.time.TestPartial_Basics.createHourMinPartial(TestPartial_Basics.java:903)
	at org.joda.time.TestPartial_Basics.createHourMinPartial(TestPartial_Basics.java:899)
	at org.joda.time.TestPartial_Basics.testWithFieldAddWrapped4(TestPartial_Basics.java:672)

testWithFieldAddWrapped5(org.joda.time.TestPartial_Basics)  Time elapsed: 0.001 sec  <<< ERROR!
java.lang.NullPointerException
	at org.joda.time.Partial.<init>(Partial.java:221)
	at org.joda.time.TestPartial_Basics.createHourMinPartial(TestPartial_Basics.java:911)
	at org.joda.time.TestPartial_Basics.createHourMinPartial(TestPartial_Basics.java:903)
	at org.joda.time.TestPartial_Basics.createHourMinPartial(TestPartial_Basics.java:899)
	at org.joda.time.TestPartial_Basics.testWithFieldAddWrapped5(TestPartial_Basics.java:678)

testWithFieldAddWrapped6(org.joda.time.TestPartial_Basics)  Time elapsed: 0 sec  <<< ERROR!
java.lang.NullPointerException
	at org.joda.time.Partial.<init>(Partial.java:221)
	at org.joda.time.TestPartial_Basics.createHourMinPartial(TestPartial_Basics.java:911)
	at org.joda.time.TestPartial_Basics.createHourMinPartial(TestPartial_Basics.java:903)
	at org.joda.time.TestPartial_Basics.createHourMinPartial(TestPartial_Basics.java:899)
	at org.joda.time.TestPartial_Basics.testWithFieldAddWrapped6(TestPartial_Basics.java:687)

testWithFieldAddWrapped7(org.joda.time.TestPartial_Basics)  Time elapsed: 0.001 sec  <<< ERROR!
java.lang.NullPointerException
	at org.joda.time.Partial.<init>(Partial.java:221)
	at org.joda.time.TestPartial_Basics.createHourMinPartial(TestPartial_Basics.java:911)
	at org.joda.time.TestPartial_Basics.testWithFieldAddWrapped7(TestPartial_Basics.java:696)

testWithFieldAddWrapped8(org.joda.time.TestPartial_Basics)  Time elapsed: 0 sec  <<< ERROR!
java.lang.NullPointerException
	at org.joda.time.Partial.<init>(Partial.java:221)
	at org.joda.time.TestPartial_Basics.createHourMinPartial(TestPartial_Basics.java:911)
	at org.joda.time.TestPartial_Basics.testWithFieldAddWrapped8(TestPartial_Basics.java:708)

testWith4(org.joda.time.TestPartial_Basics)  Time elapsed: 0 sec  <<< ERROR!
java.lang.NullPointerException
	at org.joda.time.Partial.<init>(Partial.java:221)
	at org.joda.time.TestPartial_Basics.createHourMinPartial(TestPartial_Basics.java:911)
	at org.joda.time.TestPartial_Basics.createHourMinPartial(TestPartial_Basics.java:903)
	at org.joda.time.TestPartial_Basics.createHourMinPartial(TestPartial_Basics.java:899)
	at org.joda.time.TestPartial_Basics.testWith4(TestPartial_Basics.java:446)

testWithout1(org.joda.time.TestPartial_Basics)  Time elapsed: 0 sec  <<< ERROR!
java.lang.NullPointerException
	at org.joda.time.Partial.<init>(Partial.java:221)
	at org.joda.time.TestPartial_Basics.createHourMinPartial(TestPartial_Basics.java:911)
	at org.joda.time.TestPartial_Basics.createHourMinPartial(TestPartial_Basics.java:903)
	at org.joda.time.TestPartial_Basics.createHourMinPartial(TestPartial_Basics.java:899)
	at org.joda.time.TestPartial_Basics.testWithout1(TestPartial_Basics.java:477)

testWithout2(org.joda.time.TestPartial_Basics)  Time elapsed: 0.001 sec  <<< ERROR!
java.lang.NullPointerException
	at org.joda.time.Partial.<init>(Partial.java:221)
	at org.joda.time.TestPartial_Basics.createHourMinPartial(TestPartial_Basics.java:911)
	at org.joda.time.TestPartial_Basics.createHourMinPartial(TestPartial_Basics.java:903)
	at org.joda.time.TestPartial_Basics.createHourMinPartial(TestPartial_Basics.java:899)
	at org.joda.time.TestPartial_Basics.testWithout2(TestPartial_Basics.java:484)

testWithout3(org.joda.time.TestPartial_Basics)  Time elapsed: 0 sec  <<< ERROR!
java.lang.NullPointerException
	at org.joda.time.Partial.<init>(Partial.java:221)
	at org.joda.time.TestPartial_Basics.createHourMinPartial(TestPartial_Basics.java:911)
	at org.joda.time.TestPartial_Basics.createHourMinPartial(TestPartial_Basics.java:903)
	at org.joda.time.TestPartial_Basics.createHourMinPartial(TestPartial_Basics.java:899)
	at org.joda.time.TestPartial_Basics.testWithout3(TestPartial_Basics.java:491)

testWithout4(org.joda.time.TestPartial_Basics)  Time elapsed: 0.001 sec  <<< ERROR!
java.lang.NullPointerException
	at org.joda.time.Partial.<init>(Partial.java:221)
	at org.joda.time.TestPartial_Basics.createHourMinPartial(TestPartial_Basics.java:911)
	at org.joda.time.TestPartial_Basics.createHourMinPartial(TestPartial_Basics.java:903)
	at org.joda.time.TestPartial_Basics.createHourMinPartial(TestPartial_Basics.java:899)
	at org.joda.time.TestPartial_Basics.testWithout4(TestPartial_Basics.java:501)

testWith1(org.joda.time.TestPartial_Basics)  Time elapsed: 0 sec  <<< ERROR!
java.lang.NullPointerException
	at org.joda.time.Partial.<init>(Partial.java:221)
	at org.joda.time.TestPartial_Basics.createHourMinPartial(TestPartial_Basics.java:911)
	at org.joda.time.TestPartial_Basics.createHourMinPartial(TestPartial_Basics.java:903)
	at org.joda.time.TestPartial_Basics.createHourMinPartial(TestPartial_Basics.java:899)
	at org.joda.time.TestPartial_Basics.testWith1(TestPartial_Basics.java:345)

testWith2(org.joda.time.TestPartial_Basics)  Time elapsed: 0.001 sec  <<< ERROR!
java.lang.NullPointerException
	at org.joda.time.Partial.<init>(Partial.java:221)
	at org.joda.time.TestPartial_Basics.createHourMinPartial(TestPartial_Basics.java:911)
	at org.joda.time.TestPartial_Basics.createHourMinPartial(TestPartial_Basics.java:903)
	at org.joda.time.TestPartial_Basics.createHourMinPartial(TestPartial_Basics.java:899)
	at org.joda.time.TestPartial_Basics.testWith2(TestPartial_Basics.java:352)

testWith3(org.joda.time.TestPartial_Basics)  Time elapsed: 0 sec  <<< ERROR!
java.lang.NullPointerException
	at org.joda.time.Partial.<init>(Partial.java:221)
	at org.joda.time.TestPartial_Basics.createHourMinPartial(TestPartial_Basics.java:911)
	at org.joda.time.TestPartial_Basics.createHourMinPartial(TestPartial_Basics.java:903)
	at org.joda.time.TestPartial_Basics.createHourMinPartial(TestPartial_Basics.java:899)
	at org.joda.time.TestPartial_Basics.testWith3(TestPartial_Basics.java:361)

testWith3a(org.joda.time.TestPartial_Basics)  Time elapsed: 0.001 sec  <<< ERROR!
java.lang.NullPointerException
	at org.joda.time.Partial.<init>(Partial.java:221)
	at org.joda.time.TestPartial_Basics.createHourMinPartial(TestPartial_Basics.java:911)
	at org.joda.time.TestPartial_Basics.createHourMinPartial(TestPartial_Basics.java:903)
	at org.joda.time.TestPartial_Basics.createHourMinPartial(TestPartial_Basics.java:899)
	at org.joda.time.TestPartial_Basics.testWith3a(TestPartial_Basics.java:370)

testWith3b(org.joda.time.TestPartial_Basics)  Time elapsed: 0 sec  <<< ERROR!
java.lang.NullPointerException
	at org.joda.time.Partial.<init>(Partial.java:221)
	at org.joda.time.TestPartial_Basics.createHourMinPartial(TestPartial_Basics.java:911)
	at org.joda.time.TestPartial_Basics.createHourMinPartial(TestPartial_Basics.java:903)
	at org.joda.time.TestPartial_Basics.createHourMinPartial(TestPartial_Basics.java:899)
	at org.joda.time.TestPartial_Basics.testWith3b(TestPartial_Basics.java:386)

testWith3c(org.joda.time.TestPartial_Basics)  Time elapsed: 0.001 sec  <<< ERROR!
java.lang.NullPointerException
	at org.joda.time.Partial.<init>(Partial.java:221)
	at org.joda.time.TestPartial_Basics.createHourMinPartial(TestPartial_Basics.java:911)
	at org.joda.time.TestPartial_Basics.createHourMinPartial(TestPartial_Basics.java:903)
	at org.joda.time.TestPartial_Basics.createHourMinPartial(TestPartial_Basics.java:899)
	at org.joda.time.TestPartial_Basics.testWith3c(TestPartial_Basics.java:402)

testWithField3(org.joda.time.TestPartial_Basics)  Time elapsed: 0 sec  <<< ERROR!
java.lang.NullPointerException
	at org.joda.time.Partial.<init>(Partial.java:221)
	at org.joda.time.TestPartial_Basics.createHourMinPartial(TestPartial_Basics.java:911)
	at org.joda.time.TestPartial_Basics.createHourMinPartial(TestPartial_Basics.java:903)
	at org.joda.time.TestPartial_Basics.createHourMinPartial(TestPartial_Basics.java:899)
	at org.joda.time.TestPartial_Basics.testWithField3(TestPartial_Basics.java:535)

testWithField4(org.joda.time.TestPartial_Basics)  Time elapsed: 0.001 sec  <<< ERROR!
java.lang.NullPointerException
	at org.joda.time.Partial.<init>(Partial.java:221)
	at org.joda.time.TestPartial_Basics.createHourMinPartial(TestPartial_Basics.java:911)
	at org.joda.time.TestPartial_Basics.createHourMinPartial(TestPartial_Basics.java:903)
	at org.joda.time.TestPartial_Basics.createHourMinPartial(TestPartial_Basics.java:899)
	at org.joda.time.TestPartial_Basics.testWithField4(TestPartial_Basics.java:544)

testGetFieldType(org.joda.time.TestPartial_Basics)  Time elapsed: 0 sec  <<< ERROR!
java.lang.NullPointerException
	at org.joda.time.Partial.<init>(Partial.java:221)
	at org.joda.time.TestPartial_Basics.createHourMinPartial(TestPartial_Basics.java:911)
	at org.joda.time.TestPartial_Basics.createHourMinPartial(TestPartial_Basics.java:903)
	at org.joda.time.TestPartial_Basics.createHourMinPartial(TestPartial_Basics.java:899)
	at org.joda.time.TestPartial_Basics.testGetFieldType(TestPartial_Basics.java:111)

testPropertyGetHour(org.joda.time.TestPartial_Properties)  Time elapsed: 0.001 sec  <<< ERROR!
java.lang.NullPointerException
	at org.joda.time.Partial.<init>(Partial.java:221)
	at org.joda.time.Partial.<init>(Partial.java:177)
	at org.joda.time.TestPartial_Properties.testPropertyGetHour(TestPartial_Properties.java:86)

testPropertyGetMaxMinValuesHour(org.joda.time.TestPartial_Properties)  Time elapsed: 0.001 sec  <<< ERROR!
java.lang.NullPointerException
	at org.joda.time.Partial.<init>(Partial.java:221)
	at org.joda.time.Partial.<init>(Partial.java:177)
	at org.joda.time.TestPartial_Properties.testPropertyGetMaxMinValuesHour(TestPartial_Properties.java:105)

testPropertySetHour(org.joda.time.TestPartial_Properties)  Time elapsed: 0 sec  <<< ERROR!
java.lang.NullPointerException
	at org.joda.time.Partial.<init>(Partial.java:221)
	at org.joda.time.Partial.<init>(Partial.java:177)
	at org.joda.time.TestPartial_Properties.testPropertySetHour(TestPartial_Properties.java:179)

testPropertySetTextHour(org.joda.time.TestPartial_Properties)  Time elapsed: 0.001 sec  <<< ERROR!
java.lang.NullPointerException
	at org.joda.time.Partial.<init>(Partial.java:221)
	at org.joda.time.Partial.<init>(Partial.java:177)
	at org.joda.time.TestPartial_Properties.testPropertySetTextHour(TestPartial_Properties.java:195)

testPropertyWithMaximumValueHour(org.joda.time.TestPartial_Properties)  Time elapsed: 0 sec  <<< ERROR!
java.lang.NullPointerException
	at org.joda.time.Partial.<init>(Partial.java:221)
	at org.joda.time.Partial.<init>(Partial.java:177)
	at org.joda.time.TestPartial_Properties.testPropertyWithMaximumValueHour(TestPartial_Properties.java:202)

testPropertyWithMinimumValueHour(org.joda.time.TestPartial_Properties)  Time elapsed: 0 sec  <<< ERROR!
java.lang.NullPointerException
	at org.joda.time.Partial.<init>(Partial.java:221)
	at org.joda.time.Partial.<init>(Partial.java:177)
	at org.joda.time.TestPartial_Properties.testPropertyWithMinimumValueHour(TestPartial_Properties.java:209)

testPropertyCompareToHour(org.joda.time.TestPartial_Properties)  Time elapsed: 0.001 sec  <<< ERROR!
java.lang.NullPointerException
	at org.joda.time.Partial.<init>(Partial.java:221)
	at org.joda.time.Partial.<init>(Partial.java:177)
	at org.joda.time.TestPartial_Properties.testPropertyCompareToHour(TestPartial_Properties.java:216)

testPropertyGetMinute(org.joda.time.TestPartial_Properties)  Time elapsed: 0.002 sec  <<< ERROR!
java.lang.NullPointerException
	at org.joda.time.Partial.<init>(Partial.java:221)
	at org.joda.time.Partial.<init>(Partial.java:177)
	at org.joda.time.TestPartial_Properties.testPropertyGetMinute(TestPartial_Properties.java:239)

testPropertyGetMaxMinValuesMinute(org.joda.time.TestPartial_Properties)  Time elapsed: 0 sec  <<< ERROR!
java.lang.NullPointerException
	at org.joda.time.Partial.<init>(Partial.java:221)
	at org.joda.time.Partial.<init>(Partial.java:177)
	at org.joda.time.TestPartial_Properties.testPropertyGetMaxMinValuesMinute(TestPartial_Properties.java:258)

testPropertySetMinute(org.joda.time.TestPartial_Properties)  Time elapsed: 0 sec  <<< ERROR!
java.lang.NullPointerException
	at org.joda.time.Partial.<init>(Partial.java:221)
	at org.joda.time.Partial.<init>(Partial.java:177)
	at org.joda.time.TestPartial_Properties.testPropertySetMinute(TestPartial_Properties.java:365)

testPropertySetTextMinute(org.joda.time.TestPartial_Properties)  Time elapsed: 0.001 sec  <<< ERROR!
java.lang.NullPointerException
	at org.joda.time.Partial.<init>(Partial.java:221)
	at org.joda.time.Partial.<init>(Partial.java:177)
	at org.joda.time.TestPartial_Properties.testPropertySetTextMinute(TestPartial_Properties.java:381)

testPropertyCompareToMinute(org.joda.time.TestPartial_Properties)  Time elapsed: 0 sec  <<< ERROR!
java.lang.NullPointerException
	at org.joda.time.Partial.<init>(Partial.java:221)
	at org.joda.time.Partial.<init>(Partial.java:177)
	at org.joda.time.TestPartial_Properties.testPropertyCompareToMinute(TestPartial_Properties.java:388)

testPropertyAddHour(org.joda.time.TestPartial_Properties)  Time elapsed: 0.001 sec  <<< ERROR!
java.lang.NullPointerException
	at org.joda.time.Partial.<init>(Partial.java:221)
	at org.joda.time.Partial.<init>(Partial.java:177)
	at org.joda.time.TestPartial_Properties.testPropertyAddHour(TestPartial_Properties.java:135)

testPropertyAddWrapFieldHour(org.joda.time.TestPartial_Properties)  Time elapsed: 0 sec  <<< ERROR!
java.lang.NullPointerException
	at org.joda.time.Partial.<init>(Partial.java:221)
	at org.joda.time.Partial.<init>(Partial.java:177)
	at org.joda.time.TestPartial_Properties.testPropertyAddWrapFieldHour(TestPartial_Properties.java:163)

testPropertyAddMinute(org.joda.time.TestPartial_Properties)  Time elapsed: 0.001 sec  <<< ERROR!
java.lang.NullPointerException
	at org.joda.time.Partial.<init>(Partial.java:221)
	at org.joda.time.Partial.<init>(Partial.java:177)
	at org.joda.time.TestPartial_Properties.testPropertyAddMinute(TestPartial_Properties.java:306)

testPropertyAddWrapFieldMinute(org.joda.time.TestPartial_Properties)  Time elapsed: 0.001 sec  <<< ERROR!
java.lang.NullPointerException
	at org.joda.time.Partial.<init>(Partial.java:221)
	at org.joda.time.Partial.<init>(Partial.java:177)
	at org.joda.time.TestPartial_Properties.testPropertyAddWrapFieldMinute(TestPartial_Properties.java:352)

testPlusMinutesInDstChange(org.joda.time.TestDateTimeZoneCutover)  Time elapsed: 0 sec  <<< ERROR!
java.lang.NullPointerException
	at org.joda.time.DateTime.plusMinutes(DateTime.java:1176)
	at org.joda.time.TestDateTimeZoneCutover.testPlusMinutesInDstChange(TestDateTimeZoneCutover.java:1190)

testPeriod(org.joda.time.TestDateTimeZoneCutover)  Time elapsed: 0.001 sec  <<< ERROR!
java.lang.NullPointerException
	at org.joda.time.chrono.BaseChronology.get(BaseChronology.java:260)
	at org.joda.time.base.BasePeriod.<init>(BasePeriod.java:132)
	at org.joda.time.Period.<init>(Period.java:548)
	at org.joda.time.TestDateTimeZoneCutover.testPeriod(TestDateTimeZoneCutover.java:1249)

testLocalTime(org.joda.time.TestStringConvert)  Time elapsed: 0.002 sec  <<< ERROR!
java.lang.NullPointerException
	at org.joda.time.LocalTime.isSupported(LocalTime.java:646)
	at org.joda.time.LocalTime.isSupported(LocalTime.java:625)
	at org.joda.time.format.DateTimeFormatterBuilder$PaddedNumber.printTo(DateTimeFormatterBuilder.java:1434)
	at org.joda.time.format.DateTimeFormatterBuilder$Composite.printTo(DateTimeFormatterBuilder.java:2446)
	at org.joda.time.format.DateTimeFormatter.printTo(DateTimeFormatter.java:609)
	at org.joda.time.format.DateTimeFormatter.print(DateTimeFormatter.java:663)
	at org.joda.time.LocalTime.toString(LocalTime.java:1299)
	at sun.reflect.NativeMethodAccessorImpl.invoke0(Native Method)
	at sun.reflect.NativeMethodAccessorImpl.invoke(NativeMethodAccessorImpl.java:57)
	at sun.reflect.DelegatingMethodAccessorImpl.invoke(DelegatingMethodAccessorImpl.java:43)
	at java.lang.reflect.Method.invoke(Method.java:606)
	at org.joda.convert.ReflectionStringConverter.convertToString(ReflectionStringConverter.java:63)
	at org.joda.convert.StringConvert.convertToString(StringConvert.java:124)
	at org.joda.time.TestStringConvert.testLocalTime(TestStringConvert.java:90)

testDurationFields(org.joda.time.chrono.TestBuddhistChronology)  Time elapsed: 0.001 sec  <<< ERROR!
java.lang.NullPointerException
	at org.joda.time.chrono.TestBuddhistChronology.testDurationFields(TestBuddhistChronology.java:156)

testDurationFields(org.joda.time.chrono.TestCopticChronology)  Time elapsed: 0.001 sec  <<< ERROR!
java.lang.NullPointerException
	at org.joda.time.chrono.TestCopticChronology.testDurationFields(TestCopticChronology.java:159)

testDurationFields(org.joda.time.chrono.TestEthiopicChronology)  Time elapsed: 0.001 sec  <<< ERROR!
java.lang.NullPointerException
	at org.joda.time.chrono.TestEthiopicChronology.testDurationFields(TestEthiopicChronology.java:159)

testDurationFields(org.joda.time.chrono.TestGJChronology)  Time elapsed: 0.001 sec  <<< ERROR!
java.lang.NullPointerException
	at org.joda.time.chrono.TestGJChronology.testDurationFields(TestGJChronology.java:210)

testDurationFields(org.joda.time.chrono.TestGregorianChronology)  Time elapsed: 0 sec  <<< ERROR!
java.lang.NullPointerException
	at org.joda.time.chrono.TestGregorianChronology.testDurationFields(TestGregorianChronology.java:166)

testDurationFields(org.joda.time.chrono.TestIslamicChronology)  Time elapsed: 0 sec  <<< ERROR!
java.lang.NullPointerException
	at org.joda.time.chrono.TestIslamicChronology.testDurationFields(TestIslamicChronology.java:156)

testDurationFields(org.joda.time.chrono.TestJulianChronology)  Time elapsed: 0.001 sec  <<< ERROR!
java.lang.NullPointerException
	at org.joda.time.chrono.TestJulianChronology.testDurationFields(TestJulianChronology.java:163)

testDurationFields(org.joda.time.chrono.TestISOChronology)  Time elapsed: 0.001 sec  <<< ERROR!
java.lang.NullPointerException
	at org.joda.time.chrono.TestISOChronology.testDurationFields(TestISOChronology.java:156)

testSetInto_Object(org.joda.time.convert.TestReadableDurationConverter)  Time elapsed: 0 sec  <<< ERROR!
java.lang.NullPointerException
	at org.joda.time.chrono.BaseChronology.get(BaseChronology.java:284)
	at org.joda.time.convert.ReadableDurationConverter.setInto(ReadableDurationConverter.java:75)
	at org.joda.time.convert.TestReadableDurationConverter.testSetInto_Object(TestReadableDurationConverter.java:112)

testGetPeriodType_Object(org.joda.time.convert.TestReadablePeriodConverter)  Time elapsed: 0.001 sec  <<< ERROR!
java.lang.NullPointerException
	at org.joda.time.chrono.BaseChronology.get(BaseChronology.java:284)
	at org.joda.time.base.BasePeriod.<init>(BasePeriod.java:258)
	at org.joda.time.Period.<init>(Period.java:402)
	at org.joda.time.convert.TestReadablePeriodConverter.testGetPeriodType_Object(TestReadablePeriodConverter.java:90)

test_add_RP_int_intarray_int(org.joda.time.field.TestBaseDateTimeField)  Time elapsed: 0.001 sec  <<< ERROR!
java.lang.NullPointerException
	at org.joda.time.field.BaseDateTimeField.add(BaseDateTimeField.java:319)
	at org.joda.time.field.TestBaseDateTimeField.test_add_RP_int_intarray_int(TestBaseDateTimeField.java:184)

test_add_RP_int_intarray_int(org.joda.time.field.TestOffsetDateTimeField)  Time elapsed: 0.001 sec  <<< ERROR!
java.lang.NullPointerException
	at org.joda.time.field.BaseDateTimeField.add(BaseDateTimeField.java:319)
	at org.joda.time.field.TestOffsetDateTimeField.test_add_RP_int_intarray_int(TestOffsetDateTimeField.java:237)

test_add_RP_int_intarray_int(org.joda.time.field.TestPreciseDurationDateTimeField)  Time elapsed: 0.001 sec  <<< ERROR!
java.lang.NullPointerException
	at org.joda.time.field.BaseDateTimeField.add(BaseDateTimeField.java:319)
	at org.joda.time.field.TestPreciseDurationDateTimeField.test_add_RP_int_intarray_int(TestPreciseDurationDateTimeField.java:201)

test_add_RP_int_intarray_int(org.joda.time.field.TestPreciseDateTimeField)  Time elapsed: 0.001 sec  <<< ERROR!
java.lang.NullPointerException
	at org.joda.time.field.BaseDateTimeField.add(BaseDateTimeField.java:319)
	at org.joda.time.field.TestPreciseDateTimeField.test_add_RP_int_intarray_int(TestPreciseDateTimeField.java:230)

test_compareTo(org.joda.time.field.TestPreciseDurationField)  Time elapsed: 0.001 sec  <<< ERROR!
java.lang.NullPointerException
	at org.joda.time.field.BaseDurationField.compareTo(BaseDurationField.java:146)
	at org.joda.time.field.TestPreciseDurationField.test_compareTo(TestPreciseDurationField.java:244)

test_hashCode(org.joda.time.field.TestPreciseDurationField)  Time elapsed: 0.001 sec  <<< ERROR!
java.lang.NullPointerException
	at org.joda.time.field.TestPreciseDurationField.test_hashCode(TestPreciseDurationField.java:232)

test_compareTo(org.joda.time.field.TestScaledDurationField)  Time elapsed: 0 sec  <<< ERROR!
java.lang.NullPointerException
	at org.joda.time.field.BaseDurationField.compareTo(BaseDurationField.java:146)
	at org.joda.time.field.TestScaledDurationField.test_compareTo(TestScaledDurationField.java:261)

test_hashCode(org.joda.time.field.TestScaledDurationField)  Time elapsed: 0 sec  <<< ERROR!
java.lang.NullPointerException
	at org.joda.time.field.TestScaledDurationField.test_hashCode(TestScaledDurationField.java:249)

testFormat_time_partial(org.joda.time.format.TestISODateTimeFormat)  Time elapsed: 0 sec  <<< ERROR!
java.lang.NullPointerException
	at org.joda.time.Partial.<init>(Partial.java:221)
	at org.joda.time.Partial.<init>(Partial.java:177)
	at org.joda.time.format.TestISODateTimeFormat.testFormat_time_partial(TestISODateTimeFormat.java:126)

testFormat_timeNoMillis_partial(org.joda.time.format.TestISODateTimeFormat)  Time elapsed: 0 sec  <<< ERROR!
java.lang.NullPointerException
	at org.joda.time.Partial.<init>(Partial.java:221)
	at org.joda.time.Partial.<init>(Partial.java:177)
	at org.joda.time.format.TestISODateTimeFormat.testFormat_timeNoMillis_partial(TestISODateTimeFormat.java:145)

testForFields_time_MS(org.joda.time.format.TestISODateTimeFormat_Fields)  Time elapsed: 0 sec  <<< ERROR!
java.lang.NullPointerException
	at org.joda.time.Partial.<init>(Partial.java:230)
	at org.joda.time.Partial.<init>(Partial.java:177)
	at org.joda.time.format.TestISODateTimeFormat_Fields.testForFields_time_MS(TestISODateTimeFormat_Fields.java:749)

testForFields_time_Mm(org.joda.time.format.TestISODateTimeFormat_Fields)  Time elapsed: 0 sec  <<< ERROR!
java.lang.NullPointerException
	at org.joda.time.Partial.<init>(Partial.java:230)
	at org.joda.time.Partial.<init>(Partial.java:177)
	at org.joda.time.format.TestISODateTimeFormat_Fields.testForFields_time_Mm(TestISODateTimeFormat_Fields.java:948)

testForFields_time_HMm(org.joda.time.format.TestISODateTimeFormat_Fields)  Time elapsed: 0.003 sec  <<< ERROR!
java.lang.NullPointerException
	at org.joda.time.Partial.<init>(Partial.java:221)
	at org.joda.time.Partial.<init>(Partial.java:177)
	at org.joda.time.format.TestISODateTimeFormat_Fields.testForFields_time_HMm(TestISODateTimeFormat_Fields.java:1010)

testForFields_datetime_DM(org.joda.time.format.TestISODateTimeFormat_Fields)  Time elapsed: 0.001 sec  <<< ERROR!
java.lang.NullPointerException
	at org.joda.time.Partial.<init>(Partial.java:221)
	at org.joda.time.Partial.<init>(Partial.java:177)
	at org.joda.time.format.TestISODateTimeFormat_Fields.testForFields_datetime_DM(TestISODateTimeFormat_Fields.java:1130)

testForFields_time_HMSm(org.joda.time.format.TestISODateTimeFormat_Fields)  Time elapsed: 0 sec  <<< ERROR!
java.lang.NullPointerException
	at org.joda.time.Partial.<init>(Partial.java:221)
	at org.joda.time.Partial.<init>(Partial.java:177)
	at org.joda.time.format.TestISODateTimeFormat_Fields.testForFields_time_HMSm(TestISODateTimeFormat_Fields.java:608)

testForFields_time_HMS(org.joda.time.format.TestISODateTimeFormat_Fields)  Time elapsed: 0 sec  <<< ERROR!
java.lang.NullPointerException
	at org.joda.time.Partial.<init>(Partial.java:221)
	at org.joda.time.Partial.<init>(Partial.java:177)
	at org.joda.time.format.TestISODateTimeFormat_Fields.testForFields_time_HMS(TestISODateTimeFormat_Fields.java:637)

testForFields_time_HM(org.joda.time.format.TestISODateTimeFormat_Fields)  Time elapsed: 0 sec  <<< ERROR!
java.lang.NullPointerException
	at org.joda.time.Partial.<init>(Partial.java:221)
	at org.joda.time.Partial.<init>(Partial.java:177)
	at org.joda.time.format.TestISODateTimeFormat_Fields.testForFields_time_HM(TestISODateTimeFormat_Fields.java:665)

testForFields_time_MSm(org.joda.time.format.TestISODateTimeFormat_Fields)  Time elapsed: 0 sec  <<< ERROR!
java.lang.NullPointerException
	at org.joda.time.Partial.<init>(Partial.java:230)
	at org.joda.time.Partial.<init>(Partial.java:177)
	at org.joda.time.format.TestISODateTimeFormat_Fields.testForFields_time_MSm(TestISODateTimeFormat_Fields.java:721)


Results :

Failed tests: 
  org.joda.time.TestDateTime_Properties#testPropertyGetMinuteOfDay AssertionFailedError
  org.joda.time.TestDateTime_Properties#testPropertyGetMinuteOfHour AssertionFailedError
  org.joda.time.TestDateTime_Properties#testPropertyGetSecondOfMinute AssertionFailedError
  org.joda.time.TestLocalDateTime_Properties#testPropertyGetMinute AssertionFailedError
  org.joda.time.TestLocalDateTime_Properties#testPropertyGetSecond AssertionFailedError
  org.joda.time.TestLocalTime_Properties#testPropertyGetMinute AssertionFailedError
  org.joda.time.TestLocalTime_Properties#testPropertyGetSecond AssertionFailedError
  org.joda.time.TestMutableDateTime_Properties#testPropertyGetMinuteOfDay AssertionFailedError
  org.joda.time.TestMutableDateTime_Properties#testPropertyGetMinuteOfHour AssertionFailedError
  org.joda.time.TestMutableDateTime_Properties#testPropertyGetSecondOfMinute AssertionFailedError
  org.joda.time.TestTimeOfDay_Properties#testPropertyGetMinute AssertionFailedError
  org.joda.time.TestTimeOfDay_Properties#testPropertyGetSecond AssertionFailedError
Tests in error: 
  org.joda.time.TestDateMidnight_Basics#testMinus_RP NullPointerException
  org.joda.time.TestDateMidnight_Basics#testPlus_RP NullPointerException
  org.joda.time.TestDateMidnight_Basics#testWithDurationAdded_RP_int NullPointerException
  org.joda.time.TestDateTimeZoneCutover#testPeriod NullPointerException
  org.joda.time.TestDateTimeZoneCutover#testPlusMinutesInDstChange NullPointerException
  org.joda.time.TestDateTime_Basics#testMinusMinutes_int NullPointerException
  org.joda.time.TestDateTime_Basics#testMinus_RP NullPointerException
  org.joda.time.TestDateTime_Basics#testPlusMinutes_int NullPointerException
  org.joda.time.TestDateTime_Basics#testPlus_RP NullPointerException
  org.joda.time.TestDateTime_Basics#testWithDurationAdded_RP_int NullPointerException
  org.joda.time.TestDurationFieldType#test_minutes NullPointerException
  org.joda.time.TestDuration_Basics#testToPeriod NullPointerException
  org.joda.time.TestDuration_Basics#testToPeriodFrom NullPointerException
  org.joda.time.TestDuration_Basics#testToPeriodFrom_PeriodType NullPointerException
  org.joda.time.TestDuration_Basics#testToPeriodTo NullPointerException
  org.joda.time.TestDuration_Basics#testToPeriodTo_PeriodType NullPointerException
  org.joda.time.TestDuration_Basics#testToPeriod_Chronology NullPointerException
  org.joda.time.TestDuration_Basics#testToPeriod_PeriodType NullPointerException
  org.joda.time.TestDuration_Basics#testToPeriod_PeriodType_Chronology NullPointerException
  org.joda.time.TestDuration_Basics#testToPeriod_fixedZone NullPointerException
  org.joda.time.TestHours#testFactory_standardHoursIn_RPeriod NullPointerException
  org.joda.time.TestInterval_Basics#testToPeriod NullPointerException
  org.joda.time.TestInterval_Basics#testToPeriod_PeriodType1 NullPointerException
  org.joda.time.TestInterval_Basics#testToPeriod_PeriodType2 NullPointerException
  org.joda.time.TestInterval_Constructors#testConstructor_RI_RP4 NullPointerException
  org.joda.time.TestInterval_Constructors#testConstructor_RP_RI4 NullPointerException
  org.joda.time.TestLocalDateTime_Basics#testIsSupported_DurationFieldType NullPointerException
  org.joda.time.TestLocalDateTime_Basics#testMinusMinutes_int NullPointerException
  org.joda.time.TestLocalDateTime_Basics#testMinus_RP NullPointerException
  org.joda.time.TestLocalDateTime_Basics#testPlusMinutes_int NullPointerException
  org.joda.time.TestLocalDateTime_Basics#testPlus_RP NullPointerException
  org.joda.time.TestLocalDate_Basics#testMinus_RP NullPointerException
  org.joda.time.TestLocalDate_Basics#testPlus_RP NullPointerException
  org.joda.time.TestLocalTime_Basics#testCompareTo NullPointerException
  org.joda.time.TestLocalTime_Basics#testGet_DateTimeFieldType NullPointerException
  org.joda.time.TestLocalTime_Basics#testIsSupported_DateTimeFieldType NullPointerException
  org.joda.time.TestLocalTime_Basics#testIsSupported_DurationFieldType NullPointerException
  org.joda.time.TestLocalTime_Basics#testMinusMinutes_int NullPointerException
  org.joda.time.TestLocalTime_Basics#testMinus_RP NullPointerException
  org.joda.time.TestLocalTime_Basics#testPlusMinutes_int NullPointerException
  org.joda.time.TestLocalTime_Basics#testPlus_RP NullPointerException
  org.joda.time.TestLocalTime_Basics#testProperty NullPointerException
  org.joda.time.TestLocalTime_Basics#testToString NullPointerException
  org.joda.time.TestLocalTime_Basics#testToString_DTFormatter NullPointerException
  org.joda.time.TestLocalTime_Basics#testToString_String NullPointerException
  org.joda.time.TestLocalTime_Basics#testToString_String_Locale NullPointerException
  org.joda.time.TestLocalTime_Basics#testWithFieldAdded_DurationFieldType_int_7 NullPointerException
  org.joda.time.TestLocalTime_Basics#testWithFieldAdded_DurationFieldType_int_8 NullPointerException
  org.joda.time.TestLocalTime_Constructors#testConstructor_ObjectLocalTime NullPointerException
  org.joda.time.TestLocalTime_Properties#testPropertyCompareToMinute NullPointerException
  org.joda.time.TestLocalTime_Properties#testPropertyCompareToSecond NullPointerException
  org.joda.time.TestMinutes#testAddToLocalDate NullPointerException
  org.joda.time.TestMinutes#testFactory_minutesBetween_RInstant NullPointerException
  org.joda.time.TestMinutes#testFactory_minutesBetween_RPartial NullPointerException
  org.joda.time.TestMinutes#testFactory_minutesIn_RInterval NullPointerException
  org.joda.time.TestMinutes#testFactory_standardMinutesIn_RPeriod NullPointerException
  org.joda.time.TestMutableDateTime_Adds#testAddMinutes_int1 NullPointerException
  org.joda.time.TestMutableDateTime_Adds#testAdd_RP1 NullPointerException
  org.joda.time.TestMutableInterval_Basics#testToPeriod NullPointerException
  org.joda.time.TestMutableInterval_Basics#testToPeriod_PeriodType1 NullPointerException
  org.joda.time.TestMutableInterval_Basics#testToPeriod_PeriodType2 NullPointerException
  org.joda.time.TestMutableInterval_Constructors#testConstructor_RI_RP4 NullPointerException
  org.joda.time.TestMutableInterval_Constructors#testConstructor_RP_RI4 NullPointerException
  org.joda.time.TestMutableInterval_Updates#testSePeriodAfterStart_RI2 NullPointerException
  org.joda.time.TestMutableInterval_Updates#testSePeriodBeforeEnd_RI2 NullPointerException
  org.joda.time.TestMutableInterval_Updates#testSetPeriodAfterStart_RI1 NullPointerException
  org.joda.time.TestMutableInterval_Updates#testSetPeriodBeforeEnd_RI1 NullPointerException
  org.joda.time.TestMutablePeriod_Basics#testClone NullPointerException
  org.joda.time.TestMutablePeriod_Basics#testCopy NullPointerException
  org.joda.time.TestMutablePeriod_Basics#testEqualsHashCode NullPointerException
  org.joda.time.TestMutablePeriod_Basics#testSerialization NullPointerException
  org.joda.time.TestMutablePeriod_Basics#testToDurationFrom NullPointerException
  org.joda.time.TestMutablePeriod_Basics#testToMutablePeriod NullPointerException
  org.joda.time.TestMutablePeriod_Basics#testToPeriod NullPointerException
  org.joda.time.TestMutablePeriod_Basics#testToString NullPointerException
  org.joda.time.TestMutablePeriod_Constructors#testConstructor_Object_Chronology1 NullPointerException
  org.joda.time.TestMutablePeriod_Constructors#testConstructor_Object_Chronology2 NullPointerException
  org.joda.time.TestMutablePeriod_Constructors#testConstructor_RI_RD1 NullPointerException
  org.joda.time.TestMutablePeriod_Constructors#testConstructor_RI_RD_PeriodType1 NullPointerException
  org.joda.time.TestMutablePeriod_Constructors#testConstructor_RI_RI1 NullPointerException
  org.joda.time.TestMutablePeriod_Constructors#testConstructor_RI_RI2 NullPointerException
  org.joda.time.TestMutablePeriod_Constructors#testConstructor_RI_RI3 NullPointerException
  org.joda.time.TestMutablePeriod_Constructors#testConstructor_RI_RI4 NullPointerException
  org.joda.time.TestMutablePeriod_Constructors#testConstructor_RI_RI_PeriodType1 NullPointerException
  org.joda.time.TestMutablePeriod_Constructors#testConstructor_RI_RI_PeriodType2 NullPointerException
  org.joda.time.TestMutablePeriod_Constructors#testConstructor_RI_RI_PeriodType3 NullPointerException
  org.joda.time.TestMutablePeriod_Constructors#testConstructor_RI_RI_PeriodType4 NullPointerException
  org.joda.time.TestMutablePeriod_Constructors#testConstructor_long1 NullPointerException
  org.joda.time.TestMutablePeriod_Constructors#testConstructor_long2 NullPointerException
  org.joda.time.TestMutablePeriod_Constructors#testConstructor_long3 NullPointerException
  org.joda.time.TestMutablePeriod_Constructors#testConstructor_long_Chronology1 NullPointerException
  org.joda.time.TestMutablePeriod_Constructors#testConstructor_long_Chronology2 NullPointerException
  org.joda.time.TestMutablePeriod_Constructors#testConstructor_long_Chronology3 NullPointerException
  org.joda.time.TestMutablePeriod_Constructors#testConstructor_long_PeriodType1 NullPointerException
  org.joda.time.TestMutablePeriod_Constructors#testConstructor_long_PeriodType3 NullPointerException
  org.joda.time.TestMutablePeriod_Constructors#testConstructor_long_PeriodType4 NullPointerException
  org.joda.time.TestMutablePeriod_Constructors#testConstructor_long_PeriodType_Chronology1 NullPointerException
  org.joda.time.TestMutablePeriod_Constructors#testConstructor_long_PeriodType_Chronology2 NullPointerException
  org.joda.time.TestMutablePeriod_Constructors#testConstructor_long_PeriodType_Chronology3 NullPointerException
  org.joda.time.TestMutablePeriod_Constructors#testConstructor_long_PeriodType_Chronology4 NullPointerException
  org.joda.time.TestMutablePeriod_Constructors#testConstructor_long_long1 NullPointerException
  org.joda.time.TestMutablePeriod_Constructors#testConstructor_long_long2 NullPointerException
  org.joda.time.TestMutablePeriod_Constructors#testConstructor_long_long_Chronology1 NullPointerException
  org.joda.time.TestMutablePeriod_Constructors#testConstructor_long_long_Chronology2 NullPointerException
  org.joda.time.TestMutablePeriod_Constructors#testConstructor_long_long_PeriodType1 NullPointerException
  org.joda.time.TestMutablePeriod_Constructors#testConstructor_long_long_PeriodType2 NullPointerException
  org.joda.time.TestMutablePeriod_Constructors#testConstructor_long_long_PeriodType3 NullPointerException
  org.joda.time.TestMutablePeriod_Constructors#testConstructor_long_long_PeriodType_Chronology1 NullPointerException
  org.joda.time.TestMutablePeriod_Constructors#testConstructor_long_long_PeriodType_Chronology2 NullPointerException
  org.joda.time.TestMutablePeriod_Updates#testAdd_8ints1 NullPointerException
  org.joda.time.TestMutablePeriod_Updates#testAdd_8ints2 NullPointerException
  org.joda.time.TestMutablePeriod_Updates#testAdd_RD1 NullPointerException
  org.joda.time.TestMutablePeriod_Updates#testAdd_RD2 NullPointerException
  org.joda.time.TestMutablePeriod_Updates#testAdd_RInterval1 NullPointerException
  org.joda.time.TestMutablePeriod_Updates#testAdd_RInterval2 NullPointerException
  org.joda.time.TestMutablePeriod_Updates#testAdd_RInterval3 NullPointerException
  org.joda.time.TestMutablePeriod_Updates#testAdd_RInterval4 NullPointerException
  org.joda.time.TestMutablePeriod_Updates#testAdd_RP1 NullPointerException
  org.joda.time.TestMutablePeriod_Updates#testAdd_RP2 NullPointerException
  org.joda.time.TestMutablePeriod_Updates#testAdd_RP3 NullPointerException
  org.joda.time.TestMutablePeriod_Updates#testAdd_long1 NullPointerException
  org.joda.time.TestMutablePeriod_Updates#testAdd_long2 NullPointerException
  org.joda.time.TestMutablePeriod_Updates#testAdd_long3 NullPointerException
  org.joda.time.TestMutablePeriod_Updates#testAdd_long_Chronology1 NullPointerException
  org.joda.time.TestMutablePeriod_Updates#testAdd_long_Chronology2 NullPointerException
  org.joda.time.TestMutablePeriod_Updates#testAdd_long_Chronology3 NullPointerException
  org.joda.time.TestMutablePeriod_Updates#testSetPeriod_RD1 NullPointerException
  org.joda.time.TestMutablePeriod_Updates#testSetPeriod_RD2 NullPointerException
  org.joda.time.TestMutablePeriod_Updates#testSetPeriod_RI_RI1 NullPointerException
  org.joda.time.TestMutablePeriod_Updates#testSetPeriod_RI_RI2 NullPointerException
  org.joda.time.TestMutablePeriod_Updates#testSetPeriod_RInterval1 NullPointerException
  org.joda.time.TestMutablePeriod_Updates#testSetPeriod_long1 NullPointerException
  org.joda.time.TestMutablePeriod_Updates#testSetPeriod_long2 NullPointerException
  org.joda.time.TestMutablePeriod_Updates#testSetPeriod_long_long1 NullPointerException
  org.joda.time.TestMutablePeriod_Updates#testSetPeriod_long_long2 NullPointerException
  org.joda.time.TestMutablePeriod_Updates#testSetPeriod_long_long_NoDays NullPointerException
  org.joda.time.TestMutablePeriod_Updates#testSetPeriod_long_long_NoHours NullPointerException
  org.joda.time.TestMutablePeriod_Updates#testSetPeriod_long_long_NoMillis NullPointerException
  org.joda.time.TestMutablePeriod_Updates#testSetPeriod_long_long_NoMonths NullPointerException
  org.joda.time.TestMutablePeriod_Updates#testSetPeriod_long_long_NoSeconds NullPointerException
  org.joda.time.TestMutablePeriod_Updates#testSetPeriod_long_long_NoWeeks NullPointerException
  org.joda.time.TestMutablePeriod_Updates#testSetPeriod_long_long_NoYears NullPointerException
  org.joda.time.TestPartial_Basics#testCompareTo NullPointerException
  org.joda.time.TestPartial_Basics#testEqualsHashCode NullPointerException
  org.joda.time.TestPartial_Basics#testGet NullPointerException
  org.joda.time.TestPartial_Basics#testGetField NullPointerException
  org.joda.time.TestPartial_Basics#testGetFieldType NullPointerException
  org.joda.time.TestPartial_Basics#testGetFieldTypes NullPointerException
  org.joda.time.TestPartial_Basics#testGetFields NullPointerException
  org.joda.time.TestPartial_Basics#testGetValue NullPointerException
  org.joda.time.TestPartial_Basics#testGetValues NullPointerException
  org.joda.time.TestPartial_Basics#testIsAfter_TOD NullPointerException
  org.joda.time.TestPartial_Basics#testIsBefore_TOD NullPointerException
  org.joda.time.TestPartial_Basics#testIsEqual_TOD NullPointerException
  org.joda.time.TestPartial_Basics#testIsSupported NullPointerException
  org.joda.time.TestPartial_Basics#testMinus_RP NullPointerException
  org.joda.time.TestPartial_Basics#testPlus_RP NullPointerException
  org.joda.time.TestPartial_Basics#testProperty NullPointerException
  org.joda.time.TestPartial_Basics#testSerialization NullPointerException
  org.joda.time.TestPartial_Basics#testSize NullPointerException
  org.joda.time.TestPartial_Basics#testToDateTime_RI NullPointerException
  org.joda.time.TestPartial_Basics#testToDateTime_nullRI NullPointerException
  org.joda.time.TestPartial_Basics#testToString1 NullPointerException
  org.joda.time.TestPartial_Basics#testToString_DTFormatter NullPointerException
  org.joda.time.TestPartial_Basics#testToString_String NullPointerException
  org.joda.time.TestPartial_Basics#testToString_String_Locale NullPointerException
  org.joda.time.TestPartial_Basics#testWith1 NullPointerException
  org.joda.time.TestPartial_Basics#testWith2 NullPointerException
  org.joda.time.TestPartial_Basics#testWith3 NullPointerException
  org.joda.time.TestPartial_Basics#testWith3a NullPointerException
  org.joda.time.TestPartial_Basics#testWith3b NullPointerException
  org.joda.time.TestPartial_Basics#testWith3c NullPointerException
  org.joda.time.TestPartial_Basics#testWith4 NullPointerException
  org.joda.time.TestPartial_Basics#testWithChronologyRetainFields_Chrono NullPointerException
  org.joda.time.TestPartial_Basics#testWithChronologyRetainFields_nullChrono NullPointerException
  org.joda.time.TestPartial_Basics#testWithChronologyRetainFields_sameChrono NullPointerException
  org.joda.time.TestPartial_Basics#testWithField1 NullPointerException
  org.joda.time.TestPartial_Basics#testWithField2 NullPointerException
  org.joda.time.TestPartial_Basics#testWithField3 NullPointerException
  org.joda.time.TestPartial_Basics#testWithField4 NullPointerException
  org.joda.time.TestPartial_Basics#testWithFieldAddWrapped1 NullPointerException
  org.joda.time.TestPartial_Basics#testWithFieldAddWrapped2 NullPointerException
  org.joda.time.TestPartial_Basics#testWithFieldAddWrapped3 NullPointerException
  org.joda.time.TestPartial_Basics#testWithFieldAddWrapped4 NullPointerException
  org.joda.time.TestPartial_Basics#testWithFieldAddWrapped5 NullPointerException
  org.joda.time.TestPartial_Basics#testWithFieldAddWrapped6 NullPointerException
  org.joda.time.TestPartial_Basics#testWithFieldAddWrapped7 NullPointerException
  org.joda.time.TestPartial_Basics#testWithFieldAddWrapped8 NullPointerException
  org.joda.time.TestPartial_Basics#testWithFieldAdded1 NullPointerException
  org.joda.time.TestPartial_Basics#testWithFieldAdded2 NullPointerException
  org.joda.time.TestPartial_Basics#testWithFieldAdded3 NullPointerException
  org.joda.time.TestPartial_Basics#testWithFieldAdded4 NullPointerException
  org.joda.time.TestPartial_Basics#testWithFieldAdded5 NullPointerException
  org.joda.time.TestPartial_Basics#testWithFieldAdded6 NullPointerException
  org.joda.time.TestPartial_Basics#testWithFieldAdded7 NullPointerException
  org.joda.time.TestPartial_Basics#testWithFieldAdded8 NullPointerException
  org.joda.time.TestPartial_Basics#testWithout1 NullPointerException
  org.joda.time.TestPartial_Basics#testWithout2 NullPointerException
  org.joda.time.TestPartial_Basics#testWithout3 NullPointerException
  org.joda.time.TestPartial_Basics#testWithout4 NullPointerException
  org.joda.time.TestPartial_Properties#testPropertyAddHour NullPointerException
  org.joda.time.TestPartial_Properties#testPropertyAddMinute NullPointerException
  org.joda.time.TestPartial_Properties#testPropertyAddWrapFieldHour NullPointerException
  org.joda.time.TestPartial_Properties#testPropertyAddWrapFieldMinute NullPointerException
  org.joda.time.TestPartial_Properties#testPropertyCompareToHour NullPointerException
  org.joda.time.TestPartial_Properties#testPropertyCompareToMinute NullPointerException
  org.joda.time.TestPartial_Properties#testPropertyGetHour NullPointerException
  org.joda.time.TestPartial_Properties#testPropertyGetMaxMinValuesHour NullPointerException
  org.joda.time.TestPartial_Properties#testPropertyGetMaxMinValuesMinute NullPointerException
  org.joda.time.TestPartial_Properties#testPropertyGetMinute NullPointerException
  org.joda.time.TestPartial_Properties#testPropertySetHour NullPointerException
  org.joda.time.TestPartial_Properties#testPropertySetMinute NullPointerException
  org.joda.time.TestPartial_Properties#testPropertySetTextHour NullPointerException
  org.joda.time.TestPartial_Properties#testPropertySetTextMinute NullPointerException
  org.joda.time.TestPartial_Properties#testPropertyWithMaximumValueHour NullPointerException
  org.joda.time.TestPartial_Properties#testPropertyWithMinimumValueHour NullPointerException
  org.joda.time.TestPeriod_Basics#testEqualsHashCode NullPointerException
  org.joda.time.TestPeriod_Basics#testNormalizedStandard_fullNegative NullPointerException
  org.joda.time.TestPeriod_Basics#testNormalizedStandard_negative NullPointerException
  org.joda.time.TestPeriod_Basics#testNormalizedStandard_periodType_weekDay1 NullPointerException
  org.joda.time.TestPeriod_Basics#testNormalizedStandard_periodType_weekDay3 NullPointerException
  org.joda.time.TestPeriod_Basics#testNormalizedStandard_periodType_yearMonth3 NullPointerException
  org.joda.time.TestPeriod_Basics#testNormalizedStandard_periodType_yearMonthDay NullPointerException
  org.joda.time.TestPeriod_Basics#testNormalizedStandard_periodType_yearMonthWeekDay NullPointerException
  org.joda.time.TestPeriod_Basics#testNormalizedStandard_weekDay1 NullPointerException
  org.joda.time.TestPeriod_Basics#testNormalizedStandard_yearMonthDay NullPointerException
  org.joda.time.TestPeriod_Basics#testNormalizedStandard_yearMonthWeekDay NullPointerException
  org.joda.time.TestPeriod_Basics#testSerialization NullPointerException
  org.joda.time.TestPeriod_Basics#testToDurationFrom NullPointerException
  org.joda.time.TestPeriod_Basics#testToDurationTo NullPointerException
  org.joda.time.TestPeriod_Basics#testToMutablePeriod NullPointerException
  org.joda.time.TestPeriod_Basics#testToPeriod NullPointerException
  org.joda.time.TestPeriod_Basics#testToString NullPointerException
  org.joda.time.TestPeriod_Basics#testWithPeriodType1 NullPointerException
  org.joda.time.TestPeriod_Basics#testWithPeriodType2 NullPointerException
  org.joda.time.TestPeriod_Basics#testWithPeriodType4 NullPointerException
  org.joda.time.TestPeriod_Constructors#testConstructor_RD_RI1 NullPointerException
  org.joda.time.TestPeriod_Constructors#testConstructor_RD_RI_PeriodType1 NullPointerException
  org.joda.time.TestPeriod_Constructors#testConstructor_RI_RD1 NullPointerException
  org.joda.time.TestPeriod_Constructors#testConstructor_RI_RD_PeriodType1 NullPointerException
  org.joda.time.TestPeriod_Constructors#testConstructor_RI_RI1 NullPointerException
  org.joda.time.TestPeriod_Constructors#testConstructor_RI_RI2 NullPointerException
  org.joda.time.TestPeriod_Constructors#testConstructor_RI_RI3 NullPointerException
  org.joda.time.TestPeriod_Constructors#testConstructor_RI_RI4 NullPointerException
  org.joda.time.TestPeriod_Constructors#testConstructor_RI_RI6 NullPointerException
  org.joda.time.TestPeriod_Constructors#testConstructor_RI_RI7 NullPointerException
  org.joda.time.TestPeriod_Constructors#testConstructor_RI_RI_PeriodType1 NullPointerException
  org.joda.time.TestPeriod_Constructors#testConstructor_RI_RI_PeriodType2 NullPointerException
  org.joda.time.TestPeriod_Constructors#testConstructor_RI_RI_PeriodType3 NullPointerException
  org.joda.time.TestPeriod_Constructors#testConstructor_RI_RI_PeriodType4 NullPointerException
  org.joda.time.TestPeriod_Constructors#testConstructor_RP_RP1 NullPointerException
  org.joda.time.TestPeriod_Constructors#testConstructor_RP_RP2 NullPointerException
  org.joda.time.TestPeriod_Constructors#testConstructor_RP_RP2Local NullPointerException
  org.joda.time.TestPeriod_Constructors#testConstructor_RP_RP_PeriodType1 NullPointerException
  org.joda.time.TestPeriod_Constructors#testConstructor_long1 NullPointerException
  org.joda.time.TestPeriod_Constructors#testConstructor_long2 NullPointerException
  org.joda.time.TestPeriod_Constructors#testConstructor_long3 NullPointerException
  org.joda.time.TestPeriod_Constructors#testConstructor_long_Chronology1 NullPointerException
  org.joda.time.TestPeriod_Constructors#testConstructor_long_Chronology2 NullPointerException
  org.joda.time.TestPeriod_Constructors#testConstructor_long_Chronology3 NullPointerException
  org.joda.time.TestPeriod_Constructors#testConstructor_long_PeriodType1 NullPointerException
  org.joda.time.TestPeriod_Constructors#testConstructor_long_PeriodType3 NullPointerException
  org.joda.time.TestPeriod_Constructors#testConstructor_long_PeriodType4 NullPointerException
  org.joda.time.TestPeriod_Constructors#testConstructor_long_PeriodType_Chronology1 NullPointerException
  org.joda.time.TestPeriod_Constructors#testConstructor_long_PeriodType_Chronology2 NullPointerException
  org.joda.time.TestPeriod_Constructors#testConstructor_long_PeriodType_Chronology3 NullPointerException
  org.joda.time.TestPeriod_Constructors#testConstructor_long_PeriodType_Chronology4 NullPointerException
  org.joda.time.TestPeriod_Constructors#testConstructor_long_fixedZone NullPointerException
  org.joda.time.TestPeriod_Constructors#testConstructor_long_long1 NullPointerException
  org.joda.time.TestPeriod_Constructors#testConstructor_long_long2 NullPointerException
  org.joda.time.TestPeriod_Constructors#testConstructor_long_long_Chronology1 NullPointerException
  org.joda.time.TestPeriod_Constructors#testConstructor_long_long_Chronology2 NullPointerException
  org.joda.time.TestPeriod_Constructors#testConstructor_long_long_PeriodType1 NullPointerException
  org.joda.time.TestPeriod_Constructors#testConstructor_long_long_PeriodType2 NullPointerException
  org.joda.time.TestPeriod_Constructors#testConstructor_long_long_PeriodType3 NullPointerException
  org.joda.time.TestPeriod_Constructors#testConstructor_long_long_PeriodType_Chronology1 NullPointerException
  org.joda.time.TestPeriod_Constructors#testConstructor_long_long_PeriodType_Chronology2 NullPointerException
  org.joda.time.TestPeriod_Constructors#testConstructor_trickyDifferences_LD_LD_toFeb_endOfMonth1 NullPointerException
  org.joda.time.TestPeriod_Constructors#testConstructor_trickyDifferences_LD_LD_toFeb_endOfMonth2 NullPointerException
  org.joda.time.TestPeriod_Constructors#testConstructor_trickyDifferences_LD_LD_toFeb_endOfMonth3 NullPointerException
  org.joda.time.TestPeriod_Constructors#testConstructor_trickyDifferences_LD_LD_toFeb_exactMonths NullPointerException
  org.joda.time.TestPeriod_Constructors#testConstructor_trickyDifferences_LD_LD_toFeb_leapYear NullPointerException
  org.joda.time.TestPeriod_Constructors#testConstructor_trickyDifferences_LD_LD_toFeb_standardYear NullPointerException
  org.joda.time.TestPeriod_Constructors#testConstructor_trickyDifferences_LD_LD_toMar_endOfMonth1 NullPointerException
  org.joda.time.TestPeriod_Constructors#testConstructor_trickyDifferences_LD_LD_toMar_endOfMonth2 NullPointerException
  org.joda.time.TestPeriod_Constructors#testConstructor_trickyDifferences_RI_RI_toFeb_endOfMonth1 NullPointerException
  org.joda.time.TestPeriod_Constructors#testConstructor_trickyDifferences_RI_RI_toFeb_endOfMonth2 NullPointerException
  org.joda.time.TestPeriod_Constructors#testConstructor_trickyDifferences_RI_RI_toFeb_endOfMonth3 NullPointerException
  org.joda.time.TestPeriod_Constructors#testConstructor_trickyDifferences_RI_RI_toFeb_exactMonths NullPointerException
  org.joda.time.TestPeriod_Constructors#testConstructor_trickyDifferences_RI_RI_toFeb_leapYear NullPointerException
  org.joda.time.TestPeriod_Constructors#testConstructor_trickyDifferences_RI_RI_toFeb_standardYear NullPointerException
  org.joda.time.TestPeriod_Constructors#testConstructor_trickyDifferences_RI_RI_toMar_endOfMonth1 NullPointerException
  org.joda.time.TestPeriod_Constructors#testConstructor_trickyDifferences_RI_RI_toMar_endOfMonth2 NullPointerException
  org.joda.time.TestPeriod_Constructors#testToPeriod_PeriodType3 NullPointerException
  org.joda.time.TestStringConvert#testLocalTime NullPointerException
  org.joda.time.TestTimeOfDay_Basics#testCompareTo NullPointerException
  org.joda.time.chrono.TestBuddhistChronology#testDurationFields NullPointerException
  org.joda.time.chrono.TestCopticChronology#testDurationFields NullPointerException
  org.joda.time.chrono.TestEthiopicChronology#testDurationFields NullPointerException
  org.joda.time.chrono.TestGJChronology#testDurationFields NullPointerException
  org.joda.time.chrono.TestGregorianChronology#testDurationFields NullPointerException
  org.joda.time.chrono.TestISOChronology#testDurationFields NullPointerException
  org.joda.time.chrono.TestIslamicChronology#testDurationFields NullPointerException
  org.joda.time.chrono.TestJulianChronology#testDurationFields NullPointerException
  org.joda.time.convert.TestReadableDurationConverter#testSetInto_Object NullPointerException
  org.joda.time.convert.TestReadablePeriodConverter#testGetPeriodType_Object NullPointerException
  org.joda.time.field.TestBaseDateTimeField#test_add_RP_int_intarray_int NullPointerException
  org.joda.time.field.TestOffsetDateTimeField#test_add_RP_int_intarray_int NullPointerException
  org.joda.time.field.TestPreciseDateTimeField#test_add_RP_int_intarray_int NullPointerException
  org.joda.time.field.TestPreciseDurationDateTimeField#test_add_RP_int_intarray_int NullPointerException
  org.joda.time.field.TestPreciseDurationField#test_compareTo NullPointerException
  org.joda.time.field.TestPreciseDurationField#test_hashCode NullPointerException
  org.joda.time.field.TestScaledDurationField#test_compareTo NullPointerException
  org.joda.time.field.TestScaledDurationField#test_hashCode NullPointerException
  org.joda.time.format.TestISODateTimeFormat#testFormat_timeNoMillis_partial NullPointerException
  org.joda.time.format.TestISODateTimeFormat#testFormat_time_partial NullPointerException
  org.joda.time.format.TestISODateTimeFormat_Fields#testForFields_datetime_DM NullPointerException
  org.joda.time.format.TestISODateTimeFormat_Fields#testForFields_time_HM NullPointerException
  org.joda.time.format.TestISODateTimeFormat_Fields#testForFields_time_HMS NullPointerException
  org.joda.time.format.TestISODateTimeFormat_Fields#testForFields_time_HMSm NullPointerException
  org.joda.time.format.TestISODateTimeFormat_Fields#testForFields_time_HMm NullPointerException
  org.joda.time.format.TestISODateTimeFormat_Fields#testForFields_time_MS NullPointerException
  org.joda.time.format.TestISODateTimeFormat_Fields#testForFields_time_MSm NullPointerException
  org.joda.time.format.TestISODateTimeFormat_Fields#testForFields_time_Mm NullPointerException

Tests run: 4157, Failures: 12, Errors: 324, Skipped: 0

[INFO] ------------------------------------------------------------------------
[INFO] BUILD FAILURE
[INFO] ------------------------------------------------------------------------
[INFO] Total time: 17.101s
[INFO] Finished at: Wed Aug 05 21:40:34 BST 2015
[INFO] Final Memory: 10M/345M
[INFO] ------------------------------------------------------------------------
[ERROR] Failed to execute goal org.apache.maven.plugins:maven-surefire-plugin:2.18.1:test (default-test) on project joda-time: There are test failures.
[ERROR] 
[ERROR] Please refer to /home/perham/Study/LittleDarwin/Cases/joda-time-2.8.1/target/surefire-reports for the individual test results.
[ERROR] -> [Help 1]
[ERROR] 
[ERROR] To see the full stack trace of the errors, re-run Maven with the -e switch.
[ERROR] Re-run Maven using the -X switch to enable full debug logging.
[ERROR] 
[ERROR] For more information about the errors and possible solutions, please read the following articles:
[ERROR] [Help 1] http://cwiki.apache.org/confluence/display/MAVEN/MojoFailureException
