[INFO] Scanning for projects...
[INFO]                                                                         
[INFO] ------------------------------------------------------------------------
[INFO] Building Joda-Time 2.8.1
[INFO] ------------------------------------------------------------------------
[INFO] 
[INFO] --- maven-resources-plugin:2.7:resources (default-resources) @ joda-time ---
[INFO] Using 'UTF-8' encoding to copy filtered resources.
[INFO] Copying 2 resources to META-INF
[INFO] Copying 10 resources
[INFO] 
[INFO] --- maven-compiler-plugin:3.3:compile (default-compile) @ joda-time ---
[INFO] Changes detected - recompiling the module!
[INFO] Compiling 166 source files to /home/perham/Study/LittleDarwin/Cases/joda-time-2.8.1/target/classes
[INFO] 
[INFO] --- exec-maven-plugin:1.4.0:java (compile-tzdb) @ joda-time ---
Writing zoneinfo files
Writing ZoneInfoMap
[INFO] 
[INFO] --- maven-resources-plugin:2.7:testResources (default-testResources) @ joda-time ---
[INFO] Using 'UTF-8' encoding to copy filtered resources.
[INFO] Copying 34 resources
[INFO] 
[INFO] --- maven-compiler-plugin:3.3:testCompile (default-testCompile) @ joda-time ---
[INFO] Nothing to compile - all classes are up to date
[INFO] 
[INFO] --- maven-surefire-plugin:2.18.1:test (default-test) @ joda-time ---
[INFO] Surefire report directory: /home/perham/Study/LittleDarwin/Cases/joda-time-2.8.1/target/surefire-reports

-------------------------------------------------------
 T E S T S
-------------------------------------------------------
Running org.joda.time.TestAllPackages

TestBuddhistChronology.testCalendar

TestCopticChronology.testCalendar

TestEthiopicChronology.testCalendar

TestIslamicChronology.testCalendar

Testing Gregorian chronology over 1000 iterations
100% complete (i=1000)

Testing Julian chronology over 1000 iterations
100% complete (i=1000)
Writing zoneinfo files
Writing ZoneInfoMap
Tests run: 4157, Failures: 20, Errors: 178, Skipped: 0, Time elapsed: 5.583 sec <<< FAILURE! - in org.joda.time.TestAllPackages
test_weeks(org.joda.time.TestDurationFieldType)  Time elapsed: 0.015 sec  <<< ERROR!
java.lang.NullPointerException
	at org.joda.time.TestDurationFieldType.test_weeks(TestDurationFieldType.java:99)

testWithDurationAdded_RP_int(org.joda.time.TestDateTime_Basics)  Time elapsed: 0.001 sec  <<< ERROR!
java.lang.NullPointerException
	at org.joda.time.chrono.BaseChronology.add(BaseChronology.java:307)
	at org.joda.time.DateTime.withPeriodAdded(DateTime.java:941)
	at org.joda.time.TestDateTime_Basics.testWithDurationAdded_RP_int(TestDateTime_Basics.java:1018)

testPlus_RP(org.joda.time.TestDateTime_Basics)  Time elapsed: 0.001 sec  <<< ERROR!
java.lang.NullPointerException
	at org.joda.time.chrono.BaseChronology.add(BaseChronology.java:307)
	at org.joda.time.DateTime.withPeriodAdded(DateTime.java:941)
	at org.joda.time.DateTime.plus(DateTime.java:997)
	at org.joda.time.TestDateTime_Basics.testPlus_RP(TestDateTime_Basics.java:1057)

testPlusWeeks_int(org.joda.time.TestDateTime_Basics)  Time elapsed: 0.003 sec  <<< ERROR!
java.lang.NullPointerException
	at org.joda.time.DateTime.plusWeeks(DateTime.java:1083)
	at org.joda.time.TestDateTime_Basics.testPlusWeeks_int(TestDateTime_Basics.java:1087)

testMinus_RP(org.joda.time.TestDateTime_Basics)  Time elapsed: 0.001 sec  <<< ERROR!
java.lang.NullPointerException
	at org.joda.time.chrono.BaseChronology.add(BaseChronology.java:307)
	at org.joda.time.DateTime.withPeriodAdded(DateTime.java:941)
	at org.joda.time.DateTime.minus(DateTime.java:1286)
	at org.joda.time.TestDateTime_Basics.testMinus_RP(TestDateTime_Basics.java:1165)

testMinusWeeks_int(org.joda.time.TestDateTime_Basics)  Time elapsed: 0.001 sec  <<< ERROR!
java.lang.NullPointerException
	at org.joda.time.DateTime.minusWeeks(DateTime.java:1372)
	at org.joda.time.TestDateTime_Basics.testMinusWeeks_int(TestDateTime_Basics.java:1195)

testPropertyGetDayOfWeek(org.joda.time.TestDateTime_Properties)  Time elapsed: 0.001 sec  <<< FAILURE!
junit.framework.AssertionFailedError: expected:<null> but was:<UnsupportedDurationField[weeks]>
	at junit.framework.Assert.fail(Assert.java:47)
	at junit.framework.Assert.failNotEquals(Assert.java:280)
	at junit.framework.Assert.assertEquals(Assert.java:64)
	at junit.framework.Assert.assertEquals(Assert.java:71)
	at org.joda.time.TestDateTime_Properties.testPropertyGetDayOfWeek(TestDateTime_Properties.java:969)

testPropertyGetWeekOfWeekyear(org.joda.time.TestDateTime_Properties)  Time elapsed: 0.001 sec  <<< FAILURE!
junit.framework.AssertionFailedError: expected:<null> but was:<DurationField[weeks]>
	at junit.framework.Assert.fail(Assert.java:47)
	at junit.framework.Assert.failNotEquals(Assert.java:280)
	at junit.framework.Assert.assertEquals(Assert.java:64)
	at junit.framework.Assert.assertEquals(Assert.java:71)
	at org.joda.time.TestDateTime_Properties.testPropertyGetWeekOfWeekyear(TestDateTime_Properties.java:851)

testAddWeeks_int1(org.joda.time.TestMutableDateTime_Adds)  Time elapsed: 0 sec  <<< ERROR!
java.lang.NullPointerException
	at org.joda.time.MutableDateTime.addWeeks(MutableDateTime.java:731)
	at org.joda.time.TestMutableDateTime_Adds.testAddWeeks_int1(TestMutableDateTime_Adds.java:284)

testPropertyGetDayOfWeek(org.joda.time.TestMutableDateTime_Properties)  Time elapsed: 0 sec  <<< FAILURE!
junit.framework.AssertionFailedError: expected:<null> but was:<UnsupportedDurationField[weeks]>
	at junit.framework.Assert.fail(Assert.java:47)
	at junit.framework.Assert.failNotEquals(Assert.java:280)
	at junit.framework.Assert.assertEquals(Assert.java:64)
	at junit.framework.Assert.assertEquals(Assert.java:71)
	at org.joda.time.TestMutableDateTime_Properties.testPropertyGetDayOfWeek(TestMutableDateTime_Properties.java:453)

testPropertyGetWeekOfWeekyear(org.joda.time.TestMutableDateTime_Properties)  Time elapsed: 0 sec  <<< FAILURE!
junit.framework.AssertionFailedError: expected:<null> but was:<DurationField[weeks]>
	at junit.framework.Assert.fail(Assert.java:47)
	at junit.framework.Assert.failNotEquals(Assert.java:280)
	at junit.framework.Assert.assertEquals(Assert.java:64)
	at junit.framework.Assert.assertEquals(Assert.java:71)
	at org.joda.time.TestMutableDateTime_Properties.testPropertyGetWeekOfWeekyear(TestMutableDateTime_Properties.java:408)

testWithDurationAdded_RP_int(org.joda.time.TestDateMidnight_Basics)  Time elapsed: 0.001 sec  <<< ERROR!
java.lang.NullPointerException
	at org.joda.time.chrono.BaseChronology.add(BaseChronology.java:307)
	at org.joda.time.DateMidnight.withPeriodAdded(DateMidnight.java:556)
	at org.joda.time.TestDateMidnight_Basics.testWithDurationAdded_RP_int(TestDateMidnight_Basics.java:831)

testPlus_RP(org.joda.time.TestDateMidnight_Basics)  Time elapsed: 0 sec  <<< ERROR!
java.lang.NullPointerException
	at org.joda.time.chrono.BaseChronology.add(BaseChronology.java:307)
	at org.joda.time.DateMidnight.withPeriodAdded(DateMidnight.java:556)
	at org.joda.time.DateMidnight.plus(DateMidnight.java:601)
	at org.joda.time.TestDateMidnight_Basics.testPlus_RP(TestDateMidnight_Basics.java:870)

testPlusWeeks_int(org.joda.time.TestDateMidnight_Basics)  Time elapsed: 0 sec  <<< ERROR!
java.lang.NullPointerException
	at org.joda.time.DateMidnight.plusWeeks(DateMidnight.java:673)
	at org.joda.time.TestDateMidnight_Basics.testPlusWeeks_int(TestDateMidnight_Basics.java:900)

testMinus_RP(org.joda.time.TestDateMidnight_Basics)  Time elapsed: 0 sec  <<< ERROR!
java.lang.NullPointerException
	at org.joda.time.chrono.BaseChronology.add(BaseChronology.java:307)
	at org.joda.time.DateMidnight.withPeriodAdded(DateMidnight.java:556)
	at org.joda.time.DateMidnight.minus(DateMidnight.java:742)
	at org.joda.time.TestDateMidnight_Basics.testMinus_RP(TestDateMidnight_Basics.java:938)

testMinusWeeks_int(org.joda.time.TestDateMidnight_Basics)  Time elapsed: 0 sec  <<< ERROR!
java.lang.NullPointerException
	at org.joda.time.DateMidnight.minusWeeks(DateMidnight.java:814)
	at org.joda.time.TestDateMidnight_Basics.testMinusWeeks_int(TestDateMidnight_Basics.java:968)

testPropertyGetDayOfWeek(org.joda.time.TestDateMidnight_Properties)  Time elapsed: 0.001 sec  <<< FAILURE!
junit.framework.AssertionFailedError: expected:<null> but was:<UnsupportedDurationField[weeks]>
	at junit.framework.Assert.fail(Assert.java:47)
	at junit.framework.Assert.failNotEquals(Assert.java:280)
	at junit.framework.Assert.assertEquals(Assert.java:64)
	at junit.framework.Assert.assertEquals(Assert.java:71)
	at org.joda.time.TestDateMidnight_Properties.testPropertyGetDayOfWeek(TestDateMidnight_Properties.java:466)

testPropertyGetWeekOfWeekyear(org.joda.time.TestDateMidnight_Properties)  Time elapsed: 0 sec  <<< FAILURE!
junit.framework.AssertionFailedError: expected:<null> but was:<DurationField[weeks]>
	at junit.framework.Assert.fail(Assert.java:47)
	at junit.framework.Assert.failNotEquals(Assert.java:280)
	at junit.framework.Assert.assertEquals(Assert.java:64)
	at junit.framework.Assert.assertEquals(Assert.java:71)
	at org.joda.time.TestDateMidnight_Properties.testPropertyGetWeekOfWeekyear(TestDateMidnight_Properties.java:443)

testToPeriod_PeriodType(org.joda.time.TestDuration_Basics)  Time elapsed: 0 sec  <<< ERROR!
java.lang.NullPointerException
	at org.joda.time.chrono.BaseChronology.get(BaseChronology.java:284)
	at org.joda.time.base.BasePeriod.<init>(BasePeriod.java:258)
	at org.joda.time.Period.<init>(Period.java:402)
	at org.joda.time.base.BaseDuration.toPeriod(BaseDuration.java:144)
	at org.joda.time.TestDuration_Basics.testToPeriod_PeriodType(TestDuration_Basics.java:502)

testToPeriod_Chronology(org.joda.time.TestDuration_Basics)  Time elapsed: 0.001 sec  <<< ERROR!
java.lang.NullPointerException
	at org.joda.time.chrono.BaseChronology.get(BaseChronology.java:284)
	at org.joda.time.base.BasePeriod.<init>(BasePeriod.java:258)
	at org.joda.time.Period.<init>(Period.java:423)
	at org.joda.time.base.BaseDuration.toPeriod(BaseDuration.java:164)
	at org.joda.time.TestDuration_Basics.testToPeriod_Chronology(TestDuration_Basics.java:515)

testToPeriod_PeriodType_Chronology(org.joda.time.TestDuration_Basics)  Time elapsed: 0 sec  <<< ERROR!
java.lang.NullPointerException
	at org.joda.time.chrono.BaseChronology.get(BaseChronology.java:284)
	at org.joda.time.base.BasePeriod.<init>(BasePeriod.java:258)
	at org.joda.time.Period.<init>(Period.java:444)
	at org.joda.time.base.BaseDuration.toPeriod(BaseDuration.java:185)
	at org.joda.time.TestDuration_Basics.testToPeriod_PeriodType_Chronology(TestDuration_Basics.java:528)

testToPeriodFrom(org.joda.time.TestDuration_Basics)  Time elapsed: 0.001 sec  <<< ERROR!
java.lang.NullPointerException
	at org.joda.time.chrono.BaseChronology.get(BaseChronology.java:260)
	at org.joda.time.base.BasePeriod.<init>(BasePeriod.java:201)
	at org.joda.time.Period.<init>(Period.java:626)
	at org.joda.time.base.BaseDuration.toPeriodFrom(BaseDuration.java:200)
	at org.joda.time.TestDuration_Basics.testToPeriodFrom(TestDuration_Basics.java:542)

testToPeriodFrom_PeriodType(org.joda.time.TestDuration_Basics)  Time elapsed: 0.001 sec  <<< ERROR!
java.lang.NullPointerException
	at org.joda.time.chrono.BaseChronology.get(BaseChronology.java:260)
	at org.joda.time.base.BasePeriod.<init>(BasePeriod.java:201)
	at org.joda.time.Period.<init>(Period.java:637)
	at org.joda.time.base.BaseDuration.toPeriodFrom(BaseDuration.java:216)
	at org.joda.time.TestDuration_Basics.testToPeriodFrom_PeriodType(TestDuration_Basics.java:555)

testToPeriodTo(org.joda.time.TestDuration_Basics)  Time elapsed: 0 sec  <<< ERROR!
java.lang.NullPointerException
	at org.joda.time.chrono.BaseChronology.get(BaseChronology.java:260)
	at org.joda.time.base.BasePeriod.<init>(BasePeriod.java:219)
	at org.joda.time.Period.<init>(Period.java:647)
	at org.joda.time.base.BaseDuration.toPeriodTo(BaseDuration.java:232)
	at org.joda.time.TestDuration_Basics.testToPeriodTo(TestDuration_Basics.java:568)

testToPeriodTo_PeriodType(org.joda.time.TestDuration_Basics)  Time elapsed: 0.001 sec  <<< ERROR!
java.lang.NullPointerException
	at org.joda.time.chrono.BaseChronology.get(BaseChronology.java:260)
	at org.joda.time.base.BasePeriod.<init>(BasePeriod.java:219)
	at org.joda.time.Period.<init>(Period.java:658)
	at org.joda.time.base.BaseDuration.toPeriodTo(BaseDuration.java:249)
	at org.joda.time.TestDuration_Basics.testToPeriodTo_PeriodType(TestDuration_Basics.java:581)

testToPeriod_PeriodType1(org.joda.time.TestInterval_Basics)  Time elapsed: 0.001 sec  <<< ERROR!
java.lang.NullPointerException
	at org.joda.time.chrono.BaseChronology.get(BaseChronology.java:260)
	at org.joda.time.base.BasePeriod.<init>(BasePeriod.java:110)
	at org.joda.time.Period.<init>(Period.java:490)
	at org.joda.time.base.AbstractInterval.toPeriod(AbstractInterval.java:447)
	at org.joda.time.TestInterval_Basics.testToPeriod_PeriodType1(TestInterval_Basics.java:1008)

testToPeriod_PeriodType2(org.joda.time.TestInterval_Basics)  Time elapsed: 0.001 sec  <<< ERROR!
java.lang.NullPointerException
	at org.joda.time.chrono.BaseChronology.get(BaseChronology.java:260)
	at org.joda.time.base.BasePeriod.<init>(BasePeriod.java:110)
	at org.joda.time.Period.<init>(Period.java:490)
	at org.joda.time.base.AbstractInterval.toPeriod(AbstractInterval.java:447)
	at org.joda.time.TestInterval_Basics.testToPeriod_PeriodType2(TestInterval_Basics.java:1018)

testToPeriod(org.joda.time.TestInterval_Basics)  Time elapsed: 0.001 sec  <<< ERROR!
java.lang.NullPointerException
	at org.joda.time.chrono.BaseChronology.get(BaseChronology.java:260)
	at org.joda.time.base.BasePeriod.<init>(BasePeriod.java:110)
	at org.joda.time.Period.<init>(Period.java:478)
	at org.joda.time.base.AbstractInterval.toPeriod(AbstractInterval.java:433)
	at org.joda.time.TestInterval_Basics.testToPeriod(TestInterval_Basics.java:997)

testPlus_RP(org.joda.time.TestLocalDateTime_Basics)  Time elapsed: 0.001 sec  <<< ERROR!
java.lang.NullPointerException
	at org.joda.time.chrono.BaseChronology.add(BaseChronology.java:307)
	at org.joda.time.LocalDateTime.withPeriodAdded(LocalDateTime.java:1062)
	at org.joda.time.LocalDateTime.plus(LocalDateTime.java:1094)
	at org.joda.time.TestLocalDateTime_Basics.testPlus_RP(TestLocalDateTime_Basics.java:535)

testPlusWeeks_int(org.joda.time.TestLocalDateTime_Basics)  Time elapsed: 0 sec  <<< ERROR!
java.lang.NullPointerException
	at org.joda.time.LocalDateTime.plusWeeks(LocalDateTime.java:1163)
	at org.joda.time.TestLocalDateTime_Basics.testPlusWeeks_int(TestLocalDateTime_Basics.java:565)

testMinus_RP(org.joda.time.TestLocalDateTime_Basics)  Time elapsed: 0.001 sec  <<< ERROR!
java.lang.NullPointerException
	at org.joda.time.chrono.BaseChronology.add(BaseChronology.java:307)
	at org.joda.time.LocalDateTime.withPeriodAdded(LocalDateTime.java:1062)
	at org.joda.time.LocalDateTime.minus(LocalDateTime.java:1311)
	at org.joda.time.TestLocalDateTime_Basics.testMinus_RP(TestLocalDateTime_Basics.java:626)

testMinusWeeks_int(org.joda.time.TestLocalDateTime_Basics)  Time elapsed: 0 sec  <<< ERROR!
java.lang.NullPointerException
	at org.joda.time.LocalDateTime.minusWeeks(LocalDateTime.java:1380)
	at org.joda.time.TestLocalDateTime_Basics.testMinusWeeks_int(TestLocalDateTime_Basics.java:657)

testIsSupported_DurationFieldType(org.joda.time.TestLocalDateTime_Basics)  Time elapsed: 0 sec  <<< ERROR!
java.lang.NullPointerException
	at org.joda.time.LocalDateTime.isSupported(LocalDateTime.java:639)
	at org.joda.time.TestLocalDateTime_Basics.testIsSupported_DurationFieldType(TestLocalDateTime_Basics.java:270)

testPlus_RP(org.joda.time.TestLocalDate_Basics)  Time elapsed: 0 sec  <<< ERROR!
java.lang.NullPointerException
	at org.joda.time.LocalDate.isSupported(LocalDate.java:596)
	at org.joda.time.LocalDate.withPeriodAdded(LocalDate.java:1168)
	at org.joda.time.LocalDate.plus(LocalDate.java:1193)
	at org.joda.time.TestLocalDate_Basics.testPlus_RP(TestLocalDate_Basics.java:519)

testPlusWeeks_int(org.joda.time.TestLocalDate_Basics)  Time elapsed: 0.004 sec  <<< ERROR!
java.lang.NullPointerException
	at org.joda.time.LocalDate.plusWeeks(LocalDate.java:1267)
	at org.joda.time.TestLocalDate_Basics.testPlusWeeks_int(TestLocalDate_Basics.java:549)

testMinus_RP(org.joda.time.TestLocalDate_Basics)  Time elapsed: 0 sec  <<< ERROR!
java.lang.NullPointerException
	at org.joda.time.LocalDate.isSupported(LocalDate.java:596)
	at org.joda.time.LocalDate.withPeriodAdded(LocalDate.java:1168)
	at org.joda.time.LocalDate.minus(LocalDate.java:1312)
	at org.joda.time.TestLocalDate_Basics.testMinus_RP(TestLocalDate_Basics.java:570)

testMinusWeeks_int(org.joda.time.TestLocalDate_Basics)  Time elapsed: 0 sec  <<< ERROR!
java.lang.NullPointerException
	at org.joda.time.LocalDate.minusWeeks(LocalDate.java:1386)
	at org.joda.time.TestLocalDate_Basics.testMinusWeeks_int(TestLocalDate_Basics.java:604)

testIsSupported_DurationFieldType(org.joda.time.TestLocalDate_Basics)  Time elapsed: 0 sec  <<< ERROR!
java.lang.NullPointerException
	at org.joda.time.LocalDate.isSupported(LocalDate.java:596)
	at org.joda.time.TestLocalDate_Basics.testIsSupported_DurationFieldType(TestLocalDate_Basics.java:236)

testPlus_RP(org.joda.time.TestLocalTime_Basics)  Time elapsed: 0 sec  <<< ERROR!
java.lang.NullPointerException
	at org.joda.time.chrono.BaseChronology.add(BaseChronology.java:307)
	at org.joda.time.LocalTime.withPeriodAdded(LocalTime.java:848)
	at org.joda.time.LocalTime.plus(LocalTime.java:867)
	at org.joda.time.TestLocalTime_Basics.testPlus_RP(TestLocalTime_Basics.java:540)

testMinus_RP(org.joda.time.TestLocalTime_Basics)  Time elapsed: 0 sec  <<< ERROR!
java.lang.NullPointerException
	at org.joda.time.chrono.BaseChronology.add(BaseChronology.java:307)
	at org.joda.time.LocalTime.withPeriodAdded(LocalTime.java:848)
	at org.joda.time.LocalTime.minus(LocalTime.java:978)
	at org.joda.time.TestLocalTime_Basics.testMinus_RP(TestLocalTime_Basics.java:591)

testToPeriod_PeriodType1(org.joda.time.TestMutableInterval_Basics)  Time elapsed: 0 sec  <<< ERROR!
java.lang.NullPointerException
	at org.joda.time.chrono.BaseChronology.get(BaseChronology.java:260)
	at org.joda.time.base.BasePeriod.<init>(BasePeriod.java:110)
	at org.joda.time.Period.<init>(Period.java:490)
	at org.joda.time.base.AbstractInterval.toPeriod(AbstractInterval.java:447)
	at org.joda.time.TestMutableInterval_Basics.testToPeriod_PeriodType1(TestMutableInterval_Basics.java:433)

testToPeriod_PeriodType2(org.joda.time.TestMutableInterval_Basics)  Time elapsed: 0 sec  <<< ERROR!
java.lang.NullPointerException
	at org.joda.time.chrono.BaseChronology.get(BaseChronology.java:260)
	at org.joda.time.base.BasePeriod.<init>(BasePeriod.java:110)
	at org.joda.time.Period.<init>(Period.java:490)
	at org.joda.time.base.AbstractInterval.toPeriod(AbstractInterval.java:447)
	at org.joda.time.TestMutableInterval_Basics.testToPeriod_PeriodType2(TestMutableInterval_Basics.java:443)

testToPeriod(org.joda.time.TestMutableInterval_Basics)  Time elapsed: 0 sec  <<< ERROR!
java.lang.NullPointerException
	at org.joda.time.chrono.BaseChronology.get(BaseChronology.java:260)
	at org.joda.time.base.BasePeriod.<init>(BasePeriod.java:110)
	at org.joda.time.Period.<init>(Period.java:478)
	at org.joda.time.base.AbstractInterval.toPeriod(AbstractInterval.java:433)
	at org.joda.time.TestMutableInterval_Basics.testToPeriod(TestMutableInterval_Basics.java:422)

testConstructor_RI_RI6(org.joda.time.TestPeriod_Constructors)  Time elapsed: 0.002 sec  <<< ERROR!
java.lang.NullPointerException
	at org.joda.time.chrono.BaseChronology.get(BaseChronology.java:260)
	at org.joda.time.base.BasePeriod.<init>(BasePeriod.java:132)
	at org.joda.time.Period.<init>(Period.java:519)
	at org.joda.time.TestPeriod_Constructors.testConstructor_RI_RI6(TestPeriod_Constructors.java:696)

testConstructor_RI_RI7(org.joda.time.TestPeriod_Constructors)  Time elapsed: 0.002 sec  <<< ERROR!
java.lang.NullPointerException
	at org.joda.time.chrono.BaseChronology.get(BaseChronology.java:260)
	at org.joda.time.base.BasePeriod.<init>(BasePeriod.java:132)
	at org.joda.time.Period.<init>(Period.java:519)
	at org.joda.time.TestPeriod_Constructors.testConstructor_RI_RI7(TestPeriod_Constructors.java:712)

testConstructor_long_long2(org.joda.time.TestPeriod_Constructors)  Time elapsed: 0.001 sec  <<< ERROR!
java.lang.NullPointerException
	at org.joda.time.chrono.BaseChronology.get(BaseChronology.java:260)
	at org.joda.time.base.BasePeriod.<init>(BasePeriod.java:110)
	at org.joda.time.Period.<init>(Period.java:455)
	at org.joda.time.TestPeriod_Constructors.testConstructor_long_long2(TestPeriod_Constructors.java:480)

testConstructor_RI_RD1(org.joda.time.TestPeriod_Constructors)  Time elapsed: 0.002 sec  <<< ERROR!
java.lang.NullPointerException
	at org.joda.time.chrono.BaseChronology.get(BaseChronology.java:260)
	at org.joda.time.base.BasePeriod.<init>(BasePeriod.java:201)
	at org.joda.time.Period.<init>(Period.java:626)
	at org.joda.time.TestPeriod_Constructors.testConstructor_RI_RD1(TestPeriod_Constructors.java:1017)

testConstructor_RD_RI1(org.joda.time.TestPeriod_Constructors)  Time elapsed: 0.002 sec  <<< ERROR!
java.lang.NullPointerException
	at org.joda.time.chrono.BaseChronology.get(BaseChronology.java:260)
	at org.joda.time.base.BasePeriod.<init>(BasePeriod.java:219)
	at org.joda.time.Period.<init>(Period.java:647)
	at org.joda.time.TestPeriod_Constructors.testConstructor_RD_RI1(TestPeriod_Constructors.java:1081)

testConstructor_long_long1(org.joda.time.TestPeriod_Constructors)  Time elapsed: 0.001 sec  <<< ERROR!
java.lang.NullPointerException
	at org.joda.time.chrono.BaseChronology.get(BaseChronology.java:260)
	at org.joda.time.base.BasePeriod.<init>(BasePeriod.java:110)
	at org.joda.time.Period.<init>(Period.java:455)
	at org.joda.time.TestPeriod_Constructors.testConstructor_long_long1(TestPeriod_Constructors.java:465)

testConstructor_RI_RI1(org.joda.time.TestPeriod_Constructors)  Time elapsed: 0 sec  <<< ERROR!
java.lang.NullPointerException
	at org.joda.time.chrono.BaseChronology.get(BaseChronology.java:260)
	at org.joda.time.base.BasePeriod.<init>(BasePeriod.java:132)
	at org.joda.time.Period.<init>(Period.java:519)
	at org.joda.time.TestPeriod_Constructors.testConstructor_RI_RI1(TestPeriod_Constructors.java:620)

testConstructor_RI_RI2(org.joda.time.TestPeriod_Constructors)  Time elapsed: 0 sec  <<< ERROR!
java.lang.NullPointerException
	at org.joda.time.chrono.BaseChronology.get(BaseChronology.java:260)
	at org.joda.time.base.BasePeriod.<init>(BasePeriod.java:132)
	at org.joda.time.Period.<init>(Period.java:519)
	at org.joda.time.TestPeriod_Constructors.testConstructor_RI_RI2(TestPeriod_Constructors.java:635)

testConstructor_RI_RI3(org.joda.time.TestPeriod_Constructors)  Time elapsed: 0.001 sec  <<< ERROR!
java.lang.NullPointerException
	at org.joda.time.chrono.BaseChronology.get(BaseChronology.java:260)
	at org.joda.time.base.BasePeriod.<init>(BasePeriod.java:132)
	at org.joda.time.Period.<init>(Period.java:519)
	at org.joda.time.TestPeriod_Constructors.testConstructor_RI_RI3(TestPeriod_Constructors.java:650)

testConstructor_RI_RI4(org.joda.time.TestPeriod_Constructors)  Time elapsed: 0.001 sec  <<< ERROR!
java.lang.NullPointerException
	at org.joda.time.chrono.BaseChronology.get(BaseChronology.java:260)
	at org.joda.time.base.BasePeriod.<init>(BasePeriod.java:132)
	at org.joda.time.Period.<init>(Period.java:519)
	at org.joda.time.TestPeriod_Constructors.testConstructor_RI_RI4(TestPeriod_Constructors.java:665)

testConstructor_long_Chronology2(org.joda.time.TestPeriod_Constructors)  Time elapsed: 0.002 sec  <<< ERROR!
java.lang.NullPointerException
	at org.joda.time.chrono.BaseChronology.get(BaseChronology.java:284)
	at org.joda.time.base.BasePeriod.<init>(BasePeriod.java:258)
	at org.joda.time.Period.<init>(Period.java:423)
	at org.joda.time.TestPeriod_Constructors.testConstructor_long_Chronology2(TestPeriod_Constructors.java:292)

testConstructor_long_Chronology3(org.joda.time.TestPeriod_Constructors)  Time elapsed: 0 sec  <<< ERROR!
java.lang.NullPointerException
	at org.joda.time.chrono.BaseChronology.get(BaseChronology.java:284)
	at org.joda.time.base.BasePeriod.<init>(BasePeriod.java:258)
	at org.joda.time.Period.<init>(Period.java:423)
	at org.joda.time.TestPeriod_Constructors.testConstructor_long_Chronology3(TestPeriod_Constructors.java:309)

testConstructor_long_PeriodType_Chronology2(org.joda.time.TestPeriod_Constructors)  Time elapsed: 0 sec  <<< ERROR!
java.lang.NullPointerException
	at org.joda.time.chrono.BaseChronology.get(BaseChronology.java:284)
	at org.joda.time.base.BasePeriod.<init>(BasePeriod.java:258)
	at org.joda.time.Period.<init>(Period.java:444)
	at org.joda.time.TestPeriod_Constructors.testConstructor_long_PeriodType_Chronology2(TestPeriod_Constructors.java:344)

testConstructor_long_PeriodType_Chronology3(org.joda.time.TestPeriod_Constructors)  Time elapsed: 0.003 sec  <<< ERROR!
java.lang.NullPointerException
	at org.joda.time.chrono.BaseChronology.get(BaseChronology.java:284)
	at org.joda.time.base.BasePeriod.<init>(BasePeriod.java:258)
	at org.joda.time.Period.<init>(Period.java:444)
	at org.joda.time.TestPeriod_Constructors.testConstructor_long_PeriodType_Chronology3(TestPeriod_Constructors.java:361)

testConstructor_long_PeriodType_Chronology4(org.joda.time.TestPeriod_Constructors)  Time elapsed: 0 sec  <<< ERROR!
java.lang.NullPointerException
	at org.joda.time.chrono.BaseChronology.get(BaseChronology.java:284)
	at org.joda.time.base.BasePeriod.<init>(BasePeriod.java:258)
	at org.joda.time.Period.<init>(Period.java:444)
	at org.joda.time.TestPeriod_Constructors.testConstructor_long_PeriodType_Chronology4(TestPeriod_Constructors.java:378)

testConstructor_long_long_PeriodType1(org.joda.time.TestPeriod_Constructors)  Time elapsed: 0 sec  <<< ERROR!
java.lang.NullPointerException
	at org.joda.time.chrono.BaseChronology.get(BaseChronology.java:260)
	at org.joda.time.base.BasePeriod.<init>(BasePeriod.java:110)
	at org.joda.time.Period.<init>(Period.java:466)
	at org.joda.time.TestPeriod_Constructors.testConstructor_long_long_PeriodType1(TestPeriod_Constructors.java:496)

testConstructor_long_long_PeriodType3(org.joda.time.TestPeriod_Constructors)  Time elapsed: 0 sec  <<< ERROR!
java.lang.NullPointerException
	at org.joda.time.chrono.BaseChronology.get(BaseChronology.java:260)
	at org.joda.time.base.BasePeriod.<init>(BasePeriod.java:110)
	at org.joda.time.Period.<init>(Period.java:466)
	at org.joda.time.TestPeriod_Constructors.testConstructor_long_long_PeriodType3(TestPeriod_Constructors.java:526)

testToPeriod_PeriodType3(org.joda.time.TestPeriod_Constructors)  Time elapsed: 0 sec  <<< ERROR!
java.lang.NullPointerException
	at org.joda.time.chrono.BaseChronology.get(BaseChronology.java:260)
	at org.joda.time.base.BasePeriod.<init>(BasePeriod.java:110)
	at org.joda.time.Period.<init>(Period.java:466)
	at org.joda.time.TestPeriod_Constructors.testToPeriod_PeriodType3(TestPeriod_Constructors.java:541)

testConstructor_long_long_PeriodType_Chronology1(org.joda.time.TestPeriod_Constructors)  Time elapsed: 0 sec  <<< ERROR!
java.lang.NullPointerException
	at org.joda.time.chrono.BaseChronology.get(BaseChronology.java:260)
	at org.joda.time.base.BasePeriod.<init>(BasePeriod.java:110)
	at org.joda.time.Period.<init>(Period.java:490)
	at org.joda.time.TestPeriod_Constructors.testConstructor_long_long_PeriodType_Chronology1(TestPeriod_Constructors.java:589)

testConstructor_long_long_PeriodType_Chronology2(org.joda.time.TestPeriod_Constructors)  Time elapsed: 0 sec  <<< ERROR!
java.lang.NullPointerException
	at org.joda.time.chrono.BaseChronology.get(BaseChronology.java:260)
	at org.joda.time.base.BasePeriod.<init>(BasePeriod.java:110)
	at org.joda.time.Period.<init>(Period.java:490)
	at org.joda.time.TestPeriod_Constructors.testConstructor_long_long_PeriodType_Chronology2(TestPeriod_Constructors.java:604)

testConstructor_RI_RI_PeriodType1(org.joda.time.TestPeriod_Constructors)  Time elapsed: 0 sec  <<< ERROR!
java.lang.NullPointerException
	at org.joda.time.chrono.BaseChronology.get(BaseChronology.java:260)
	at org.joda.time.base.BasePeriod.<init>(BasePeriod.java:132)
	at org.joda.time.Period.<init>(Period.java:548)
	at org.joda.time.TestPeriod_Constructors.testConstructor_RI_RI_PeriodType1(TestPeriod_Constructors.java:728)

testConstructor_RI_RI_PeriodType3(org.joda.time.TestPeriod_Constructors)  Time elapsed: 0.001 sec  <<< ERROR!
java.lang.NullPointerException
	at org.joda.time.chrono.BaseChronology.get(BaseChronology.java:260)
	at org.joda.time.base.BasePeriod.<init>(BasePeriod.java:132)
	at org.joda.time.Period.<init>(Period.java:548)
	at org.joda.time.TestPeriod_Constructors.testConstructor_RI_RI_PeriodType3(TestPeriod_Constructors.java:758)

testConstructor_RI_RI_PeriodType4(org.joda.time.TestPeriod_Constructors)  Time elapsed: 0 sec  <<< ERROR!
java.lang.NullPointerException
	at org.joda.time.chrono.BaseChronology.get(BaseChronology.java:260)
	at org.joda.time.base.BasePeriod.<init>(BasePeriod.java:132)
	at org.joda.time.Period.<init>(Period.java:548)
	at org.joda.time.TestPeriod_Constructors.testConstructor_RI_RI_PeriodType4(TestPeriod_Constructors.java:773)

testConstructor_long_PeriodType1(org.joda.time.TestPeriod_Constructors)  Time elapsed: 0 sec  <<< ERROR!
java.lang.NullPointerException
	at org.joda.time.chrono.BaseChronology.get(BaseChronology.java:284)
	at org.joda.time.base.BasePeriod.<init>(BasePeriod.java:258)
	at org.joda.time.Period.<init>(Period.java:402)
	at org.joda.time.TestPeriod_Constructors.testConstructor_long_PeriodType1(TestPeriod_Constructors.java:206)

testConstructor_long_PeriodType4(org.joda.time.TestPeriod_Constructors)  Time elapsed: 0.013 sec  <<< ERROR!
java.lang.NullPointerException
	at org.joda.time.chrono.BaseChronology.get(BaseChronology.java:284)
	at org.joda.time.base.BasePeriod.<init>(BasePeriod.java:258)
	at org.joda.time.Period.<init>(Period.java:402)
	at org.joda.time.TestPeriod_Constructors.testConstructor_long_PeriodType4(TestPeriod_Constructors.java:257)

testConstructor_long_Chronology1(org.joda.time.TestPeriod_Constructors)  Time elapsed: 0 sec  <<< ERROR!
java.lang.NullPointerException
	at org.joda.time.chrono.BaseChronology.get(BaseChronology.java:284)
	at org.joda.time.base.BasePeriod.<init>(BasePeriod.java:258)
	at org.joda.time.Period.<init>(Period.java:423)
	at org.joda.time.TestPeriod_Constructors.testConstructor_long_Chronology1(TestPeriod_Constructors.java:275)

testConstructor_long_long_Chronology1(org.joda.time.TestPeriod_Constructors)  Time elapsed: 0 sec  <<< ERROR!
java.lang.NullPointerException
	at org.joda.time.chrono.BaseChronology.get(BaseChronology.java:260)
	at org.joda.time.base.BasePeriod.<init>(BasePeriod.java:110)
	at org.joda.time.Period.<init>(Period.java:478)
	at org.joda.time.TestPeriod_Constructors.testConstructor_long_long_Chronology1(TestPeriod_Constructors.java:558)

testConstructor_long_long_Chronology2(org.joda.time.TestPeriod_Constructors)  Time elapsed: 0 sec  <<< ERROR!
java.lang.NullPointerException
	at org.joda.time.chrono.BaseChronology.get(BaseChronology.java:260)
	at org.joda.time.base.BasePeriod.<init>(BasePeriod.java:110)
	at org.joda.time.Period.<init>(Period.java:478)
	at org.joda.time.TestPeriod_Constructors.testConstructor_long_long_Chronology2(TestPeriod_Constructors.java:573)

testConstructor_RP_RP1(org.joda.time.TestPeriod_Constructors)  Time elapsed: 0 sec  <<< ERROR!
java.lang.NullPointerException
	at org.joda.time.chrono.BaseChronology.get(BaseChronology.java:260)
	at org.joda.time.base.BasePeriod.<init>(BasePeriod.java:182)
	at org.joda.time.Period.<init>(Period.java:582)
	at org.joda.time.TestPeriod_Constructors.testConstructor_RP_RP1(TestPeriod_Constructors.java:805)

testConstructor_RP_RP2(org.joda.time.TestPeriod_Constructors)  Time elapsed: 0.001 sec  <<< ERROR!
java.lang.NullPointerException
	at org.joda.time.chrono.BaseChronology.get(BaseChronology.java:260)
	at org.joda.time.base.BasePeriod.<init>(BasePeriod.java:182)
	at org.joda.time.Period.<init>(Period.java:582)
	at org.joda.time.TestPeriod_Constructors.testConstructor_RP_RP2(TestPeriod_Constructors.java:821)

testConstructor_RP_RP2Local(org.joda.time.TestPeriod_Constructors)  Time elapsed: 0 sec  <<< ERROR!
java.lang.NullPointerException
	at org.joda.time.chrono.BaseChronology.get(BaseChronology.java:260)
	at org.joda.time.base.BasePeriod.<init>(BasePeriod.java:167)
	at org.joda.time.Period.<init>(Period.java:582)
	at org.joda.time.TestPeriod_Constructors.testConstructor_RP_RP2Local(TestPeriod_Constructors.java:836)

testConstructor_RP_RP_PeriodType1(org.joda.time.TestPeriod_Constructors)  Time elapsed: 0.001 sec  <<< ERROR!
java.lang.NullPointerException
	at org.joda.time.chrono.BaseChronology.get(BaseChronology.java:260)
	at org.joda.time.base.BasePeriod.<init>(BasePeriod.java:182)
	at org.joda.time.Period.<init>(Period.java:616)
	at org.joda.time.TestPeriod_Constructors.testConstructor_RP_RP_PeriodType1(TestPeriod_Constructors.java:911)

testConstructor_trickyDifferences_RI_RI_toFeb_standardYear(org.joda.time.TestPeriod_Constructors)  Time elapsed: 0.002 sec  <<< ERROR!
java.lang.NullPointerException
	at org.joda.time.chrono.BaseChronology.get(BaseChronology.java:260)
	at org.joda.time.base.BasePeriod.<init>(BasePeriod.java:132)
	at org.joda.time.Period.<init>(Period.java:519)
	at org.joda.time.TestPeriod_Constructors.testConstructor_trickyDifferences_RI_RI_toFeb_standardYear(TestPeriod_Constructors.java:1362)

testConstructor_trickyDifferences_RI_RI_toFeb_leapYear(org.joda.time.TestPeriod_Constructors)  Time elapsed: 0.001 sec  <<< ERROR!
java.lang.NullPointerException
	at org.joda.time.chrono.BaseChronology.get(BaseChronology.java:260)
	at org.joda.time.base.BasePeriod.<init>(BasePeriod.java:132)
	at org.joda.time.Period.<init>(Period.java:519)
	at org.joda.time.TestPeriod_Constructors.testConstructor_trickyDifferences_RI_RI_toFeb_leapYear(TestPeriod_Constructors.java:1370)

testConstructor_trickyDifferences_RI_RI_toFeb_exactMonths(org.joda.time.TestPeriod_Constructors)  Time elapsed: 0.001 sec  <<< ERROR!
java.lang.NullPointerException
	at org.joda.time.chrono.BaseChronology.get(BaseChronology.java:260)
	at org.joda.time.base.BasePeriod.<init>(BasePeriod.java:132)
	at org.joda.time.Period.<init>(Period.java:519)
	at org.joda.time.TestPeriod_Constructors.testConstructor_trickyDifferences_RI_RI_toFeb_exactMonths(TestPeriod_Constructors.java:1378)

testConstructor_trickyDifferences_RI_RI_toFeb_endOfMonth1(org.joda.time.TestPeriod_Constructors)  Time elapsed: 0.001 sec  <<< ERROR!
java.lang.NullPointerException
	at org.joda.time.chrono.BaseChronology.get(BaseChronology.java:260)
	at org.joda.time.base.BasePeriod.<init>(BasePeriod.java:132)
	at org.joda.time.Period.<init>(Period.java:519)
	at org.joda.time.TestPeriod_Constructors.testConstructor_trickyDifferences_RI_RI_toFeb_endOfMonth1(TestPeriod_Constructors.java:1386)

testConstructor_trickyDifferences_RI_RI_toFeb_endOfMonth2(org.joda.time.TestPeriod_Constructors)  Time elapsed: 0.001 sec  <<< ERROR!
java.lang.NullPointerException
	at org.joda.time.chrono.BaseChronology.get(BaseChronology.java:260)
	at org.joda.time.base.BasePeriod.<init>(BasePeriod.java:132)
	at org.joda.time.Period.<init>(Period.java:519)
	at org.joda.time.TestPeriod_Constructors.testConstructor_trickyDifferences_RI_RI_toFeb_endOfMonth2(TestPeriod_Constructors.java:1394)

testConstructor_trickyDifferences_RI_RI_toFeb_endOfMonth3(org.joda.time.TestPeriod_Constructors)  Time elapsed: 0.001 sec  <<< ERROR!
java.lang.NullPointerException
	at org.joda.time.chrono.BaseChronology.get(BaseChronology.java:260)
	at org.joda.time.base.BasePeriod.<init>(BasePeriod.java:132)
	at org.joda.time.Period.<init>(Period.java:519)
	at org.joda.time.TestPeriod_Constructors.testConstructor_trickyDifferences_RI_RI_toFeb_endOfMonth3(TestPeriod_Constructors.java:1402)

testConstructor_trickyDifferences_RI_RI_toMar_endOfMonth1(org.joda.time.TestPeriod_Constructors)  Time elapsed: 0.001 sec  <<< ERROR!
java.lang.NullPointerException
	at org.joda.time.chrono.BaseChronology.get(BaseChronology.java:260)
	at org.joda.time.base.BasePeriod.<init>(BasePeriod.java:132)
	at org.joda.time.Period.<init>(Period.java:519)
	at org.joda.time.TestPeriod_Constructors.testConstructor_trickyDifferences_RI_RI_toMar_endOfMonth1(TestPeriod_Constructors.java:1410)

testConstructor_trickyDifferences_RI_RI_toMar_endOfMonth2(org.joda.time.TestPeriod_Constructors)  Time elapsed: 0.001 sec  <<< ERROR!
java.lang.NullPointerException
	at org.joda.time.chrono.BaseChronology.get(BaseChronology.java:260)
	at org.joda.time.base.BasePeriod.<init>(BasePeriod.java:132)
	at org.joda.time.Period.<init>(Period.java:519)
	at org.joda.time.TestPeriod_Constructors.testConstructor_trickyDifferences_RI_RI_toMar_endOfMonth2(TestPeriod_Constructors.java:1418)

testConstructor_trickyDifferences_LD_LD_toFeb_standardYear(org.joda.time.TestPeriod_Constructors)  Time elapsed: 0.001 sec  <<< ERROR!
java.lang.NullPointerException
	at org.joda.time.chrono.BaseChronology.get(BaseChronology.java:260)
	at org.joda.time.base.BasePeriod.<init>(BasePeriod.java:167)
	at org.joda.time.Period.<init>(Period.java:582)
	at org.joda.time.TestPeriod_Constructors.testConstructor_trickyDifferences_LD_LD_toFeb_standardYear(TestPeriod_Constructors.java:1427)

testConstructor_trickyDifferences_LD_LD_toFeb_leapYear(org.joda.time.TestPeriod_Constructors)  Time elapsed: 0.001 sec  <<< ERROR!
java.lang.NullPointerException
	at org.joda.time.chrono.BaseChronology.get(BaseChronology.java:260)
	at org.joda.time.base.BasePeriod.<init>(BasePeriod.java:167)
	at org.joda.time.Period.<init>(Period.java:582)
	at org.joda.time.TestPeriod_Constructors.testConstructor_trickyDifferences_LD_LD_toFeb_leapYear(TestPeriod_Constructors.java:1435)

testConstructor_trickyDifferences_LD_LD_toFeb_exactMonths(org.joda.time.TestPeriod_Constructors)  Time elapsed: 0 sec  <<< ERROR!
java.lang.NullPointerException
	at org.joda.time.chrono.BaseChronology.get(BaseChronology.java:260)
	at org.joda.time.base.BasePeriod.<init>(BasePeriod.java:167)
	at org.joda.time.Period.<init>(Period.java:582)
	at org.joda.time.TestPeriod_Constructors.testConstructor_trickyDifferences_LD_LD_toFeb_exactMonths(TestPeriod_Constructors.java:1443)

testConstructor_trickyDifferences_LD_LD_toFeb_endOfMonth1(org.joda.time.TestPeriod_Constructors)  Time elapsed: 0.002 sec  <<< ERROR!
java.lang.NullPointerException
	at org.joda.time.chrono.BaseChronology.get(BaseChronology.java:260)
	at org.joda.time.base.BasePeriod.<init>(BasePeriod.java:167)
	at org.joda.time.Period.<init>(Period.java:582)
	at org.joda.time.TestPeriod_Constructors.testConstructor_trickyDifferences_LD_LD_toFeb_endOfMonth1(TestPeriod_Constructors.java:1451)

testConstructor_trickyDifferences_LD_LD_toFeb_endOfMonth2(org.joda.time.TestPeriod_Constructors)  Time elapsed: 0 sec  <<< ERROR!
java.lang.NullPointerException
	at org.joda.time.chrono.BaseChronology.get(BaseChronology.java:260)
	at org.joda.time.base.BasePeriod.<init>(BasePeriod.java:167)
	at org.joda.time.Period.<init>(Period.java:582)
	at org.joda.time.TestPeriod_Constructors.testConstructor_trickyDifferences_LD_LD_toFeb_endOfMonth2(TestPeriod_Constructors.java:1459)

testConstructor_trickyDifferences_LD_LD_toFeb_endOfMonth3(org.joda.time.TestPeriod_Constructors)  Time elapsed: 0 sec  <<< ERROR!
java.lang.NullPointerException
	at org.joda.time.chrono.BaseChronology.get(BaseChronology.java:260)
	at org.joda.time.base.BasePeriod.<init>(BasePeriod.java:167)
	at org.joda.time.Period.<init>(Period.java:582)
	at org.joda.time.TestPeriod_Constructors.testConstructor_trickyDifferences_LD_LD_toFeb_endOfMonth3(TestPeriod_Constructors.java:1467)

testConstructor_trickyDifferences_LD_LD_toMar_endOfMonth1(org.joda.time.TestPeriod_Constructors)  Time elapsed: 0 sec  <<< ERROR!
java.lang.NullPointerException
	at org.joda.time.chrono.BaseChronology.get(BaseChronology.java:260)
	at org.joda.time.base.BasePeriod.<init>(BasePeriod.java:167)
	at org.joda.time.Period.<init>(Period.java:582)
	at org.joda.time.TestPeriod_Constructors.testConstructor_trickyDifferences_LD_LD_toMar_endOfMonth1(TestPeriod_Constructors.java:1475)

testConstructor_trickyDifferences_LD_LD_toMar_endOfMonth2(org.joda.time.TestPeriod_Constructors)  Time elapsed: 0 sec  <<< ERROR!
java.lang.NullPointerException
	at org.joda.time.chrono.BaseChronology.get(BaseChronology.java:260)
	at org.joda.time.base.BasePeriod.<init>(BasePeriod.java:167)
	at org.joda.time.Period.<init>(Period.java:582)
	at org.joda.time.TestPeriod_Constructors.testConstructor_trickyDifferences_LD_LD_toMar_endOfMonth2(TestPeriod_Constructors.java:1483)

testFactoryFieldDifference5(org.joda.time.TestPeriod_Constructors)  Time elapsed: 0.001 sec  <<< ERROR!
java.lang.NullPointerException
	at org.joda.time.field.BaseDurationField.compareTo(BaseDurationField.java:146)
	at org.joda.time.field.BaseDurationField.compareTo(BaseDurationField.java:38)
	at org.joda.time.Partial.<init>(Partial.java:250)
	at org.joda.time.Partial.<init>(Partial.java:177)
	at org.joda.time.TestPeriod_Constructors.testFactoryFieldDifference5(TestPeriod_Constructors.java:1554)

testEqualsHashCode(org.joda.time.TestPeriod_Basics)  Time elapsed: 0.001 sec  <<< ERROR!
java.lang.NullPointerException
	at org.joda.time.chrono.BaseChronology.get(BaseChronology.java:284)
	at org.joda.time.base.BasePeriod.<init>(BasePeriod.java:258)
	at org.joda.time.TestPeriod_Basics$MockPeriod.<init>(TestPeriod_Basics.java:222)
	at org.joda.time.TestPeriod_Basics.testEqualsHashCode(TestPeriod_Basics.java:215)

testNormalizedStandard_yearMonthDay(org.joda.time.TestPeriod_Basics)  Time elapsed: 0 sec  <<< ERROR!
java.lang.NullPointerException
	at org.joda.time.chrono.BaseChronology.get(BaseChronology.java:284)
	at org.joda.time.base.BasePeriod.<init>(BasePeriod.java:258)
	at org.joda.time.Period.<init>(Period.java:444)
	at org.joda.time.Period.normalizedStandard(Period.java:1644)
	at org.joda.time.Period.normalizedStandard(Period.java:1601)
	at org.joda.time.TestPeriod_Basics.testNormalizedStandard_yearMonthDay(TestPeriod_Basics.java:1441)

testNormalizedStandard_negative(org.joda.time.TestPeriod_Basics)  Time elapsed: 0.001 sec  <<< ERROR!
java.lang.NullPointerException
	at org.joda.time.chrono.BaseChronology.get(BaseChronology.java:284)
	at org.joda.time.base.BasePeriod.<init>(BasePeriod.java:258)
	at org.joda.time.Period.<init>(Period.java:444)
	at org.joda.time.Period.normalizedStandard(Period.java:1644)
	at org.joda.time.Period.normalizedStandard(Period.java:1601)
	at org.joda.time.TestPeriod_Basics.testNormalizedStandard_negative(TestPeriod_Basics.java:1448)

testNormalizedStandard_fullNegative(org.joda.time.TestPeriod_Basics)  Time elapsed: 0 sec  <<< ERROR!
java.lang.NullPointerException
	at org.joda.time.chrono.BaseChronology.get(BaseChronology.java:284)
	at org.joda.time.base.BasePeriod.<init>(BasePeriod.java:258)
	at org.joda.time.Period.<init>(Period.java:444)
	at org.joda.time.Period.normalizedStandard(Period.java:1644)
	at org.joda.time.Period.normalizedStandard(Period.java:1601)
	at org.joda.time.TestPeriod_Basics.testNormalizedStandard_fullNegative(TestPeriod_Basics.java:1455)

testNormalizedStandard_periodType_weekDay1(org.joda.time.TestPeriod_Basics)  Time elapsed: 0 sec  <<< ERROR!
java.lang.NullPointerException
	at org.joda.time.chrono.BaseChronology.get(BaseChronology.java:284)
	at org.joda.time.base.BasePeriod.<init>(BasePeriod.java:258)
	at org.joda.time.Period.<init>(Period.java:444)
	at org.joda.time.Period.normalizedStandard(Period.java:1644)
	at org.joda.time.TestPeriod_Basics.testNormalizedStandard_periodType_weekDay1(TestPeriod_Basics.java:1486)

testNormalizedStandard_periodType_weekDay2(org.joda.time.TestPeriod_Basics)  Time elapsed: 0.001 sec  <<< ERROR!
java.lang.NullPointerException
	at org.joda.time.chrono.BaseChronology.get(BaseChronology.java:284)
	at org.joda.time.base.BasePeriod.<init>(BasePeriod.java:258)
	at org.joda.time.Period.<init>(Period.java:444)
	at org.joda.time.Period.normalizedStandard(Period.java:1644)
	at org.joda.time.TestPeriod_Basics.testNormalizedStandard_periodType_weekDay2(TestPeriod_Basics.java:1494)

testNormalizedStandard_periodType_monthsWeeks(org.joda.time.TestPeriod_Basics)  Time elapsed: 0.001 sec  <<< ERROR!
java.lang.NullPointerException
	at org.joda.time.chrono.BaseChronology.get(BaseChronology.java:284)
	at org.joda.time.base.BasePeriod.<init>(BasePeriod.java:258)
	at org.joda.time.Period.<init>(Period.java:444)
	at org.joda.time.Period.normalizedStandard(Period.java:1644)
	at org.joda.time.TestPeriod_Basics.testNormalizedStandard_periodType_monthsWeeks(TestPeriod_Basics.java:1557)

testNormalizedStandard_weekDay1(org.joda.time.TestPeriod_Basics)  Time elapsed: 0 sec  <<< ERROR!
java.lang.NullPointerException
	at org.joda.time.chrono.BaseChronology.get(BaseChronology.java:284)
	at org.joda.time.base.BasePeriod.<init>(BasePeriod.java:258)
	at org.joda.time.Period.<init>(Period.java:444)
	at org.joda.time.Period.normalizedStandard(Period.java:1644)
	at org.joda.time.Period.normalizedStandard(Period.java:1601)
	at org.joda.time.TestPeriod_Basics.testNormalizedStandard_weekDay1(TestPeriod_Basics.java:1419)

testNormalizedStandard_weekDay2(org.joda.time.TestPeriod_Basics)  Time elapsed: 0.001 sec  <<< ERROR!
java.lang.NullPointerException
	at org.joda.time.chrono.BaseChronology.get(BaseChronology.java:284)
	at org.joda.time.base.BasePeriod.<init>(BasePeriod.java:258)
	at org.joda.time.Period.<init>(Period.java:444)
	at org.joda.time.Period.normalizedStandard(Period.java:1644)
	at org.joda.time.Period.normalizedStandard(Period.java:1601)
	at org.joda.time.TestPeriod_Basics.testNormalizedStandard_weekDay2(TestPeriod_Basics.java:1427)

testNormalizedStandard_yearMonthWeekDay(org.joda.time.TestPeriod_Basics)  Time elapsed: 0.001 sec  <<< ERROR!
java.lang.NullPointerException
	at org.joda.time.chrono.BaseChronology.get(BaseChronology.java:284)
	at org.joda.time.base.BasePeriod.<init>(BasePeriod.java:258)
	at org.joda.time.Period.<init>(Period.java:444)
	at org.joda.time.Period.normalizedStandard(Period.java:1644)
	at org.joda.time.Period.normalizedStandard(Period.java:1601)
	at org.joda.time.TestPeriod_Basics.testNormalizedStandard_yearMonthWeekDay(TestPeriod_Basics.java:1434)

testConstructor_long_long2(org.joda.time.TestMutablePeriod_Constructors)  Time elapsed: 0 sec  <<< ERROR!
java.lang.NullPointerException
	at org.joda.time.chrono.BaseChronology.get(BaseChronology.java:260)
	at org.joda.time.base.BasePeriod.<init>(BasePeriod.java:110)
	at org.joda.time.MutablePeriod.<init>(MutablePeriod.java:253)
	at org.joda.time.TestMutablePeriod_Constructors.testConstructor_long_long2(TestMutablePeriod_Constructors.java:486)

testConstructor_RI_RD1(org.joda.time.TestMutablePeriod_Constructors)  Time elapsed: 0.001 sec  <<< ERROR!
java.lang.NullPointerException
	at org.joda.time.chrono.BaseChronology.get(BaseChronology.java:260)
	at org.joda.time.base.BasePeriod.<init>(BasePeriod.java:201)
	at org.joda.time.MutablePeriod.<init>(MutablePeriod.java:326)
	at org.joda.time.TestMutablePeriod_Constructors.testConstructor_RI_RD1(TestMutablePeriod_Constructors.java:763)

testConstructor_Object_Chronology1(org.joda.time.TestMutablePeriod_Constructors)  Time elapsed: 0.001 sec  <<< ERROR!
java.lang.NullPointerException
	at org.joda.time.chrono.BaseChronology.get(BaseChronology.java:284)
	at org.joda.time.convert.ReadableDurationConverter.setInto(ReadableDurationConverter.java:75)
	at org.joda.time.base.BasePeriod.<init>(BasePeriod.java:279)
	at org.joda.time.MutablePeriod.<init>(MutablePeriod.java:408)
	at org.joda.time.TestMutablePeriod_Constructors.testConstructor_Object_Chronology1(TestMutablePeriod_Constructors.java:942)

testConstructor_Object_Chronology2(org.joda.time.TestMutablePeriod_Constructors)  Time elapsed: 0 sec  <<< ERROR!
java.lang.NullPointerException
	at org.joda.time.chrono.BaseChronology.get(BaseChronology.java:284)
	at org.joda.time.convert.ReadableDurationConverter.setInto(ReadableDurationConverter.java:75)
	at org.joda.time.base.BasePeriod.<init>(BasePeriod.java:279)
	at org.joda.time.MutablePeriod.<init>(MutablePeriod.java:408)
	at org.joda.time.TestMutablePeriod_Constructors.testConstructor_Object_Chronology2(TestMutablePeriod_Constructors.java:960)

testConstructor_long_long1(org.joda.time.TestMutablePeriod_Constructors)  Time elapsed: 0 sec  <<< ERROR!
java.lang.NullPointerException
	at org.joda.time.chrono.BaseChronology.get(BaseChronology.java:260)
	at org.joda.time.base.BasePeriod.<init>(BasePeriod.java:110)
	at org.joda.time.MutablePeriod.<init>(MutablePeriod.java:253)
	at org.joda.time.TestMutablePeriod_Constructors.testConstructor_long_long1(TestMutablePeriod_Constructors.java:471)

testConstructor_RI_RI1(org.joda.time.TestMutablePeriod_Constructors)  Time elapsed: 0 sec  <<< ERROR!
java.lang.NullPointerException
	at org.joda.time.chrono.BaseChronology.get(BaseChronology.java:260)
	at org.joda.time.base.BasePeriod.<init>(BasePeriod.java:132)
	at org.joda.time.MutablePeriod.<init>(MutablePeriod.java:302)
	at org.joda.time.TestMutablePeriod_Constructors.testConstructor_RI_RI1(TestMutablePeriod_Constructors.java:610)

testConstructor_RI_RI2(org.joda.time.TestMutablePeriod_Constructors)  Time elapsed: 0 sec  <<< ERROR!
java.lang.NullPointerException
	at org.joda.time.chrono.BaseChronology.get(BaseChronology.java:260)
	at org.joda.time.base.BasePeriod.<init>(BasePeriod.java:132)
	at org.joda.time.MutablePeriod.<init>(MutablePeriod.java:302)
	at org.joda.time.TestMutablePeriod_Constructors.testConstructor_RI_RI2(TestMutablePeriod_Constructors.java:625)

testConstructor_RI_RI3(org.joda.time.TestMutablePeriod_Constructors)  Time elapsed: 0 sec  <<< ERROR!
java.lang.NullPointerException
	at org.joda.time.chrono.BaseChronology.get(BaseChronology.java:260)
	at org.joda.time.base.BasePeriod.<init>(BasePeriod.java:132)
	at org.joda.time.MutablePeriod.<init>(MutablePeriod.java:302)
	at org.joda.time.TestMutablePeriod_Constructors.testConstructor_RI_RI3(TestMutablePeriod_Constructors.java:640)

testConstructor_RI_RI4(org.joda.time.TestMutablePeriod_Constructors)  Time elapsed: 0 sec  <<< ERROR!
java.lang.NullPointerException
	at org.joda.time.chrono.BaseChronology.get(BaseChronology.java:260)
	at org.joda.time.base.BasePeriod.<init>(BasePeriod.java:132)
	at org.joda.time.MutablePeriod.<init>(MutablePeriod.java:302)
	at org.joda.time.TestMutablePeriod_Constructors.testConstructor_RI_RI4(TestMutablePeriod_Constructors.java:655)

testConstructor_long_Chronology2(org.joda.time.TestMutablePeriod_Constructors)  Time elapsed: 0 sec  <<< ERROR!
java.lang.NullPointerException
	at org.joda.time.chrono.BaseChronology.get(BaseChronology.java:284)
	at org.joda.time.base.BasePeriod.<init>(BasePeriod.java:258)
	at org.joda.time.MutablePeriod.<init>(MutablePeriod.java:221)
	at org.joda.time.TestMutablePeriod_Constructors.testConstructor_long_Chronology2(TestMutablePeriod_Constructors.java:298)

testConstructor_long_Chronology3(org.joda.time.TestMutablePeriod_Constructors)  Time elapsed: 0 sec  <<< ERROR!
java.lang.NullPointerException
	at org.joda.time.chrono.BaseChronology.get(BaseChronology.java:284)
	at org.joda.time.base.BasePeriod.<init>(BasePeriod.java:258)
	at org.joda.time.MutablePeriod.<init>(MutablePeriod.java:221)
	at org.joda.time.TestMutablePeriod_Constructors.testConstructor_long_Chronology3(TestMutablePeriod_Constructors.java:315)

testConstructor_long_PeriodType_Chronology2(org.joda.time.TestMutablePeriod_Constructors)  Time elapsed: 0 sec  <<< ERROR!
java.lang.NullPointerException
	at org.joda.time.chrono.BaseChronology.get(BaseChronology.java:284)
	at org.joda.time.base.BasePeriod.<init>(BasePeriod.java:258)
	at org.joda.time.MutablePeriod.<init>(MutablePeriod.java:242)
	at org.joda.time.TestMutablePeriod_Constructors.testConstructor_long_PeriodType_Chronology2(TestMutablePeriod_Constructors.java:350)

testConstructor_long_PeriodType_Chronology3(org.joda.time.TestMutablePeriod_Constructors)  Time elapsed: 0 sec  <<< ERROR!
java.lang.NullPointerException
	at org.joda.time.chrono.BaseChronology.get(BaseChronology.java:284)
	at org.joda.time.base.BasePeriod.<init>(BasePeriod.java:258)
	at org.joda.time.MutablePeriod.<init>(MutablePeriod.java:242)
	at org.joda.time.TestMutablePeriod_Constructors.testConstructor_long_PeriodType_Chronology3(TestMutablePeriod_Constructors.java:367)

testConstructor_long_PeriodType_Chronology4(org.joda.time.TestMutablePeriod_Constructors)  Time elapsed: 0 sec  <<< ERROR!
java.lang.NullPointerException
	at org.joda.time.chrono.BaseChronology.get(BaseChronology.java:284)
	at org.joda.time.base.BasePeriod.<init>(BasePeriod.java:258)
	at org.joda.time.MutablePeriod.<init>(MutablePeriod.java:242)
	at org.joda.time.TestMutablePeriod_Constructors.testConstructor_long_PeriodType_Chronology4(TestMutablePeriod_Constructors.java:384)

testConstructor_long_long_PeriodType1(org.joda.time.TestMutablePeriod_Constructors)  Time elapsed: 0 sec  <<< ERROR!
java.lang.NullPointerException
	at org.joda.time.chrono.BaseChronology.get(BaseChronology.java:260)
	at org.joda.time.base.BasePeriod.<init>(BasePeriod.java:110)
	at org.joda.time.MutablePeriod.<init>(MutablePeriod.java:264)
	at org.joda.time.TestMutablePeriod_Constructors.testConstructor_long_long_PeriodType1(TestMutablePeriod_Constructors.java:502)

testConstructor_long_long_PeriodType3(org.joda.time.TestMutablePeriod_Constructors)  Time elapsed: 0 sec  <<< ERROR!
java.lang.NullPointerException
	at org.joda.time.chrono.BaseChronology.get(BaseChronology.java:260)
	at org.joda.time.base.BasePeriod.<init>(BasePeriod.java:110)
	at org.joda.time.MutablePeriod.<init>(MutablePeriod.java:264)
	at org.joda.time.TestMutablePeriod_Constructors.testConstructor_long_long_PeriodType3(TestMutablePeriod_Constructors.java:532)

testConstructor_long_long_PeriodType_Chronology1(org.joda.time.TestMutablePeriod_Constructors)  Time elapsed: 0.001 sec  <<< ERROR!
java.lang.NullPointerException
	at org.joda.time.chrono.BaseChronology.get(BaseChronology.java:260)
	at org.joda.time.base.BasePeriod.<init>(BasePeriod.java:110)
	at org.joda.time.MutablePeriod.<init>(MutablePeriod.java:288)
	at org.joda.time.TestMutablePeriod_Constructors.testConstructor_long_long_PeriodType_Chronology1(TestMutablePeriod_Constructors.java:579)

testConstructor_long_long_PeriodType_Chronology2(org.joda.time.TestMutablePeriod_Constructors)  Time elapsed: 0 sec  <<< ERROR!
java.lang.NullPointerException
	at org.joda.time.chrono.BaseChronology.get(BaseChronology.java:260)
	at org.joda.time.base.BasePeriod.<init>(BasePeriod.java:110)
	at org.joda.time.MutablePeriod.<init>(MutablePeriod.java:288)
	at org.joda.time.TestMutablePeriod_Constructors.testConstructor_long_long_PeriodType_Chronology2(TestMutablePeriod_Constructors.java:594)

testConstructor_RI_RI_PeriodType1(org.joda.time.TestMutablePeriod_Constructors)  Time elapsed: 0.001 sec  <<< ERROR!
java.lang.NullPointerException
	at org.joda.time.chrono.BaseChronology.get(BaseChronology.java:260)
	at org.joda.time.base.BasePeriod.<init>(BasePeriod.java:132)
	at org.joda.time.MutablePeriod.<init>(MutablePeriod.java:316)
	at org.joda.time.TestMutablePeriod_Constructors.testConstructor_RI_RI_PeriodType1(TestMutablePeriod_Constructors.java:686)

testConstructor_RI_RI_PeriodType3(org.joda.time.TestMutablePeriod_Constructors)  Time elapsed: 0.001 sec  <<< ERROR!
java.lang.NullPointerException
	at org.joda.time.chrono.BaseChronology.get(BaseChronology.java:260)
	at org.joda.time.base.BasePeriod.<init>(BasePeriod.java:132)
	at org.joda.time.MutablePeriod.<init>(MutablePeriod.java:316)
	at org.joda.time.TestMutablePeriod_Constructors.testConstructor_RI_RI_PeriodType3(TestMutablePeriod_Constructors.java:716)

testConstructor_RI_RI_PeriodType4(org.joda.time.TestMutablePeriod_Constructors)  Time elapsed: 0 sec  <<< ERROR!
java.lang.NullPointerException
	at org.joda.time.chrono.BaseChronology.get(BaseChronology.java:260)
	at org.joda.time.base.BasePeriod.<init>(BasePeriod.java:132)
	at org.joda.time.MutablePeriod.<init>(MutablePeriod.java:316)
	at org.joda.time.TestMutablePeriod_Constructors.testConstructor_RI_RI_PeriodType4(TestMutablePeriod_Constructors.java:731)

testConstructor_long_PeriodType1(org.joda.time.TestMutablePeriod_Constructors)  Time elapsed: 0.001 sec  <<< ERROR!
java.lang.NullPointerException
	at org.joda.time.chrono.BaseChronology.get(BaseChronology.java:284)
	at org.joda.time.base.BasePeriod.<init>(BasePeriod.java:258)
	at org.joda.time.MutablePeriod.<init>(MutablePeriod.java:200)
	at org.joda.time.TestMutablePeriod_Constructors.testConstructor_long_PeriodType1(TestMutablePeriod_Constructors.java:212)

testConstructor_long_PeriodType3(org.joda.time.TestMutablePeriod_Constructors)  Time elapsed: 0 sec  <<< ERROR!
java.lang.NullPointerException
	at org.joda.time.chrono.BaseChronology.get(BaseChronology.java:284)
	at org.joda.time.base.BasePeriod.<init>(BasePeriod.java:258)
	at org.joda.time.MutablePeriod.<init>(MutablePeriod.java:200)
	at org.joda.time.TestMutablePeriod_Constructors.testConstructor_long_PeriodType3(TestMutablePeriod_Constructors.java:246)

testConstructor_long_PeriodType4(org.joda.time.TestMutablePeriod_Constructors)  Time elapsed: 0.001 sec  <<< ERROR!
java.lang.NullPointerException
	at org.joda.time.chrono.BaseChronology.get(BaseChronology.java:284)
	at org.joda.time.base.BasePeriod.<init>(BasePeriod.java:258)
	at org.joda.time.MutablePeriod.<init>(MutablePeriod.java:200)
	at org.joda.time.TestMutablePeriod_Constructors.testConstructor_long_PeriodType4(TestMutablePeriod_Constructors.java:263)

testConstructor_long_Chronology1(org.joda.time.TestMutablePeriod_Constructors)  Time elapsed: 0 sec  <<< ERROR!
java.lang.NullPointerException
	at org.joda.time.chrono.BaseChronology.get(BaseChronology.java:284)
	at org.joda.time.base.BasePeriod.<init>(BasePeriod.java:258)
	at org.joda.time.MutablePeriod.<init>(MutablePeriod.java:221)
	at org.joda.time.TestMutablePeriod_Constructors.testConstructor_long_Chronology1(TestMutablePeriod_Constructors.java:281)

testConstructor_long_long_Chronology1(org.joda.time.TestMutablePeriod_Constructors)  Time elapsed: 0.001 sec  <<< ERROR!
java.lang.NullPointerException
	at org.joda.time.chrono.BaseChronology.get(BaseChronology.java:260)
	at org.joda.time.base.BasePeriod.<init>(BasePeriod.java:110)
	at org.joda.time.MutablePeriod.<init>(MutablePeriod.java:276)
	at org.joda.time.TestMutablePeriod_Constructors.testConstructor_long_long_Chronology1(TestMutablePeriod_Constructors.java:548)

testConstructor_long_long_Chronology2(org.joda.time.TestMutablePeriod_Constructors)  Time elapsed: 0 sec  <<< ERROR!
java.lang.NullPointerException
	at org.joda.time.chrono.BaseChronology.get(BaseChronology.java:260)
	at org.joda.time.base.BasePeriod.<init>(BasePeriod.java:110)
	at org.joda.time.MutablePeriod.<init>(MutablePeriod.java:276)
	at org.joda.time.TestMutablePeriod_Constructors.testConstructor_long_long_Chronology2(TestMutablePeriod_Constructors.java:563)

testEqualsHashCode(org.joda.time.TestMutablePeriod_Basics)  Time elapsed: 0.001 sec  <<< ERROR!
java.lang.NullPointerException
	at org.joda.time.chrono.BaseChronology.get(BaseChronology.java:284)
	at org.joda.time.base.BasePeriod.<init>(BasePeriod.java:258)
	at org.joda.time.TestMutablePeriod_Basics$MockMutablePeriod.<init>(TestMutablePeriod_Basics.java:155)
	at org.joda.time.TestMutablePeriod_Basics.testEqualsHashCode(TestMutablePeriod_Basics.java:149)

testAdd_RP2(org.joda.time.TestMutablePeriod_Updates)  Time elapsed: 0.001 sec  <<< ERROR!
java.lang.NullPointerException
	at org.joda.time.chrono.BaseChronology.get(BaseChronology.java:284)
	at org.joda.time.base.BasePeriod.<init>(BasePeriod.java:258)
	at org.joda.time.MutablePeriod.<init>(MutablePeriod.java:200)
	at org.joda.time.TestMutablePeriod_Updates.testAdd_RP2(TestMutablePeriod_Updates.java:1248)

testSetPeriod_long_long1(org.joda.time.TestMutablePeriod_Updates)  Time elapsed: 0.001 sec  <<< ERROR!
java.lang.NullPointerException
	at org.joda.time.chrono.BaseChronology.get(BaseChronology.java:260)
	at org.joda.time.MutablePeriod.setPeriod(MutablePeriod.java:548)
	at org.joda.time.MutablePeriod.setPeriod(MutablePeriod.java:535)
	at org.joda.time.TestMutablePeriod_Updates.testSetPeriod_long_long1(TestMutablePeriod_Updates.java:562)

testSetPeriod_long_long2(org.joda.time.TestMutablePeriod_Updates)  Time elapsed: 0.001 sec  <<< ERROR!
java.lang.NullPointerException
	at org.joda.time.chrono.BaseChronology.get(BaseChronology.java:260)
	at org.joda.time.MutablePeriod.setPeriod(MutablePeriod.java:548)
	at org.joda.time.MutablePeriod.setPeriod(MutablePeriod.java:535)
	at org.joda.time.TestMutablePeriod_Updates.testSetPeriod_long_long2(TestMutablePeriod_Updates.java:577)

testSetPeriod_long_long_NoYears(org.joda.time.TestMutablePeriod_Updates)  Time elapsed: 0 sec  <<< ERROR!
java.lang.NullPointerException
	at org.joda.time.chrono.BaseChronology.get(BaseChronology.java:260)
	at org.joda.time.MutablePeriod.setPeriod(MutablePeriod.java:548)
	at org.joda.time.MutablePeriod.setPeriod(MutablePeriod.java:535)
	at org.joda.time.TestMutablePeriod_Updates.testSetPeriod_long_long_NoYears(TestMutablePeriod_Updates.java:606)

testSetPeriod_long_long_NoMonths(org.joda.time.TestMutablePeriod_Updates)  Time elapsed: 0 sec  <<< ERROR!
java.lang.NullPointerException
	at org.joda.time.chrono.BaseChronology.get(BaseChronology.java:260)
	at org.joda.time.MutablePeriod.setPeriod(MutablePeriod.java:548)
	at org.joda.time.MutablePeriod.setPeriod(MutablePeriod.java:535)
	at org.joda.time.TestMutablePeriod_Updates.testSetPeriod_long_long_NoMonths(TestMutablePeriod_Updates.java:621)

testSetPeriod_long_long_NoDays(org.joda.time.TestMutablePeriod_Updates)  Time elapsed: 0.001 sec  <<< ERROR!
java.lang.NullPointerException
	at org.joda.time.chrono.BaseChronology.get(BaseChronology.java:260)
	at org.joda.time.MutablePeriod.setPeriod(MutablePeriod.java:548)
	at org.joda.time.MutablePeriod.setPeriod(MutablePeriod.java:535)
	at org.joda.time.TestMutablePeriod_Updates.testSetPeriod_long_long_NoDays(TestMutablePeriod_Updates.java:651)

testSetPeriod_long_long_NoHours(org.joda.time.TestMutablePeriod_Updates)  Time elapsed: 0 sec  <<< ERROR!
java.lang.NullPointerException
	at org.joda.time.chrono.BaseChronology.get(BaseChronology.java:260)
	at org.joda.time.MutablePeriod.setPeriod(MutablePeriod.java:548)
	at org.joda.time.MutablePeriod.setPeriod(MutablePeriod.java:535)
	at org.joda.time.TestMutablePeriod_Updates.testSetPeriod_long_long_NoHours(TestMutablePeriod_Updates.java:666)

testSetPeriod_long_long_NoMinutes(org.joda.time.TestMutablePeriod_Updates)  Time elapsed: 0.001 sec  <<< ERROR!
java.lang.NullPointerException
	at org.joda.time.chrono.BaseChronology.get(BaseChronology.java:260)
	at org.joda.time.MutablePeriod.setPeriod(MutablePeriod.java:548)
	at org.joda.time.MutablePeriod.setPeriod(MutablePeriod.java:535)
	at org.joda.time.TestMutablePeriod_Updates.testSetPeriod_long_long_NoMinutes(TestMutablePeriod_Updates.java:681)

testSetPeriod_long_long_NoSeconds(org.joda.time.TestMutablePeriod_Updates)  Time elapsed: 0 sec  <<< ERROR!
java.lang.NullPointerException
	at org.joda.time.chrono.BaseChronology.get(BaseChronology.java:260)
	at org.joda.time.MutablePeriod.setPeriod(MutablePeriod.java:548)
	at org.joda.time.MutablePeriod.setPeriod(MutablePeriod.java:535)
	at org.joda.time.TestMutablePeriod_Updates.testSetPeriod_long_long_NoSeconds(TestMutablePeriod_Updates.java:696)

testSetPeriod_long_long_NoMillis(org.joda.time.TestMutablePeriod_Updates)  Time elapsed: 0.001 sec  <<< ERROR!
java.lang.NullPointerException
	at org.joda.time.chrono.BaseChronology.get(BaseChronology.java:260)
	at org.joda.time.MutablePeriod.setPeriod(MutablePeriod.java:548)
	at org.joda.time.MutablePeriod.setPeriod(MutablePeriod.java:535)
	at org.joda.time.TestMutablePeriod_Updates.testSetPeriod_long_long_NoMillis(TestMutablePeriod_Updates.java:711)

testSetPeriod_RI_RI1(org.joda.time.TestMutablePeriod_Updates)  Time elapsed: 0 sec  <<< ERROR!
java.lang.NullPointerException
	at org.joda.time.chrono.BaseChronology.get(BaseChronology.java:260)
	at org.joda.time.MutablePeriod.setPeriod(MutablePeriod.java:548)
	at org.joda.time.MutablePeriod.setPeriod(MutablePeriod.java:522)
	at org.joda.time.TestMutablePeriod_Updates.testSetPeriod_RI_RI1(TestMutablePeriod_Updates.java:727)

testSetPeriod_RI_RI2(org.joda.time.TestMutablePeriod_Updates)  Time elapsed: 0.001 sec  <<< ERROR!
java.lang.NullPointerException
	at org.joda.time.chrono.BaseChronology.get(BaseChronology.java:260)
	at org.joda.time.MutablePeriod.setPeriod(MutablePeriod.java:548)
	at org.joda.time.MutablePeriod.setPeriod(MutablePeriod.java:522)
	at org.joda.time.TestMutablePeriod_Updates.testSetPeriod_RI_RI2(TestMutablePeriod_Updates.java:742)

testSetPeriod_RInterval1(org.joda.time.TestMutablePeriod_Updates)  Time elapsed: 0 sec  <<< ERROR!
java.lang.NullPointerException
	at org.joda.time.chrono.BaseChronology.get(BaseChronology.java:260)
	at org.joda.time.MutablePeriod.setPeriod(MutablePeriod.java:548)
	at org.joda.time.MutablePeriod.setPeriod(MutablePeriod.java:501)
	at org.joda.time.TestMutablePeriod_Updates.testSetPeriod_RInterval1(TestMutablePeriod_Updates.java:772)

testSetPeriod_long1(org.joda.time.TestMutablePeriod_Updates)  Time elapsed: 0 sec  <<< ERROR!
java.lang.NullPointerException
	at org.joda.time.chrono.BaseChronology.get(BaseChronology.java:284)
	at org.joda.time.MutablePeriod.setPeriod(MutablePeriod.java:611)
	at org.joda.time.MutablePeriod.setPeriod(MutablePeriod.java:595)
	at org.joda.time.TestMutablePeriod_Updates.testSetPeriod_long1(TestMutablePeriod_Updates.java:799)

testSetPeriod_long2(org.joda.time.TestMutablePeriod_Updates)  Time elapsed: 0 sec  <<< ERROR!
java.lang.NullPointerException
	at org.joda.time.chrono.BaseChronology.get(BaseChronology.java:284)
	at org.joda.time.MutablePeriod.setPeriod(MutablePeriod.java:611)
	at org.joda.time.MutablePeriod.setPeriod(MutablePeriod.java:595)
	at org.joda.time.TestMutablePeriod_Updates.testSetPeriod_long2(TestMutablePeriod_Updates.java:812)

testSetPeriod_RD1(org.joda.time.TestMutablePeriod_Updates)  Time elapsed: 0.001 sec  <<< ERROR!
java.lang.NullPointerException
	at org.joda.time.chrono.BaseChronology.get(BaseChronology.java:284)
	at org.joda.time.MutablePeriod.setPeriod(MutablePeriod.java:611)
	at org.joda.time.MutablePeriod.setPeriod(MutablePeriod.java:580)
	at org.joda.time.MutablePeriod.setPeriod(MutablePeriod.java:563)
	at org.joda.time.TestMutablePeriod_Updates.testSetPeriod_RD1(TestMutablePeriod_Updates.java:1017)

testSetPeriod_RD2(org.joda.time.TestMutablePeriod_Updates)  Time elapsed: 0 sec  <<< ERROR!
java.lang.NullPointerException
	at org.joda.time.chrono.BaseChronology.get(BaseChronology.java:284)
	at org.joda.time.MutablePeriod.setPeriod(MutablePeriod.java:611)
	at org.joda.time.MutablePeriod.setPeriod(MutablePeriod.java:580)
	at org.joda.time.MutablePeriod.setPeriod(MutablePeriod.java:563)
	at org.joda.time.TestMutablePeriod_Updates.testSetPeriod_RD2(TestMutablePeriod_Updates.java:1035)

testAdd_long2(org.joda.time.TestMutablePeriod_Updates)  Time elapsed: 0.002 sec  <<< ERROR!
java.lang.NullPointerException
	at org.joda.time.chrono.BaseChronology.get(BaseChronology.java:284)
	at org.joda.time.base.BasePeriod.<init>(BasePeriod.java:258)
	at org.joda.time.MutablePeriod.<init>(MutablePeriod.java:200)
	at org.joda.time.TestMutablePeriod_Updates.testAdd_long2(TestMutablePeriod_Updates.java:1105)

testAdd_long3(org.joda.time.TestMutablePeriod_Updates)  Time elapsed: 0 sec  <<< ERROR!
java.lang.NullPointerException
	at org.joda.time.chrono.BaseChronology.get(BaseChronology.java:284)
	at org.joda.time.base.BasePeriod.<init>(BasePeriod.java:258)
	at org.joda.time.Period.<init>(Period.java:402)
	at org.joda.time.MutablePeriod.add(MutablePeriod.java:707)
	at org.joda.time.TestMutablePeriod_Updates.testAdd_long3(TestMutablePeriod_Updates.java:1125)

testAdd_long_Chronology1(org.joda.time.TestMutablePeriod_Updates)  Time elapsed: 0 sec  <<< ERROR!
java.lang.NullPointerException
	at org.joda.time.chrono.BaseChronology.get(BaseChronology.java:284)
	at org.joda.time.base.BasePeriod.<init>(BasePeriod.java:258)
	at org.joda.time.Period.<init>(Period.java:444)
	at org.joda.time.MutablePeriod.add(MutablePeriod.java:723)
	at org.joda.time.TestMutablePeriod_Updates.testAdd_long_Chronology1(TestMutablePeriod_Updates.java:1139)

testAdd_long_Chronology2(org.joda.time.TestMutablePeriod_Updates)  Time elapsed: 0 sec  <<< ERROR!
java.lang.NullPointerException
	at org.joda.time.chrono.BaseChronology.get(BaseChronology.java:284)
	at org.joda.time.base.BasePeriod.<init>(BasePeriod.java:258)
	at org.joda.time.MutablePeriod.<init>(MutablePeriod.java:200)
	at org.joda.time.TestMutablePeriod_Updates.testAdd_long_Chronology2(TestMutablePeriod_Updates.java:1151)

testAdd_long_Chronology3(org.joda.time.TestMutablePeriod_Updates)  Time elapsed: 0.001 sec  <<< ERROR!
java.lang.NullPointerException
	at org.joda.time.chrono.BaseChronology.get(BaseChronology.java:284)
	at org.joda.time.base.BasePeriod.<init>(BasePeriod.java:258)
	at org.joda.time.MutablePeriod.<init>(MutablePeriod.java:200)
	at org.joda.time.TestMutablePeriod_Updates.testAdd_long_Chronology3(TestMutablePeriod_Updates.java:1170)

testAdd_RP3(org.joda.time.TestMutablePeriod_Updates)  Time elapsed: 0 sec  <<< ERROR!
java.lang.NullPointerException
	at org.joda.time.chrono.BaseChronology.get(BaseChronology.java:284)
	at org.joda.time.base.BasePeriod.<init>(BasePeriod.java:258)
	at org.joda.time.MutablePeriod.<init>(MutablePeriod.java:200)
	at org.joda.time.TestMutablePeriod_Updates.testAdd_RP3(TestMutablePeriod_Updates.java:1262)

testAdd_RInterval1(org.joda.time.TestMutablePeriod_Updates)  Time elapsed: 0 sec  <<< ERROR!
java.lang.NullPointerException
	at org.joda.time.chrono.BaseChronology.get(BaseChronology.java:260)
	at org.joda.time.base.BasePeriod.<init>(BasePeriod.java:110)
	at org.joda.time.Period.<init>(Period.java:490)
	at org.joda.time.base.AbstractInterval.toPeriod(AbstractInterval.java:447)
	at org.joda.time.MutablePeriod.add(MutablePeriod.java:678)
	at org.joda.time.TestMutablePeriod_Updates.testAdd_RInterval1(TestMutablePeriod_Updates.java:1319)

testAdd_RInterval2(org.joda.time.TestMutablePeriod_Updates)  Time elapsed: 0.001 sec  <<< ERROR!
java.lang.NullPointerException
	at org.joda.time.chrono.BaseChronology.get(BaseChronology.java:260)
	at org.joda.time.base.BasePeriod.<init>(BasePeriod.java:110)
	at org.joda.time.Period.<init>(Period.java:490)
	at org.joda.time.base.AbstractInterval.toPeriod(AbstractInterval.java:447)
	at org.joda.time.MutablePeriod.add(MutablePeriod.java:678)
	at org.joda.time.TestMutablePeriod_Updates.testAdd_RInterval2(TestMutablePeriod_Updates.java:1334)

testAdd_long1(org.joda.time.TestMutablePeriod_Updates)  Time elapsed: 0 sec  <<< ERROR!
java.lang.NullPointerException
	at org.joda.time.chrono.BaseChronology.get(BaseChronology.java:284)
	at org.joda.time.base.BasePeriod.<init>(BasePeriod.java:258)
	at org.joda.time.Period.<init>(Period.java:402)
	at org.joda.time.MutablePeriod.add(MutablePeriod.java:707)
	at org.joda.time.TestMutablePeriod_Updates.testAdd_long1(TestMutablePeriod_Updates.java:1093)

testAdd_RD1(org.joda.time.TestMutablePeriod_Updates)  Time elapsed: 0.001 sec  <<< ERROR!
java.lang.NullPointerException
	at org.joda.time.chrono.BaseChronology.get(BaseChronology.java:284)
	at org.joda.time.base.BasePeriod.<init>(BasePeriod.java:258)
	at org.joda.time.Period.<init>(Period.java:402)
	at org.joda.time.MutablePeriod.add(MutablePeriod.java:691)
	at org.joda.time.TestMutablePeriod_Updates.testAdd_RD1(TestMutablePeriod_Updates.java:1191)

testFactory_standardPeriodIn_RPeriod(org.joda.time.TestBaseSingleFieldPeriod)  Time elapsed: 0.001 sec  <<< ERROR!
java.lang.NullPointerException
	at org.joda.time.base.BaseSingleFieldPeriod.standardPeriodIn(BaseSingleFieldPeriod.java:139)
	at org.joda.time.TestBaseSingleFieldPeriod$Single.standardPeriodIn(TestBaseSingleFieldPeriod.java:314)
	at org.joda.time.TestBaseSingleFieldPeriod.testFactory_standardPeriodIn_RPeriod(TestBaseSingleFieldPeriod.java:145)

testAddToLocalDate(org.joda.time.TestWeeks)  Time elapsed: 0 sec  <<< ERROR!
java.lang.NullPointerException
	at org.joda.time.LocalDate.isSupported(LocalDate.java:596)
	at org.joda.time.LocalDate.withPeriodAdded(LocalDate.java:1168)
	at org.joda.time.LocalDate.plus(LocalDate.java:1193)
	at org.joda.time.TestWeeks.testAddToLocalDate(TestWeeks.java:397)

testFactory_weeksBetween_RInstant(org.joda.time.TestWeeks)  Time elapsed: 0.001 sec  <<< ERROR!
java.lang.NullPointerException
	at org.joda.time.base.BaseSingleFieldPeriod.between(BaseSingleFieldPeriod.java:72)
	at org.joda.time.Weeks.weeksBetween(Weeks.java:101)
	at org.joda.time.TestWeeks.testFactory_weeksBetween_RInstant(TestWeeks.java:82)

testFactory_weeksBetween_RPartial(org.joda.time.TestWeeks)  Time elapsed: 0 sec  <<< ERROR!
java.lang.NullPointerException
	at org.joda.time.Weeks.weeksBetween(Weeks.java:120)
	at org.joda.time.TestWeeks.testFactory_weeksBetween_RPartial(TestWeeks.java:95)

testFactory_weeksIn_RInterval(org.joda.time.TestWeeks)  Time elapsed: 0 sec  <<< ERROR!
java.lang.NullPointerException
	at org.joda.time.base.BaseSingleFieldPeriod.between(BaseSingleFieldPeriod.java:72)
	at org.joda.time.Weeks.weeksIn(Weeks.java:140)
	at org.joda.time.TestWeeks.testFactory_weeksIn_RInterval(TestWeeks.java:108)

testFactory_standardWeeksIn_RPeriod(org.joda.time.TestWeeks)  Time elapsed: 0.001 sec  <<< ERROR!
java.lang.NullPointerException
	at org.joda.time.base.BaseSingleFieldPeriod.standardPeriodIn(BaseSingleFieldPeriod.java:139)
	at org.joda.time.Weeks.standardWeeksIn(Weeks.java:165)
	at org.joda.time.TestWeeks.testFactory_standardWeeksIn_RPeriod(TestWeeks.java:117)

testFactory_standardDaysIn_RPeriod(org.joda.time.TestDays)  Time elapsed: 0 sec  <<< ERROR!
java.lang.NullPointerException
	at org.joda.time.base.BaseSingleFieldPeriod.standardPeriodIn(BaseSingleFieldPeriod.java:139)
	at org.joda.time.Days.standardDaysIn(Days.java:183)
	at org.joda.time.TestDays.testFactory_standardDaysIn_RPeriod(TestDays.java:164)

testGetFormatter3(org.joda.time.TestPartial_Basics)  Time elapsed: 0.001 sec  <<< ERROR!
java.lang.NullPointerException
	at org.joda.time.field.BaseDurationField.compareTo(BaseDurationField.java:146)
	at org.joda.time.field.BaseDurationField.compareTo(BaseDurationField.java:38)
	at org.joda.time.Partial.with(Partial.java:480)
	at org.joda.time.TestPartial_Basics.testGetFormatter3(TestPartial_Basics.java:829)

testToString4(org.joda.time.TestPartial_Basics)  Time elapsed: 0 sec  <<< ERROR!
java.lang.NullPointerException
	at org.joda.time.field.BaseDurationField.compareTo(BaseDurationField.java:146)
	at org.joda.time.field.BaseDurationField.compareTo(BaseDurationField.java:38)
	at org.joda.time.Partial.with(Partial.java:480)
	at org.joda.time.TestPartial_Basics.testToString4(TestPartial_Basics.java:862)

testConstructorEx9_TypeArray_intArray(org.joda.time.TestPartial_Constructors)  Time elapsed: 0 sec  <<< ERROR!
java.lang.NullPointerException
	at org.joda.time.field.BaseDurationField.compareTo(BaseDurationField.java:146)
	at org.joda.time.field.BaseDurationField.compareTo(BaseDurationField.java:38)
	at org.joda.time.Partial.<init>(Partial.java:250)
	at org.joda.time.Partial.<init>(Partial.java:177)
	at org.joda.time.TestPartial_Constructors.testConstructorEx9_TypeArray_intArray(TestPartial_Constructors.java:407)

testIsContiguous_RP(org.joda.time.TestDateTimeUtils)  Time elapsed: 0.001 sec  <<< ERROR!
java.lang.NullPointerException
	at org.joda.time.Partial.with(Partial.java:480)
	at org.joda.time.TestDateTimeUtils.testIsContiguous_RP(TestDateTimeUtils.java:440)

testIsContiguous_RP_GJChronology(org.joda.time.TestDateTimeUtils)  Time elapsed: 0.001 sec  <<< ERROR!
java.lang.NullPointerException
	at org.joda.time.Partial.with(Partial.java:480)
	at org.joda.time.TestDateTimeUtils.testIsContiguous_RP_GJChronology(TestDateTimeUtils.java:464)

testPeriod(org.joda.time.TestDateTimeZoneCutover)  Time elapsed: 0.003 sec  <<< ERROR!
java.lang.NullPointerException
	at org.joda.time.chrono.BaseChronology.get(BaseChronology.java:260)
	at org.joda.time.base.BasePeriod.<init>(BasePeriod.java:132)
	at org.joda.time.Period.<init>(Period.java:548)
	at org.joda.time.TestDateTimeZoneCutover.testPeriod(TestDateTimeZoneCutover.java:1249)

testKeyYears(org.joda.time.chrono.TestBuddhistChronology)  Time elapsed: 0.001 sec  <<< ERROR!
java.lang.NullPointerException
	at org.joda.time.chrono.BaseChronology.add(BaseChronology.java:307)
	at org.joda.time.DateTime.withPeriodAdded(DateTime.java:941)
	at org.joda.time.DateTime.plus(DateTime.java:997)
	at org.joda.time.chrono.TestBuddhistChronology.testKeyYears(TestBuddhistChronology.java:315)

testDurationFields(org.joda.time.chrono.TestBuddhistChronology)  Time elapsed: 0 sec  <<< ERROR!
java.lang.NullPointerException
	at org.joda.time.chrono.TestBuddhistChronology.testDurationFields(TestBuddhistChronology.java:152)

testDateFields(org.joda.time.chrono.TestBuddhistChronology)  Time elapsed: 0.001 sec  <<< FAILURE!
junit.framework.AssertionFailedError: expected:<null> but was:<DurationField[weeks]>
	at junit.framework.Assert.fail(Assert.java:47)
	at junit.framework.Assert.failNotEquals(Assert.java:280)
	at junit.framework.Assert.assertEquals(Assert.java:64)
	at junit.framework.Assert.assertEquals(Assert.java:71)
	at org.joda.time.chrono.TestBuddhistChronology.testDateFields(TestBuddhistChronology.java:249)

testDurationFields(org.joda.time.chrono.TestCopticChronology)  Time elapsed: 0 sec  <<< ERROR!
java.lang.NullPointerException
	at org.joda.time.chrono.TestCopticChronology.testDurationFields(TestCopticChronology.java:155)

testDateFields(org.joda.time.chrono.TestCopticChronology)  Time elapsed: 0.001 sec  <<< FAILURE!
junit.framework.AssertionFailedError: expected:<null> but was:<DurationField[weeks]>
	at junit.framework.Assert.fail(Assert.java:47)
	at junit.framework.Assert.failNotEquals(Assert.java:280)
	at junit.framework.Assert.assertEquals(Assert.java:64)
	at junit.framework.Assert.assertEquals(Assert.java:71)
	at org.joda.time.chrono.TestCopticChronology.testDateFields(TestCopticChronology.java:252)

testDurationFields(org.joda.time.chrono.TestEthiopicChronology)  Time elapsed: 0 sec  <<< ERROR!
java.lang.NullPointerException
	at org.joda.time.chrono.TestEthiopicChronology.testDurationFields(TestEthiopicChronology.java:155)

testDateFields(org.joda.time.chrono.TestEthiopicChronology)  Time elapsed: 0 sec  <<< FAILURE!
junit.framework.AssertionFailedError: expected:<null> but was:<DurationField[weeks]>
	at junit.framework.Assert.fail(Assert.java:47)
	at junit.framework.Assert.failNotEquals(Assert.java:280)
	at junit.framework.Assert.assertEquals(Assert.java:64)
	at junit.framework.Assert.assertEquals(Assert.java:71)
	at org.joda.time.chrono.TestEthiopicChronology.testDateFields(TestEthiopicChronology.java:252)

testCutoverAddWeeks(org.joda.time.chrono.TestGJChronology)  Time elapsed: 0.001 sec  <<< ERROR!
java.lang.NullPointerException
	at org.joda.time.DateTime.withFieldAdded(DateTime.java:882)
	at org.joda.time.chrono.TestGJChronology.testAdd(TestGJChronology.java:484)
	at org.joda.time.chrono.TestGJChronology.testCutoverAddWeeks(TestGJChronology.java:443)

testDurationFields(org.joda.time.chrono.TestGJChronology)  Time elapsed: 0.001 sec  <<< ERROR!
java.lang.NullPointerException
	at org.joda.time.chrono.TestGJChronology.testDurationFields(TestGJChronology.java:206)

testDateFields(org.joda.time.chrono.TestGJChronology)  Time elapsed: 0 sec  <<< FAILURE!
junit.framework.AssertionFailedError: expected:<null> but was:<DurationField[weeks]>
	at junit.framework.Assert.fail(Assert.java:47)
	at junit.framework.Assert.failNotEquals(Assert.java:280)
	at junit.framework.Assert.assertEquals(Assert.java:64)
	at junit.framework.Assert.assertEquals(Assert.java:71)
	at org.joda.time.chrono.TestGJChronology.testDateFields(TestGJChronology.java:303)

testDurationFields(org.joda.time.chrono.TestGregorianChronology)  Time elapsed: 0 sec  <<< ERROR!
java.lang.NullPointerException
	at org.joda.time.chrono.TestGregorianChronology.testDurationFields(TestGregorianChronology.java:162)

testDateFields(org.joda.time.chrono.TestGregorianChronology)  Time elapsed: 0.001 sec  <<< FAILURE!
junit.framework.AssertionFailedError: expected:<null> but was:<DurationField[weeks]>
	at junit.framework.Assert.fail(Assert.java:47)
	at junit.framework.Assert.failNotEquals(Assert.java:280)
	at junit.framework.Assert.assertEquals(Assert.java:64)
	at junit.framework.Assert.assertEquals(Assert.java:71)
	at org.joda.time.chrono.TestGregorianChronology.testDateFields(TestGregorianChronology.java:259)

testDurationFields(org.joda.time.chrono.TestIslamicChronology)  Time elapsed: 0 sec  <<< ERROR!
java.lang.NullPointerException
	at org.joda.time.chrono.TestIslamicChronology.testDurationFields(TestIslamicChronology.java:152)

testDateFields(org.joda.time.chrono.TestIslamicChronology)  Time elapsed: 0.001 sec  <<< FAILURE!
junit.framework.AssertionFailedError: expected:<null> but was:<DurationField[weeks]>
	at junit.framework.Assert.fail(Assert.java:47)
	at junit.framework.Assert.failNotEquals(Assert.java:280)
	at junit.framework.Assert.assertEquals(Assert.java:64)
	at junit.framework.Assert.assertEquals(Assert.java:71)
	at org.joda.time.chrono.TestIslamicChronology.testDateFields(TestIslamicChronology.java:249)

testDurationFields(org.joda.time.chrono.TestJulianChronology)  Time elapsed: 0 sec  <<< ERROR!
java.lang.NullPointerException
	at org.joda.time.chrono.TestJulianChronology.testDurationFields(TestJulianChronology.java:159)

testDateFields(org.joda.time.chrono.TestJulianChronology)  Time elapsed: 0 sec  <<< FAILURE!
junit.framework.AssertionFailedError: expected:<null> but was:<DurationField[weeks]>
	at junit.framework.Assert.fail(Assert.java:47)
	at junit.framework.Assert.failNotEquals(Assert.java:280)
	at junit.framework.Assert.assertEquals(Assert.java:64)
	at junit.framework.Assert.assertEquals(Assert.java:71)
	at org.joda.time.chrono.TestJulianChronology.testDateFields(TestJulianChronology.java:256)

testDurationFields(org.joda.time.chrono.TestISOChronology)  Time elapsed: 0.001 sec  <<< ERROR!
java.lang.NullPointerException
	at org.joda.time.chrono.TestISOChronology.testDurationFields(TestISOChronology.java:152)

testDateFields(org.joda.time.chrono.TestISOChronology)  Time elapsed: 0.001 sec  <<< FAILURE!
junit.framework.AssertionFailedError: expected:<null> but was:<DurationField[weeks]>
	at junit.framework.Assert.fail(Assert.java:47)
	at junit.framework.Assert.failNotEquals(Assert.java:280)
	at junit.framework.Assert.assertEquals(Assert.java:64)
	at junit.framework.Assert.assertEquals(Assert.java:71)
	at org.joda.time.chrono.TestISOChronology.testDateFields(TestISOChronology.java:263)

testGetPeriodType_Object(org.joda.time.convert.TestReadablePeriodConverter)  Time elapsed: 0.001 sec  <<< ERROR!
java.lang.NullPointerException
	at org.joda.time.chrono.BaseChronology.get(BaseChronology.java:284)
	at org.joda.time.base.BasePeriod.<init>(BasePeriod.java:258)
	at org.joda.time.Period.<init>(Period.java:402)
	at org.joda.time.convert.TestReadablePeriodConverter.testGetPeriodType_Object(TestReadablePeriodConverter.java:90)

testGetInstantMillis_Object(org.joda.time.convert.TestStringConverter)  Time elapsed: 0.001 sec  <<< FAILURE!
junit.framework.AssertionFailedError: expected:<1086710400000> but was:<1086537600000>
	at junit.framework.Assert.fail(Assert.java:47)
	at junit.framework.Assert.failNotEquals(Assert.java:280)
	at junit.framework.Assert.assertEquals(Assert.java:64)
	at junit.framework.Assert.assertEquals(Assert.java:133)
	at junit.framework.Assert.assertEquals(Assert.java:139)
	at org.joda.time.convert.TestStringConverter.testGetInstantMillis_Object(TestStringConverter.java:129)

testParseInto_simple_precedence(org.joda.time.format.TestDateTimeFormatter)  Time elapsed: 0.002 sec  <<< FAILURE!
junit.framework.AssertionFailedError: expected:<2004-06-07T11:20:30.000+01:00> but was:<2003-06-09T11:20:30.000+01:00>
	at junit.framework.Assert.fail(Assert.java:47)
	at junit.framework.Assert.failNotEquals(Assert.java:280)
	at junit.framework.Assert.assertEquals(Assert.java:64)
	at junit.framework.Assert.assertEquals(Assert.java:71)
	at org.joda.time.format.TestDateTimeFormatter.testParseInto_simple_precedence(TestDateTimeFormatter.java:816)

testParseDateTime_simple_precedence(org.joda.time.format.TestDateTimeFormatter)  Time elapsed: 0 sec  <<< FAILURE!
junit.framework.AssertionFailedError: expected:<2004-06-07T11:20:30.000+01:00> but was:<2004-06-09T11:20:30.000+01:00>
	at junit.framework.Assert.fail(Assert.java:47)
	at junit.framework.Assert.failNotEquals(Assert.java:280)
	at junit.framework.Assert.assertEquals(Assert.java:64)
	at junit.framework.Assert.assertEquals(Assert.java:71)
	at org.joda.time.format.TestDateTimeFormatter.testParseDateTime_simple_precedence(TestDateTimeFormatter.java:603)

testParseMutableDateTime_simple_precedence(org.joda.time.format.TestDateTimeFormatter)  Time elapsed: 0.001 sec  <<< FAILURE!
junit.framework.AssertionFailedError: expected:<2004-06-07T11:20:30.000+01:00> but was:<2004-06-09T11:20:30.000+01:00>
	at junit.framework.Assert.fail(Assert.java:47)
	at junit.framework.Assert.failNotEquals(Assert.java:280)
	at junit.framework.Assert.assertEquals(Assert.java:64)
	at junit.framework.Assert.assertEquals(Assert.java:71)
	at org.joda.time.format.TestDateTimeFormatter.testParseMutableDateTime_simple_precedence(TestDateTimeFormatter.java:698)

testForFields_weekBased_YW(org.joda.time.format.TestISODateTimeFormat_Fields)  Time elapsed: 0.001 sec  <<< ERROR!
java.lang.NullPointerException
	at org.joda.time.Partial.<init>(Partial.java:221)
	at org.joda.time.Partial.<init>(Partial.java:177)
	at org.joda.time.format.TestISODateTimeFormat_Fields.testForFields_weekBased_YW(TestISODateTimeFormat_Fields.java:434)

testForFields_weekBased_WD(org.joda.time.format.TestISODateTimeFormat_Fields)  Time elapsed: 0 sec  <<< ERROR!
java.lang.NullPointerException
	at org.joda.time.Partial.<init>(Partial.java:230)
	at org.joda.time.Partial.<init>(Partial.java:177)
	at org.joda.time.format.TestISODateTimeFormat_Fields.testForFields_weekBased_WD(TestISODateTimeFormat_Fields.java:462)

testForFields_weekBased_YWD(org.joda.time.format.TestISODateTimeFormat_Fields)  Time elapsed: 0.001 sec  <<< ERROR!
java.lang.NullPointerException
	at org.joda.time.Partial.<init>(Partial.java:221)
	at org.joda.time.Partial.<init>(Partial.java:177)
	at org.joda.time.format.TestISODateTimeFormat_Fields.testForFields_weekBased_YWD(TestISODateTimeFormat_Fields.java:325)

test_weekDate(org.joda.time.format.TestISODateTimeFormatParsing)  Time elapsed: 0.001 sec  <<< FAILURE!
junit.framework.AssertionFailedError: expected:<2006-07-05T00:00:00.000+01:00> but was:<2006-07-03T00:00:00.000+01:00>
	at junit.framework.Assert.fail(Assert.java:47)
	at junit.framework.Assert.failNotEquals(Assert.java:280)
	at junit.framework.Assert.assertEquals(Assert.java:64)
	at junit.framework.Assert.assertEquals(Assert.java:71)
	at org.joda.time.format.TestISODateTimeFormatParsing.assertParse(TestISODateTimeFormatParsing.java:841)
	at org.joda.time.format.TestISODateTimeFormatParsing.test_weekDate(TestISODateTimeFormatParsing.java:520)

test_basicWeekDate(org.joda.time.format.TestISODateTimeFormatParsing)  Time elapsed: 0 sec  <<< FAILURE!
junit.framework.AssertionFailedError: expected:<2006-07-05T00:00:00.000+01:00> but was:<2006-07-03T00:00:00.000+01:00>
	at junit.framework.Assert.fail(Assert.java:47)
	at junit.framework.Assert.failNotEquals(Assert.java:280)
	at junit.framework.Assert.assertEquals(Assert.java:64)
	at junit.framework.Assert.assertEquals(Assert.java:71)
	at org.joda.time.format.TestISODateTimeFormatParsing.assertParse(TestISODateTimeFormatParsing.java:841)
	at org.joda.time.format.TestISODateTimeFormatParsing.test_basicWeekDate(TestISODateTimeFormatParsing.java:724)


Results :

Failed tests: 
  org.joda.time.TestDateMidnight_Properties#testPropertyGetDayOfWeek AssertionFailedError
  org.joda.time.TestDateMidnight_Properties#testPropertyGetWeekOfWeekyear AssertionFailedError
  org.joda.time.TestDateTime_Properties#testPropertyGetDayOfWeek AssertionFailedError
  org.joda.time.TestDateTime_Properties#testPropertyGetWeekOfWeekyear AssertionFailedError
  org.joda.time.TestMutableDateTime_Properties#testPropertyGetDayOfWeek AssertionFailedError
  org.joda.time.TestMutableDateTime_Properties#testPropertyGetWeekOfWeekyear AssertionFailedError
  org.joda.time.chrono.TestBuddhistChronology#testDateFields AssertionFailedError
  org.joda.time.chrono.TestCopticChronology#testDateFields AssertionFailedError ...
  org.joda.time.chrono.TestEthiopicChronology#testDateFields AssertionFailedError
  org.joda.time.chrono.TestGJChronology#testDateFields AssertionFailedError expe...
  org.joda.time.chrono.TestGregorianChronology#testDateFields AssertionFailedError
  org.joda.time.chrono.TestISOChronology#testDateFields AssertionFailedError exp...
  org.joda.time.chrono.TestIslamicChronology#testDateFields AssertionFailedError
  org.joda.time.chrono.TestJulianChronology#testDateFields AssertionFailedError ...
  org.joda.time.convert.TestStringConverter#testGetInstantMillis_Object AssertionFailedError
  org.joda.time.format.TestDateTimeFormatter#testParseDateTime_simple_precedence AssertionFailedError
  org.joda.time.format.TestDateTimeFormatter#testParseInto_simple_precedence AssertionFailedError
  org.joda.time.format.TestDateTimeFormatter#testParseMutableDateTime_simple_precedence AssertionFailedError
  org.joda.time.format.TestISODateTimeFormatParsing#test_basicWeekDate AssertionFailedError
  org.joda.time.format.TestISODateTimeFormatParsing#test_weekDate AssertionFailedError
Tests in error: 
  org.joda.time.TestBaseSingleFieldPeriod#testFactory_standardPeriodIn_RPeriod NullPointerException
  org.joda.time.TestDateMidnight_Basics#testMinusWeeks_int NullPointerException
  org.joda.time.TestDateMidnight_Basics#testMinus_RP NullPointerException
  org.joda.time.TestDateMidnight_Basics#testPlusWeeks_int NullPointerException
  org.joda.time.TestDateMidnight_Basics#testPlus_RP NullPointerException
  org.joda.time.TestDateMidnight_Basics#testWithDurationAdded_RP_int NullPointerException
  org.joda.time.TestDateTimeUtils#testIsContiguous_RP NullPointerException
  org.joda.time.TestDateTimeUtils#testIsContiguous_RP_GJChronology NullPointerException
  org.joda.time.TestDateTimeZoneCutover#testPeriod NullPointerException
  org.joda.time.TestDateTime_Basics#testMinusWeeks_int NullPointerException
  org.joda.time.TestDateTime_Basics#testMinus_RP NullPointerException
  org.joda.time.TestDateTime_Basics#testPlusWeeks_int NullPointerException
  org.joda.time.TestDateTime_Basics#testPlus_RP NullPointerException
  org.joda.time.TestDateTime_Basics#testWithDurationAdded_RP_int NullPointerException
  org.joda.time.TestDays#testFactory_standardDaysIn_RPeriod NullPointerException
  org.joda.time.TestDurationFieldType#test_weeks NullPointerException
  org.joda.time.TestDuration_Basics#testToPeriodFrom NullPointerException
  org.joda.time.TestDuration_Basics#testToPeriodFrom_PeriodType NullPointerException
  org.joda.time.TestDuration_Basics#testToPeriodTo NullPointerException
  org.joda.time.TestDuration_Basics#testToPeriodTo_PeriodType NullPointerException
  org.joda.time.TestDuration_Basics#testToPeriod_Chronology NullPointerException
  org.joda.time.TestDuration_Basics#testToPeriod_PeriodType NullPointerException
  org.joda.time.TestDuration_Basics#testToPeriod_PeriodType_Chronology NullPointerException
  org.joda.time.TestInterval_Basics#testToPeriod NullPointerException
  org.joda.time.TestInterval_Basics#testToPeriod_PeriodType1 NullPointerException
  org.joda.time.TestInterval_Basics#testToPeriod_PeriodType2 NullPointerException
  org.joda.time.TestLocalDateTime_Basics#testIsSupported_DurationFieldType NullPointerException
  org.joda.time.TestLocalDateTime_Basics#testMinusWeeks_int NullPointerException
  org.joda.time.TestLocalDateTime_Basics#testMinus_RP NullPointerException
  org.joda.time.TestLocalDateTime_Basics#testPlusWeeks_int NullPointerException
  org.joda.time.TestLocalDateTime_Basics#testPlus_RP NullPointerException
  org.joda.time.TestLocalDate_Basics#testIsSupported_DurationFieldType NullPointerException
  org.joda.time.TestLocalDate_Basics#testMinusWeeks_int NullPointerException
  org.joda.time.TestLocalDate_Basics#testMinus_RP NullPointerException
  org.joda.time.TestLocalDate_Basics#testPlusWeeks_int NullPointerException
  org.joda.time.TestLocalDate_Basics#testPlus_RP NullPointerException
  org.joda.time.TestLocalTime_Basics#testMinus_RP NullPointerException
  org.joda.time.TestLocalTime_Basics#testPlus_RP NullPointerException
  org.joda.time.TestMutableDateTime_Adds#testAddWeeks_int1 NullPointerException
  org.joda.time.TestMutableInterval_Basics#testToPeriod NullPointerException
  org.joda.time.TestMutableInterval_Basics#testToPeriod_PeriodType1 NullPointerException
  org.joda.time.TestMutableInterval_Basics#testToPeriod_PeriodType2 NullPointerException
  org.joda.time.TestMutablePeriod_Basics#testEqualsHashCode NullPointerException
  org.joda.time.TestMutablePeriod_Constructors#testConstructor_Object_Chronology1 NullPointerException
  org.joda.time.TestMutablePeriod_Constructors#testConstructor_Object_Chronology2 NullPointerException
  org.joda.time.TestMutablePeriod_Constructors#testConstructor_RI_RD1 NullPointerException
  org.joda.time.TestMutablePeriod_Constructors#testConstructor_RI_RI1 NullPointerException
  org.joda.time.TestMutablePeriod_Constructors#testConstructor_RI_RI2 NullPointerException
  org.joda.time.TestMutablePeriod_Constructors#testConstructor_RI_RI3 NullPointerException
  org.joda.time.TestMutablePeriod_Constructors#testConstructor_RI_RI4 NullPointerException
  org.joda.time.TestMutablePeriod_Constructors#testConstructor_RI_RI_PeriodType1 NullPointerException
  org.joda.time.TestMutablePeriod_Constructors#testConstructor_RI_RI_PeriodType3 NullPointerException
  org.joda.time.TestMutablePeriod_Constructors#testConstructor_RI_RI_PeriodType4 NullPointerException
  org.joda.time.TestMutablePeriod_Constructors#testConstructor_long_Chronology1 NullPointerException
  org.joda.time.TestMutablePeriod_Constructors#testConstructor_long_Chronology2 NullPointerException
  org.joda.time.TestMutablePeriod_Constructors#testConstructor_long_Chronology3 NullPointerException
  org.joda.time.TestMutablePeriod_Constructors#testConstructor_long_PeriodType1 NullPointerException
  org.joda.time.TestMutablePeriod_Constructors#testConstructor_long_PeriodType3 NullPointerException
  org.joda.time.TestMutablePeriod_Constructors#testConstructor_long_PeriodType4 NullPointerException
  org.joda.time.TestMutablePeriod_Constructors#testConstructor_long_PeriodType_Chronology2 NullPointerException
  org.joda.time.TestMutablePeriod_Constructors#testConstructor_long_PeriodType_Chronology3 NullPointerException
  org.joda.time.TestMutablePeriod_Constructors#testConstructor_long_PeriodType_Chronology4 NullPointerException
  org.joda.time.TestMutablePeriod_Constructors#testConstructor_long_long1 NullPointerException
  org.joda.time.TestMutablePeriod_Constructors#testConstructor_long_long2 NullPointerException
  org.joda.time.TestMutablePeriod_Constructors#testConstructor_long_long_Chronology1 NullPointerException
  org.joda.time.TestMutablePeriod_Constructors#testConstructor_long_long_Chronology2 NullPointerException
  org.joda.time.TestMutablePeriod_Constructors#testConstructor_long_long_PeriodType1 NullPointerException
  org.joda.time.TestMutablePeriod_Constructors#testConstructor_long_long_PeriodType3 NullPointerException
  org.joda.time.TestMutablePeriod_Constructors#testConstructor_long_long_PeriodType_Chronology1 NullPointerException
  org.joda.time.TestMutablePeriod_Constructors#testConstructor_long_long_PeriodType_Chronology2 NullPointerException
  org.joda.time.TestMutablePeriod_Updates#testAdd_RD1 NullPointerException
  org.joda.time.TestMutablePeriod_Updates#testAdd_RInterval1 NullPointerException
  org.joda.time.TestMutablePeriod_Updates#testAdd_RInterval2 NullPointerException
  org.joda.time.TestMutablePeriod_Updates#testAdd_RP2 NullPointerException
  org.joda.time.TestMutablePeriod_Updates#testAdd_RP3 NullPointerException
  org.joda.time.TestMutablePeriod_Updates#testAdd_long1 NullPointerException
  org.joda.time.TestMutablePeriod_Updates#testAdd_long2 NullPointerException
  org.joda.time.TestMutablePeriod_Updates#testAdd_long3 NullPointerException
  org.joda.time.TestMutablePeriod_Updates#testAdd_long_Chronology1 NullPointerException
  org.joda.time.TestMutablePeriod_Updates#testAdd_long_Chronology2 NullPointerException
  org.joda.time.TestMutablePeriod_Updates#testAdd_long_Chronology3 NullPointerException
  org.joda.time.TestMutablePeriod_Updates#testSetPeriod_RD1 NullPointerException
  org.joda.time.TestMutablePeriod_Updates#testSetPeriod_RD2 NullPointerException
  org.joda.time.TestMutablePeriod_Updates#testSetPeriod_RI_RI1 NullPointerException
  org.joda.time.TestMutablePeriod_Updates#testSetPeriod_RI_RI2 NullPointerException
  org.joda.time.TestMutablePeriod_Updates#testSetPeriod_RInterval1 NullPointerException
  org.joda.time.TestMutablePeriod_Updates#testSetPeriod_long1 NullPointerException
  org.joda.time.TestMutablePeriod_Updates#testSetPeriod_long2 NullPointerException
  org.joda.time.TestMutablePeriod_Updates#testSetPeriod_long_long1 NullPointerException
  org.joda.time.TestMutablePeriod_Updates#testSetPeriod_long_long2 NullPointerException
  org.joda.time.TestMutablePeriod_Updates#testSetPeriod_long_long_NoDays NullPointerException
  org.joda.time.TestMutablePeriod_Updates#testSetPeriod_long_long_NoHours NullPointerException
  org.joda.time.TestMutablePeriod_Updates#testSetPeriod_long_long_NoMillis NullPointerException
  org.joda.time.TestMutablePeriod_Updates#testSetPeriod_long_long_NoMinutes NullPointerException
  org.joda.time.TestMutablePeriod_Updates#testSetPeriod_long_long_NoMonths NullPointerException
  org.joda.time.TestMutablePeriod_Updates#testSetPeriod_long_long_NoSeconds NullPointerException
  org.joda.time.TestMutablePeriod_Updates#testSetPeriod_long_long_NoYears NullPointerException
  org.joda.time.TestPartial_Basics#testGetFormatter3 NullPointerException
  org.joda.time.TestPartial_Basics#testToString4 NullPointerException
  org.joda.time.TestPartial_Constructors#testConstructorEx9_TypeArray_intArray NullPointerException
  org.joda.time.TestPeriod_Basics#testEqualsHashCode NullPointerException
  org.joda.time.TestPeriod_Basics#testNormalizedStandard_fullNegative NullPointerException
  org.joda.time.TestPeriod_Basics#testNormalizedStandard_negative NullPointerException
  org.joda.time.TestPeriod_Basics#testNormalizedStandard_periodType_monthsWeeks NullPointerException
  org.joda.time.TestPeriod_Basics#testNormalizedStandard_periodType_weekDay1 NullPointerException
  org.joda.time.TestPeriod_Basics#testNormalizedStandard_periodType_weekDay2 NullPointerException
  org.joda.time.TestPeriod_Basics#testNormalizedStandard_weekDay1 NullPointerException
  org.joda.time.TestPeriod_Basics#testNormalizedStandard_weekDay2 NullPointerException
  org.joda.time.TestPeriod_Basics#testNormalizedStandard_yearMonthDay NullPointerException
  org.joda.time.TestPeriod_Basics#testNormalizedStandard_yearMonthWeekDay NullPointerException
  org.joda.time.TestPeriod_Constructors#testConstructor_RD_RI1 NullPointerException
  org.joda.time.TestPeriod_Constructors#testConstructor_RI_RD1 NullPointerException
  org.joda.time.TestPeriod_Constructors#testConstructor_RI_RI1 NullPointerException
  org.joda.time.TestPeriod_Constructors#testConstructor_RI_RI2 NullPointerException
  org.joda.time.TestPeriod_Constructors#testConstructor_RI_RI3 NullPointerException
  org.joda.time.TestPeriod_Constructors#testConstructor_RI_RI4 NullPointerException
  org.joda.time.TestPeriod_Constructors#testConstructor_RI_RI6 NullPointerException
  org.joda.time.TestPeriod_Constructors#testConstructor_RI_RI7 NullPointerException
  org.joda.time.TestPeriod_Constructors#testConstructor_RI_RI_PeriodType1 NullPointerException
  org.joda.time.TestPeriod_Constructors#testConstructor_RI_RI_PeriodType3 NullPointerException
  org.joda.time.TestPeriod_Constructors#testConstructor_RI_RI_PeriodType4 NullPointerException
  org.joda.time.TestPeriod_Constructors#testConstructor_RP_RP1 NullPointerException
  org.joda.time.TestPeriod_Constructors#testConstructor_RP_RP2 NullPointerException
  org.joda.time.TestPeriod_Constructors#testConstructor_RP_RP2Local NullPointerException
  org.joda.time.TestPeriod_Constructors#testConstructor_RP_RP_PeriodType1 NullPointerException
  org.joda.time.TestPeriod_Constructors#testConstructor_long_Chronology1 NullPointerException
  org.joda.time.TestPeriod_Constructors#testConstructor_long_Chronology2 NullPointerException
  org.joda.time.TestPeriod_Constructors#testConstructor_long_Chronology3 NullPointerException
  org.joda.time.TestPeriod_Constructors#testConstructor_long_PeriodType1 NullPointerException
  org.joda.time.TestPeriod_Constructors#testConstructor_long_PeriodType4 NullPointerException
  org.joda.time.TestPeriod_Constructors#testConstructor_long_PeriodType_Chronology2 NullPointerException
  org.joda.time.TestPeriod_Constructors#testConstructor_long_PeriodType_Chronology3 NullPointerException
  org.joda.time.TestPeriod_Constructors#testConstructor_long_PeriodType_Chronology4 NullPointerException
  org.joda.time.TestPeriod_Constructors#testConstructor_long_long1 NullPointerException
  org.joda.time.TestPeriod_Constructors#testConstructor_long_long2 NullPointerException
  org.joda.time.TestPeriod_Constructors#testConstructor_long_long_Chronology1 NullPointerException
  org.joda.time.TestPeriod_Constructors#testConstructor_long_long_Chronology2 NullPointerException
  org.joda.time.TestPeriod_Constructors#testConstructor_long_long_PeriodType1 NullPointerException
  org.joda.time.TestPeriod_Constructors#testConstructor_long_long_PeriodType3 NullPointerException
  org.joda.time.TestPeriod_Constructors#testConstructor_long_long_PeriodType_Chronology1 NullPointerException
  org.joda.time.TestPeriod_Constructors#testConstructor_long_long_PeriodType_Chronology2 NullPointerException
  org.joda.time.TestPeriod_Constructors#testConstructor_trickyDifferences_LD_LD_toFeb_endOfMonth1 NullPointerException
  org.joda.time.TestPeriod_Constructors#testConstructor_trickyDifferences_LD_LD_toFeb_endOfMonth2 NullPointerException
  org.joda.time.TestPeriod_Constructors#testConstructor_trickyDifferences_LD_LD_toFeb_endOfMonth3 NullPointerException
  org.joda.time.TestPeriod_Constructors#testConstructor_trickyDifferences_LD_LD_toFeb_exactMonths NullPointerException
  org.joda.time.TestPeriod_Constructors#testConstructor_trickyDifferences_LD_LD_toFeb_leapYear NullPointerException
  org.joda.time.TestPeriod_Constructors#testConstructor_trickyDifferences_LD_LD_toFeb_standardYear NullPointerException
  org.joda.time.TestPeriod_Constructors#testConstructor_trickyDifferences_LD_LD_toMar_endOfMonth1 NullPointerException
  org.joda.time.TestPeriod_Constructors#testConstructor_trickyDifferences_LD_LD_toMar_endOfMonth2 NullPointerException
  org.joda.time.TestPeriod_Constructors#testConstructor_trickyDifferences_RI_RI_toFeb_endOfMonth1 NullPointerException
  org.joda.time.TestPeriod_Constructors#testConstructor_trickyDifferences_RI_RI_toFeb_endOfMonth2 NullPointerException
  org.joda.time.TestPeriod_Constructors#testConstructor_trickyDifferences_RI_RI_toFeb_endOfMonth3 NullPointerException
  org.joda.time.TestPeriod_Constructors#testConstructor_trickyDifferences_RI_RI_toFeb_exactMonths NullPointerException
  org.joda.time.TestPeriod_Constructors#testConstructor_trickyDifferences_RI_RI_toFeb_leapYear NullPointerException
  org.joda.time.TestPeriod_Constructors#testConstructor_trickyDifferences_RI_RI_toFeb_standardYear NullPointerException
  org.joda.time.TestPeriod_Constructors#testConstructor_trickyDifferences_RI_RI_toMar_endOfMonth1 NullPointerException
  org.joda.time.TestPeriod_Constructors#testConstructor_trickyDifferences_RI_RI_toMar_endOfMonth2 NullPointerException
  org.joda.time.TestPeriod_Constructors#testFactoryFieldDifference5 NullPointerException
  org.joda.time.TestPeriod_Constructors#testToPeriod_PeriodType3 NullPointerException
  org.joda.time.TestWeeks#testAddToLocalDate NullPointerException
  org.joda.time.TestWeeks#testFactory_standardWeeksIn_RPeriod NullPointerException
  org.joda.time.TestWeeks#testFactory_weeksBetween_RInstant NullPointerException
  org.joda.time.TestWeeks#testFactory_weeksBetween_RPartial NullPointerException
  org.joda.time.TestWeeks#testFactory_weeksIn_RInterval NullPointerException
  org.joda.time.chrono.TestBuddhistChronology#testDurationFields NullPointerException
  org.joda.time.chrono.TestBuddhistChronology#testKeyYears NullPointerException
  org.joda.time.chrono.TestCopticChronology#testDurationFields NullPointerException
  org.joda.time.chrono.TestEthiopicChronology#testDurationFields NullPointerException
  org.joda.time.chrono.TestGJChronology#testCutoverAddWeeks NullPointerException
  org.joda.time.chrono.TestGJChronology#testDurationFields NullPointerException
  org.joda.time.chrono.TestGregorianChronology#testDurationFields NullPointerException
  org.joda.time.chrono.TestISOChronology#testDurationFields NullPointerException
  org.joda.time.chrono.TestIslamicChronology#testDurationFields NullPointerException
  org.joda.time.chrono.TestJulianChronology#testDurationFields NullPointerException
  org.joda.time.convert.TestReadablePeriodConverter#testGetPeriodType_Object NullPointerException
  org.joda.time.format.TestISODateTimeFormat_Fields#testForFields_weekBased_WD NullPointerException
  org.joda.time.format.TestISODateTimeFormat_Fields#testForFields_weekBased_YW NullPointerException
  org.joda.time.format.TestISODateTimeFormat_Fields#testForFields_weekBased_YWD NullPointerException

Tests run: 4157, Failures: 20, Errors: 178, Skipped: 0

[INFO] ------------------------------------------------------------------------
[INFO] BUILD FAILURE
[INFO] ------------------------------------------------------------------------
[INFO] Total time: 15.814s
[INFO] Finished at: Wed Aug 05 21:39:30 BST 2015
[INFO] Final Memory: 9M/213M
[INFO] ------------------------------------------------------------------------
[ERROR] Failed to execute goal org.apache.maven.plugins:maven-surefire-plugin:2.18.1:test (default-test) on project joda-time: There are test failures.
[ERROR] 
[ERROR] Please refer to /home/perham/Study/LittleDarwin/Cases/joda-time-2.8.1/target/surefire-reports for the individual test results.
[ERROR] -> [Help 1]
[ERROR] 
[ERROR] To see the full stack trace of the errors, re-run Maven with the -e switch.
[ERROR] Re-run Maven using the -X switch to enable full debug logging.
[ERROR] 
[ERROR] For more information about the errors and possible solutions, please read the following articles:
[ERROR] [Help 1] http://cwiki.apache.org/confluence/display/MAVEN/MojoFailureException
