[INFO] Scanning for projects...
[INFO]                                                                         
[INFO] ------------------------------------------------------------------------
[INFO] Building Joda-Time 2.8.1
[INFO] ------------------------------------------------------------------------
[INFO] 
[INFO] --- maven-resources-plugin:2.7:resources (default-resources) @ joda-time ---
[INFO] Using 'UTF-8' encoding to copy filtered resources.
[INFO] Copying 2 resources to META-INF
[INFO] Copying 10 resources
[INFO] 
[INFO] --- maven-compiler-plugin:3.3:compile (default-compile) @ joda-time ---
[INFO] Changes detected - recompiling the module!
[INFO] Compiling 166 source files to /home/perham/Study/LittleDarwin/Cases/joda-time-2.8.1/target/classes
[INFO] 
[INFO] --- exec-maven-plugin:1.4.0:java (compile-tzdb) @ joda-time ---
Writing zoneinfo files
Writing ZoneInfoMap
[INFO] 
[INFO] --- maven-resources-plugin:2.7:testResources (default-testResources) @ joda-time ---
[INFO] Using 'UTF-8' encoding to copy filtered resources.
[INFO] Copying 34 resources
[INFO] 
[INFO] --- maven-compiler-plugin:3.3:testCompile (default-testCompile) @ joda-time ---
[INFO] Nothing to compile - all classes are up to date
[INFO] 
[INFO] --- maven-surefire-plugin:2.18.1:test (default-test) @ joda-time ---
[INFO] Surefire report directory: /home/perham/Study/LittleDarwin/Cases/joda-time-2.8.1/target/surefire-reports

-------------------------------------------------------
 T E S T S
-------------------------------------------------------
Running org.joda.time.TestAllPackages

TestBuddhistChronology.testCalendar

TestCopticChronology.testCalendar

TestEthiopicChronology.testCalendar

TestIslamicChronology.testCalendar

Testing Gregorian chronology over 1000 iterations
100% complete (i=1000)

Testing Julian chronology over 1000 iterations
100% complete (i=1000)
Writing zoneinfo files
Writing ZoneInfoMap
Tests run: 4157, Failures: 14, Errors: 18, Skipped: 0, Time elapsed: 5.617 sec <<< FAILURE! - in org.joda.time.TestAllPackages
test_weekyears(org.joda.time.TestDurationFieldType)  Time elapsed: 0.007 sec  <<< ERROR!
java.lang.NullPointerException
	at org.joda.time.TestDurationFieldType.test_weekyears(TestDurationFieldType.java:91)

testPropertyGetWeekOfWeekyear(org.joda.time.TestDateTime_Properties)  Time elapsed: 0.002 sec  <<< FAILURE!
junit.framework.AssertionFailedError: expected:<null> but was:<UnsupportedDurationField[weekyears]>
	at junit.framework.Assert.fail(Assert.java:47)
	at junit.framework.Assert.failNotEquals(Assert.java:280)
	at junit.framework.Assert.assertEquals(Assert.java:64)
	at junit.framework.Assert.assertEquals(Assert.java:71)
	at org.joda.time.TestDateTime_Properties.testPropertyGetWeekOfWeekyear(TestDateTime_Properties.java:852)

testPropertyGetWeekyear(org.joda.time.TestDateTime_Properties)  Time elapsed: 0.001 sec  <<< FAILURE!
junit.framework.AssertionFailedError: expected:<null> but was:<DurationField[weekyears]>
	at junit.framework.Assert.fail(Assert.java:47)
	at junit.framework.Assert.failNotEquals(Assert.java:280)
	at junit.framework.Assert.assertEquals(Assert.java:64)
	at junit.framework.Assert.assertEquals(Assert.java:71)
	at org.joda.time.TestDateTime_Properties.testPropertyGetWeekyear(TestDateTime_Properties.java:200)

testAddWeekyears_int1(org.joda.time.TestMutableDateTime_Adds)  Time elapsed: 0 sec  <<< ERROR!
java.lang.NullPointerException
	at org.joda.time.MutableDateTime.addWeekyears(MutableDateTime.java:685)
	at org.joda.time.TestMutableDateTime_Adds.testAddWeekyears_int1(TestMutableDateTime_Adds.java:277)

testPropertyGetWeekOfWeekyear(org.joda.time.TestMutableDateTime_Properties)  Time elapsed: 0.001 sec  <<< FAILURE!
junit.framework.AssertionFailedError: expected:<null> but was:<UnsupportedDurationField[weekyears]>
	at junit.framework.Assert.fail(Assert.java:47)
	at junit.framework.Assert.failNotEquals(Assert.java:280)
	at junit.framework.Assert.assertEquals(Assert.java:64)
	at junit.framework.Assert.assertEquals(Assert.java:71)
	at org.joda.time.TestMutableDateTime_Properties.testPropertyGetWeekOfWeekyear(TestMutableDateTime_Properties.java:409)

testPropertyGetWeekyear(org.joda.time.TestMutableDateTime_Properties)  Time elapsed: 0 sec  <<< FAILURE!
junit.framework.AssertionFailedError: expected:<null> but was:<DurationField[weekyears]>
	at junit.framework.Assert.fail(Assert.java:47)
	at junit.framework.Assert.failNotEquals(Assert.java:280)
	at junit.framework.Assert.assertEquals(Assert.java:64)
	at junit.framework.Assert.assertEquals(Assert.java:71)
	at org.joda.time.TestMutableDateTime_Properties.testPropertyGetWeekyear(TestMutableDateTime_Properties.java:180)

testPropertyGetWeekOfWeekyear(org.joda.time.TestDateMidnight_Properties)  Time elapsed: 0 sec  <<< FAILURE!
junit.framework.AssertionFailedError: expected:<null> but was:<UnsupportedDurationField[weekyears]>
	at junit.framework.Assert.fail(Assert.java:47)
	at junit.framework.Assert.failNotEquals(Assert.java:280)
	at junit.framework.Assert.assertEquals(Assert.java:64)
	at junit.framework.Assert.assertEquals(Assert.java:71)
	at org.joda.time.TestDateMidnight_Properties.testPropertyGetWeekOfWeekyear(TestDateMidnight_Properties.java:444)

testPropertyGetWeekyear(org.joda.time.TestDateMidnight_Properties)  Time elapsed: 0.001 sec  <<< FAILURE!
junit.framework.AssertionFailedError: expected:<null> but was:<DurationField[weekyears]>
	at junit.framework.Assert.fail(Assert.java:47)
	at junit.framework.Assert.failNotEquals(Assert.java:280)
	at junit.framework.Assert.assertEquals(Assert.java:64)
	at junit.framework.Assert.assertEquals(Assert.java:71)
	at org.joda.time.TestDateMidnight_Properties.testPropertyGetWeekyear(TestDateMidnight_Properties.java:192)

testIsSupported_DurationFieldType(org.joda.time.TestLocalDateTime_Basics)  Time elapsed: 0.002 sec  <<< ERROR!
java.lang.NullPointerException
	at org.joda.time.LocalDateTime.isSupported(LocalDateTime.java:639)
	at org.joda.time.TestLocalDateTime_Basics.testIsSupported_DurationFieldType(TestLocalDateTime_Basics.java:269)

testIsSupported_DurationFieldType(org.joda.time.TestLocalDate_Basics)  Time elapsed: 0.001 sec  <<< ERROR!
java.lang.NullPointerException
	at org.joda.time.LocalDate.isSupported(LocalDate.java:596)
	at org.joda.time.TestLocalDate_Basics.testIsSupported_DurationFieldType(TestLocalDate_Basics.java:235)

testConstructorEx7_TypeArray_intArray_inOrder(org.joda.time.TestPartial_Constructors)  Time elapsed: 0.002 sec  <<< ERROR!
java.lang.NullPointerException
	at org.joda.time.Partial.<init>(Partial.java:230)
	at org.joda.time.Partial.<init>(Partial.java:177)
	at org.joda.time.TestPartial_Constructors.testConstructorEx7_TypeArray_intArray_inOrder(TestPartial_Constructors.java:341)

testConstructor_TypeArray_intArray_year_weekyear(org.joda.time.TestPartial_Constructors)  Time elapsed: 0.001 sec  <<< ERROR!
java.lang.NullPointerException
	at org.joda.time.Partial.<init>(Partial.java:221)
	at org.joda.time.Partial.<init>(Partial.java:177)
	at org.joda.time.TestPartial_Constructors.testConstructor_TypeArray_intArray_year_weekyear(TestPartial_Constructors.java:201)

testDurationFields(org.joda.time.chrono.TestBuddhistChronology)  Time elapsed: 0 sec  <<< ERROR!
java.lang.NullPointerException
	at org.joda.time.chrono.TestBuddhistChronology.testDurationFields(TestBuddhistChronology.java:150)

testDateFields(org.joda.time.chrono.TestBuddhistChronology)  Time elapsed: 0.001 sec  <<< FAILURE!
junit.framework.AssertionFailedError: expected:<null> but was:<DurationField[weekyears]>
	at junit.framework.Assert.fail(Assert.java:47)
	at junit.framework.Assert.failNotEquals(Assert.java:280)
	at junit.framework.Assert.assertEquals(Assert.java:64)
	at junit.framework.Assert.assertEquals(Assert.java:71)
	at org.joda.time.chrono.TestBuddhistChronology.testDateFields(TestBuddhistChronology.java:247)

testDurationFields(org.joda.time.chrono.TestCopticChronology)  Time elapsed: 0 sec  <<< ERROR!
java.lang.NullPointerException
	at org.joda.time.chrono.TestCopticChronology.testDurationFields(TestCopticChronology.java:153)

testDateFields(org.joda.time.chrono.TestCopticChronology)  Time elapsed: 0.001 sec  <<< FAILURE!
junit.framework.AssertionFailedError: expected:<null> but was:<DurationField[weekyears]>
	at junit.framework.Assert.fail(Assert.java:47)
	at junit.framework.Assert.failNotEquals(Assert.java:280)
	at junit.framework.Assert.assertEquals(Assert.java:64)
	at junit.framework.Assert.assertEquals(Assert.java:71)
	at org.joda.time.chrono.TestCopticChronology.testDateFields(TestCopticChronology.java:250)

testDurationFields(org.joda.time.chrono.TestEthiopicChronology)  Time elapsed: 0 sec  <<< ERROR!
java.lang.NullPointerException
	at org.joda.time.chrono.TestEthiopicChronology.testDurationFields(TestEthiopicChronology.java:153)

testDateFields(org.joda.time.chrono.TestEthiopicChronology)  Time elapsed: 0.001 sec  <<< FAILURE!
junit.framework.AssertionFailedError: expected:<null> but was:<DurationField[weekyears]>
	at junit.framework.Assert.fail(Assert.java:47)
	at junit.framework.Assert.failNotEquals(Assert.java:280)
	at junit.framework.Assert.assertEquals(Assert.java:64)
	at junit.framework.Assert.assertEquals(Assert.java:71)
	at org.joda.time.chrono.TestEthiopicChronology.testDateFields(TestEthiopicChronology.java:250)

testCutoverAddWeekyears(org.joda.time.chrono.TestGJChronology)  Time elapsed: 0.001 sec  <<< ERROR!
java.lang.UnsupportedOperationException: weekyears field is unsupported
	at org.joda.time.field.UnsupportedDurationField.unsupported(UnsupportedDurationField.java:276)
	at org.joda.time.field.UnsupportedDurationField.add(UnsupportedDurationField.java:182)
	at org.joda.time.DateTime.withFieldAdded(DateTime.java:882)
	at org.joda.time.chrono.TestGJChronology.testAdd(TestGJChronology.java:484)
	at org.joda.time.chrono.TestGJChronology.testCutoverAddWeekyears(TestGJChronology.java:401)

testDurationFields(org.joda.time.chrono.TestGJChronology)  Time elapsed: 0 sec  <<< ERROR!
java.lang.NullPointerException
	at org.joda.time.chrono.TestGJChronology.testDurationFields(TestGJChronology.java:204)

testDateFields(org.joda.time.chrono.TestGJChronology)  Time elapsed: 0.001 sec  <<< FAILURE!
junit.framework.AssertionFailedError: expected:<null> but was:<DurationField[weekyears]>
	at junit.framework.Assert.fail(Assert.java:47)
	at junit.framework.Assert.failNotEquals(Assert.java:280)
	at junit.framework.Assert.assertEquals(Assert.java:64)
	at junit.framework.Assert.assertEquals(Assert.java:71)
	at org.joda.time.chrono.TestGJChronology.testDateFields(TestGJChronology.java:301)

testDurationFields(org.joda.time.chrono.TestGregorianChronology)  Time elapsed: 0.001 sec  <<< ERROR!
java.lang.NullPointerException
	at org.joda.time.chrono.TestGregorianChronology.testDurationFields(TestGregorianChronology.java:160)

testDateFields(org.joda.time.chrono.TestGregorianChronology)  Time elapsed: 0 sec  <<< FAILURE!
junit.framework.AssertionFailedError: expected:<null> but was:<DurationField[weekyears]>
	at junit.framework.Assert.fail(Assert.java:47)
	at junit.framework.Assert.failNotEquals(Assert.java:280)
	at junit.framework.Assert.assertEquals(Assert.java:64)
	at junit.framework.Assert.assertEquals(Assert.java:71)
	at org.joda.time.chrono.TestGregorianChronology.testDateFields(TestGregorianChronology.java:257)

testDurationFields(org.joda.time.chrono.TestIslamicChronology)  Time elapsed: 0.001 sec  <<< ERROR!
java.lang.NullPointerException
	at org.joda.time.chrono.TestIslamicChronology.testDurationFields(TestIslamicChronology.java:150)

testDateFields(org.joda.time.chrono.TestIslamicChronology)  Time elapsed: 0 sec  <<< FAILURE!
junit.framework.AssertionFailedError: expected:<null> but was:<DurationField[weekyears]>
	at junit.framework.Assert.fail(Assert.java:47)
	at junit.framework.Assert.failNotEquals(Assert.java:280)
	at junit.framework.Assert.assertEquals(Assert.java:64)
	at junit.framework.Assert.assertEquals(Assert.java:71)
	at org.joda.time.chrono.TestIslamicChronology.testDateFields(TestIslamicChronology.java:247)

testDurationFields(org.joda.time.chrono.TestJulianChronology)  Time elapsed: 0.001 sec  <<< ERROR!
java.lang.NullPointerException
	at org.joda.time.chrono.TestJulianChronology.testDurationFields(TestJulianChronology.java:157)

testDateFields(org.joda.time.chrono.TestJulianChronology)  Time elapsed: 0 sec  <<< FAILURE!
junit.framework.AssertionFailedError: expected:<null> but was:<DurationField[weekyears]>
	at junit.framework.Assert.fail(Assert.java:47)
	at junit.framework.Assert.failNotEquals(Assert.java:280)
	at junit.framework.Assert.assertEquals(Assert.java:64)
	at junit.framework.Assert.assertEquals(Assert.java:71)
	at org.joda.time.chrono.TestJulianChronology.testDateFields(TestJulianChronology.java:254)

testDurationFields(org.joda.time.chrono.TestISOChronology)  Time elapsed: 0.001 sec  <<< ERROR!
java.lang.NullPointerException
	at org.joda.time.chrono.TestISOChronology.testDurationFields(TestISOChronology.java:150)

testDateFields(org.joda.time.chrono.TestISOChronology)  Time elapsed: 0.001 sec  <<< FAILURE!
junit.framework.AssertionFailedError: expected:<null> but was:<DurationField[weekyears]>
	at junit.framework.Assert.fail(Assert.java:47)
	at junit.framework.Assert.failNotEquals(Assert.java:280)
	at junit.framework.Assert.assertEquals(Assert.java:64)
	at junit.framework.Assert.assertEquals(Assert.java:71)
	at org.joda.time.chrono.TestISOChronology.testDateFields(TestISOChronology.java:262)

testForFields_weekBased_YWD(org.joda.time.format.TestISODateTimeFormat_Fields)  Time elapsed: 0 sec  <<< ERROR!
java.lang.NullPointerException
	at org.joda.time.Partial.<init>(Partial.java:230)
	at org.joda.time.Partial.<init>(Partial.java:177)
	at org.joda.time.format.TestISODateTimeFormat_Fields.testForFields_weekBased_YWD(TestISODateTimeFormat_Fields.java:325)

testForFields_weekBased_YW(org.joda.time.format.TestISODateTimeFormat_Fields)  Time elapsed: 0.001 sec  <<< ERROR!
java.lang.NullPointerException
	at org.joda.time.Partial.<init>(Partial.java:230)
	at org.joda.time.Partial.<init>(Partial.java:177)
	at org.joda.time.format.TestISODateTimeFormat_Fields.testForFields_weekBased_YW(TestISODateTimeFormat_Fields.java:434)

testForFields_weekBased_YD(org.joda.time.format.TestISODateTimeFormat_Fields)  Time elapsed: 0.001 sec  <<< ERROR!
java.lang.NullPointerException
	at org.joda.time.Partial.<init>(Partial.java:230)
	at org.joda.time.Partial.<init>(Partial.java:177)
	at org.joda.time.format.TestISODateTimeFormat_Fields.testForFields_weekBased_YD(TestISODateTimeFormat_Fields.java:490)


Results :

Failed tests: 
  org.joda.time.TestDateMidnight_Properties#testPropertyGetWeekOfWeekyear AssertionFailedError
  org.joda.time.TestDateMidnight_Properties#testPropertyGetWeekyear AssertionFailedError
  org.joda.time.TestDateTime_Properties#testPropertyGetWeekOfWeekyear AssertionFailedError
  org.joda.time.TestDateTime_Properties#testPropertyGetWeekyear AssertionFailedError
  org.joda.time.TestMutableDateTime_Properties#testPropertyGetWeekOfWeekyear AssertionFailedError
  org.joda.time.TestMutableDateTime_Properties#testPropertyGetWeekyear AssertionFailedError
  org.joda.time.chrono.TestBuddhistChronology#testDateFields AssertionFailedError
  org.joda.time.chrono.TestCopticChronology#testDateFields AssertionFailedError ...
  org.joda.time.chrono.TestEthiopicChronology#testDateFields AssertionFailedError
  org.joda.time.chrono.TestGJChronology#testDateFields AssertionFailedError expe...
  org.joda.time.chrono.TestGregorianChronology#testDateFields AssertionFailedError
  org.joda.time.chrono.TestISOChronology#testDateFields AssertionFailedError exp...
  org.joda.time.chrono.TestIslamicChronology#testDateFields AssertionFailedError
  org.joda.time.chrono.TestJulianChronology#testDateFields AssertionFailedError ...
Tests in error: 
  org.joda.time.TestDurationFieldType#test_weekyears NullPointerException
  org.joda.time.TestLocalDateTime_Basics#testIsSupported_DurationFieldType NullPointerException
  org.joda.time.TestLocalDate_Basics#testIsSupported_DurationFieldType NullPointerException
  org.joda.time.TestMutableDateTime_Adds#testAddWeekyears_int1 NullPointerException
  org.joda.time.TestPartial_Constructors#testConstructorEx7_TypeArray_intArray_inOrder NullPointerException
  org.joda.time.TestPartial_Constructors#testConstructor_TypeArray_intArray_year_weekyear NullPointerException
  org.joda.time.chrono.TestBuddhistChronology#testDurationFields NullPointerException
  org.joda.time.chrono.TestCopticChronology#testDurationFields NullPointerException
  org.joda.time.chrono.TestEthiopicChronology#testDurationFields NullPointerException
  org.joda.time.chrono.TestGJChronology#testCutoverAddWeekyears UnsupportedOperationException
  org.joda.time.chrono.TestGJChronology#testDurationFields NullPointerException
  org.joda.time.chrono.TestGregorianChronology#testDurationFields NullPointerException
  org.joda.time.chrono.TestISOChronology#testDurationFields NullPointerException
  org.joda.time.chrono.TestIslamicChronology#testDurationFields NullPointerException
  org.joda.time.chrono.TestJulianChronology#testDurationFields NullPointerException
  org.joda.time.format.TestISODateTimeFormat_Fields#testForFields_weekBased_YD NullPointerException
  org.joda.time.format.TestISODateTimeFormat_Fields#testForFields_weekBased_YW NullPointerException
  org.joda.time.format.TestISODateTimeFormat_Fields#testForFields_weekBased_YWD NullPointerException

Tests run: 4157, Failures: 14, Errors: 18, Skipped: 0

[INFO] ------------------------------------------------------------------------
[INFO] BUILD FAILURE
[INFO] ------------------------------------------------------------------------
[INFO] Total time: 17.579s
[INFO] Finished at: Wed Aug 05 21:39:12 BST 2015
[INFO] Final Memory: 8M/209M
[INFO] ------------------------------------------------------------------------
[ERROR] Failed to execute goal org.apache.maven.plugins:maven-surefire-plugin:2.18.1:test (default-test) on project joda-time: There are test failures.
[ERROR] 
[ERROR] Please refer to /home/perham/Study/LittleDarwin/Cases/joda-time-2.8.1/target/surefire-reports for the individual test results.
[ERROR] -> [Help 1]
[ERROR] 
[ERROR] To see the full stack trace of the errors, re-run Maven with the -e switch.
[ERROR] Re-run Maven using the -X switch to enable full debug logging.
[ERROR] 
[ERROR] For more information about the errors and possible solutions, please read the following articles:
[ERROR] [Help 1] http://cwiki.apache.org/confluence/display/MAVEN/MojoFailureException
