[INFO] Scanning for projects...
[INFO]                                                                         
[INFO] ------------------------------------------------------------------------
[INFO] Building Joda-Time 2.8.1
[INFO] ------------------------------------------------------------------------
[INFO] 
[INFO] --- maven-resources-plugin:2.7:resources (default-resources) @ joda-time ---
[INFO] Using 'UTF-8' encoding to copy filtered resources.
[INFO] Copying 2 resources to META-INF
[INFO] Copying 10 resources
[INFO] 
[INFO] --- maven-compiler-plugin:3.3:compile (default-compile) @ joda-time ---
[INFO] Changes detected - recompiling the module!
[INFO] Compiling 166 source files to /home/perham/Study/LittleDarwin/Cases/joda-time-2.8.1/target/classes
[INFO] 
[INFO] --- exec-maven-plugin:1.4.0:java (compile-tzdb) @ joda-time ---
Writing zoneinfo files
Writing ZoneInfoMap
[INFO] 
[INFO] --- maven-resources-plugin:2.7:testResources (default-testResources) @ joda-time ---
[INFO] Using 'UTF-8' encoding to copy filtered resources.
[INFO] Copying 34 resources
[INFO] 
[INFO] --- maven-compiler-plugin:3.3:testCompile (default-testCompile) @ joda-time ---
[INFO] Nothing to compile - all classes are up to date
[INFO] 
[INFO] --- maven-surefire-plugin:2.18.1:test (default-test) @ joda-time ---
[INFO] Surefire report directory: /home/perham/Study/LittleDarwin/Cases/joda-time-2.8.1/target/surefire-reports

-------------------------------------------------------
 T E S T S
-------------------------------------------------------
Running org.joda.time.TestAllPackages

TestBuddhistChronology.testCalendar

TestCopticChronology.testCalendar

TestEthiopicChronology.testCalendar

TestIslamicChronology.testCalendar

Testing Gregorian chronology over 1000 iterations
100% complete (i=1000)

Testing Julian chronology over 1000 iterations
100% complete (i=1000)
Writing zoneinfo files
Writing ZoneInfoMap
Tests run: 4157, Failures: 0, Errors: 29, Skipped: 0, Time elapsed: 5.24 sec <<< FAILURE! - in org.joda.time.TestAllPackages
testToStandardDays(org.joda.time.TestDuration_Basics)  Time elapsed: 0.011 sec  <<< ERROR!
java.lang.IndexOutOfBoundsException: 0
	at org.joda.time.base.BaseSingleFieldPeriod.getValue(BaseSingleFieldPeriod.java:57)
	at org.joda.time.base.BaseSingleFieldPeriod.equals(BaseSingleFieldPeriod.java:69)
	at junit.framework.Assert.assertEquals(Assert.java:62)
	at junit.framework.Assert.assertEquals(Assert.java:71)
	at org.joda.time.TestDuration_Basics.testToStandardDays(TestDuration_Basics.java:330)

testToStandardHours(org.joda.time.TestDuration_Basics)  Time elapsed: 0 sec  <<< ERROR!
java.lang.IndexOutOfBoundsException: 0
	at org.joda.time.base.BaseSingleFieldPeriod.getValue(BaseSingleFieldPeriod.java:57)
	at org.joda.time.base.BaseSingleFieldPeriod.equals(BaseSingleFieldPeriod.java:69)
	at junit.framework.Assert.assertEquals(Assert.java:62)
	at junit.framework.Assert.assertEquals(Assert.java:71)
	at org.joda.time.TestDuration_Basics.testToStandardHours(TestDuration_Basics.java:364)

testToStandardMinutes(org.joda.time.TestDuration_Basics)  Time elapsed: 0.001 sec  <<< ERROR!
java.lang.IndexOutOfBoundsException: 0
	at org.joda.time.base.BaseSingleFieldPeriod.getValue(BaseSingleFieldPeriod.java:57)
	at org.joda.time.base.BaseSingleFieldPeriod.equals(BaseSingleFieldPeriod.java:69)
	at junit.framework.Assert.assertEquals(Assert.java:62)
	at junit.framework.Assert.assertEquals(Assert.java:71)
	at org.joda.time.TestDuration_Basics.testToStandardMinutes(TestDuration_Basics.java:398)

testToStandardSeconds(org.joda.time.TestDuration_Basics)  Time elapsed: 0.001 sec  <<< ERROR!
java.lang.IndexOutOfBoundsException: 0
	at org.joda.time.base.BaseSingleFieldPeriod.getValue(BaseSingleFieldPeriod.java:57)
	at org.joda.time.base.BaseSingleFieldPeriod.equals(BaseSingleFieldPeriod.java:69)
	at junit.framework.Assert.assertEquals(Assert.java:62)
	at junit.framework.Assert.assertEquals(Assert.java:71)
	at org.joda.time.TestDuration_Basics.testToStandardSeconds(TestDuration_Basics.java:432)

testEqualsHashCode(org.joda.time.TestBaseSingleFieldPeriod)  Time elapsed: 0.001 sec  <<< ERROR!
java.lang.IndexOutOfBoundsException: 0
	at org.joda.time.base.BaseSingleFieldPeriod.getValue(BaseSingleFieldPeriod.java:57)
	at org.joda.time.base.BaseSingleFieldPeriod.equals(BaseSingleFieldPeriod.java:69)
	at org.joda.time.TestBaseSingleFieldPeriod.testEqualsHashCode(TestBaseSingleFieldPeriod.java:207)

testToMutablePeriod(org.joda.time.TestBaseSingleFieldPeriod)  Time elapsed: 0.001 sec  <<< ERROR!
java.lang.IndexOutOfBoundsException: 0
	at org.joda.time.base.BaseSingleFieldPeriod.getValue(BaseSingleFieldPeriod.java:57)
	at org.joda.time.base.BasePeriod.addPeriodInto(BasePeriod.java:580)
	at org.joda.time.base.BasePeriod.addPeriod(BasePeriod.java:565)
	at org.joda.time.MutablePeriod.add(MutablePeriod.java:637)
	at org.joda.time.base.BaseSingleFieldPeriod.toMutablePeriod(BaseSingleFieldPeriod.java:64)
	at org.joda.time.TestBaseSingleFieldPeriod.testToMutablePeriod(TestBaseSingleFieldPeriod.java:275)

testToPeriod(org.joda.time.TestBaseSingleFieldPeriod)  Time elapsed: 0 sec  <<< ERROR!
java.lang.IndexOutOfBoundsException: 0
	at org.joda.time.base.BaseSingleFieldPeriod.getValue(BaseSingleFieldPeriod.java:57)
	at org.joda.time.base.BasePeriod.mergePeriodInto(BasePeriod.java:551)
	at org.joda.time.Period.withFields(Period.java:858)
	at org.joda.time.base.BaseSingleFieldPeriod.toPeriod(BaseSingleFieldPeriod.java:62)
	at org.joda.time.TestBaseSingleFieldPeriod.testToPeriod(TestBaseSingleFieldPeriod.java:269)

testValueIndexMethods(org.joda.time.TestBaseSingleFieldPeriod)  Time elapsed: 0 sec  <<< ERROR!
java.lang.IndexOutOfBoundsException: 0
	at org.joda.time.base.BaseSingleFieldPeriod.getValue(BaseSingleFieldPeriod.java:57)
	at org.joda.time.TestBaseSingleFieldPeriod.testValueIndexMethods(TestBaseSingleFieldPeriod.java:158)

testAddToLocalDate(org.joda.time.TestYears)  Time elapsed: 0.001 sec  <<< ERROR!
java.lang.IndexOutOfBoundsException: 0
	at org.joda.time.base.BaseSingleFieldPeriod.getValue(BaseSingleFieldPeriod.java:57)
	at org.joda.time.LocalDate.withPeriodAdded(LocalDate.java:1166)
	at org.joda.time.LocalDate.plus(LocalDate.java:1193)
	at org.joda.time.TestYears.testAddToLocalDate(TestYears.java:318)

testAddToLocalDate(org.joda.time.TestMonths)  Time elapsed: 0.001 sec  <<< ERROR!
java.lang.IndexOutOfBoundsException: 0
	at org.joda.time.base.BaseSingleFieldPeriod.getValue(BaseSingleFieldPeriod.java:57)
	at org.joda.time.LocalDate.withPeriodAdded(LocalDate.java:1166)
	at org.joda.time.LocalDate.plus(LocalDate.java:1193)
	at org.joda.time.TestMonths.testAddToLocalDate(TestMonths.java:363)

testToStandardDays(org.joda.time.TestWeeks)  Time elapsed: 0 sec  <<< ERROR!
java.lang.IndexOutOfBoundsException: 0
	at org.joda.time.base.BaseSingleFieldPeriod.getValue(BaseSingleFieldPeriod.java:57)
	at org.joda.time.base.BaseSingleFieldPeriod.equals(BaseSingleFieldPeriod.java:69)
	at junit.framework.Assert.assertEquals(Assert.java:62)
	at junit.framework.Assert.assertEquals(Assert.java:71)
	at org.joda.time.TestWeeks.testToStandardDays(TestWeeks.java:216)

testToStandardHours(org.joda.time.TestWeeks)  Time elapsed: 0.001 sec  <<< ERROR!
java.lang.IndexOutOfBoundsException: 0
	at org.joda.time.base.BaseSingleFieldPeriod.getValue(BaseSingleFieldPeriod.java:57)
	at org.joda.time.base.BaseSingleFieldPeriod.equals(BaseSingleFieldPeriod.java:69)
	at junit.framework.Assert.assertEquals(Assert.java:62)
	at junit.framework.Assert.assertEquals(Assert.java:71)
	at org.joda.time.TestWeeks.testToStandardHours(TestWeeks.java:229)

testToStandardMinutes(org.joda.time.TestWeeks)  Time elapsed: 0 sec  <<< ERROR!
java.lang.IndexOutOfBoundsException: 0
	at org.joda.time.base.BaseSingleFieldPeriod.getValue(BaseSingleFieldPeriod.java:57)
	at org.joda.time.base.BaseSingleFieldPeriod.equals(BaseSingleFieldPeriod.java:69)
	at junit.framework.Assert.assertEquals(Assert.java:62)
	at junit.framework.Assert.assertEquals(Assert.java:71)
	at org.joda.time.TestWeeks.testToStandardMinutes(TestWeeks.java:242)

testToStandardSeconds(org.joda.time.TestWeeks)  Time elapsed: 0.001 sec  <<< ERROR!
java.lang.IndexOutOfBoundsException: 0
	at org.joda.time.base.BaseSingleFieldPeriod.getValue(BaseSingleFieldPeriod.java:57)
	at org.joda.time.base.BaseSingleFieldPeriod.equals(BaseSingleFieldPeriod.java:69)
	at junit.framework.Assert.assertEquals(Assert.java:62)
	at junit.framework.Assert.assertEquals(Assert.java:71)
	at org.joda.time.TestWeeks.testToStandardSeconds(TestWeeks.java:255)

testAddToLocalDate(org.joda.time.TestWeeks)  Time elapsed: 0 sec  <<< ERROR!
java.lang.IndexOutOfBoundsException: 0
	at org.joda.time.base.BaseSingleFieldPeriod.getValue(BaseSingleFieldPeriod.java:57)
	at org.joda.time.LocalDate.withPeriodAdded(LocalDate.java:1166)
	at org.joda.time.LocalDate.plus(LocalDate.java:1193)
	at org.joda.time.TestWeeks.testAddToLocalDate(TestWeeks.java:397)

testToStandardHours(org.joda.time.TestDays)  Time elapsed: 0.001 sec  <<< ERROR!
java.lang.IndexOutOfBoundsException: 0
	at org.joda.time.base.BaseSingleFieldPeriod.getValue(BaseSingleFieldPeriod.java:57)
	at org.joda.time.base.BaseSingleFieldPeriod.equals(BaseSingleFieldPeriod.java:69)
	at junit.framework.Assert.assertEquals(Assert.java:62)
	at junit.framework.Assert.assertEquals(Assert.java:71)
	at org.joda.time.TestDays.testToStandardHours(TestDays.java:264)

testToStandardMinutes(org.joda.time.TestDays)  Time elapsed: 0 sec  <<< ERROR!
java.lang.IndexOutOfBoundsException: 0
	at org.joda.time.base.BaseSingleFieldPeriod.getValue(BaseSingleFieldPeriod.java:57)
	at org.joda.time.base.BaseSingleFieldPeriod.equals(BaseSingleFieldPeriod.java:69)
	at junit.framework.Assert.assertEquals(Assert.java:62)
	at junit.framework.Assert.assertEquals(Assert.java:71)
	at org.joda.time.TestDays.testToStandardMinutes(TestDays.java:277)

testToStandardSeconds(org.joda.time.TestDays)  Time elapsed: 0.001 sec  <<< ERROR!
java.lang.IndexOutOfBoundsException: 0
	at org.joda.time.base.BaseSingleFieldPeriod.getValue(BaseSingleFieldPeriod.java:57)
	at org.joda.time.base.BaseSingleFieldPeriod.equals(BaseSingleFieldPeriod.java:69)
	at junit.framework.Assert.assertEquals(Assert.java:62)
	at junit.framework.Assert.assertEquals(Assert.java:71)
	at org.joda.time.TestDays.testToStandardSeconds(TestDays.java:290)

testAddToLocalDate(org.joda.time.TestDays)  Time elapsed: 0 sec  <<< ERROR!
java.lang.IndexOutOfBoundsException: 0
	at org.joda.time.base.BaseSingleFieldPeriod.getValue(BaseSingleFieldPeriod.java:57)
	at org.joda.time.LocalDate.withPeriodAdded(LocalDate.java:1166)
	at org.joda.time.LocalDate.plus(LocalDate.java:1193)
	at org.joda.time.TestDays.testAddToLocalDate(TestDays.java:432)

testToStandardMinutes(org.joda.time.TestHours)  Time elapsed: 0 sec  <<< ERROR!
java.lang.IndexOutOfBoundsException: 0
	at org.joda.time.base.BaseSingleFieldPeriod.getValue(BaseSingleFieldPeriod.java:57)
	at org.joda.time.base.BaseSingleFieldPeriod.equals(BaseSingleFieldPeriod.java:69)
	at junit.framework.Assert.assertEquals(Assert.java:62)
	at junit.framework.Assert.assertEquals(Assert.java:71)
	at org.joda.time.TestHours.testToStandardMinutes(TestHours.java:239)

testToStandardSeconds(org.joda.time.TestHours)  Time elapsed: 0.001 sec  <<< ERROR!
java.lang.IndexOutOfBoundsException: 0
	at org.joda.time.base.BaseSingleFieldPeriod.getValue(BaseSingleFieldPeriod.java:57)
	at org.joda.time.base.BaseSingleFieldPeriod.equals(BaseSingleFieldPeriod.java:69)
	at junit.framework.Assert.assertEquals(Assert.java:62)
	at junit.framework.Assert.assertEquals(Assert.java:71)
	at org.joda.time.TestHours.testToStandardSeconds(TestHours.java:252)

testAddToLocalDate(org.joda.time.TestHours)  Time elapsed: 0.001 sec  <<< ERROR!
java.lang.IndexOutOfBoundsException: 0
	at org.joda.time.base.BaseSingleFieldPeriod.getValue(BaseSingleFieldPeriod.java:57)
	at org.joda.time.chrono.BaseChronology.add(BaseChronology.java:305)
	at org.joda.time.LocalDateTime.withPeriodAdded(LocalDateTime.java:1062)
	at org.joda.time.LocalDateTime.plus(LocalDateTime.java:1094)
	at org.joda.time.TestHours.testAddToLocalDate(TestHours.java:394)

testToStandardSeconds(org.joda.time.TestMinutes)  Time elapsed: 0 sec  <<< ERROR!
java.lang.IndexOutOfBoundsException: 0
	at org.joda.time.base.BaseSingleFieldPeriod.getValue(BaseSingleFieldPeriod.java:57)
	at org.joda.time.base.BaseSingleFieldPeriod.equals(BaseSingleFieldPeriod.java:69)
	at junit.framework.Assert.assertEquals(Assert.java:62)
	at junit.framework.Assert.assertEquals(Assert.java:71)
	at org.joda.time.TestMinutes.testToStandardSeconds(TestMinutes.java:235)

testAddToLocalDate(org.joda.time.TestMinutes)  Time elapsed: 0 sec  <<< ERROR!
java.lang.IndexOutOfBoundsException: 0
	at org.joda.time.base.BaseSingleFieldPeriod.getValue(BaseSingleFieldPeriod.java:57)
	at org.joda.time.chrono.BaseChronology.add(BaseChronology.java:305)
	at org.joda.time.LocalDateTime.withPeriodAdded(LocalDateTime.java:1062)
	at org.joda.time.LocalDateTime.plus(LocalDateTime.java:1094)
	at org.joda.time.TestMinutes.testAddToLocalDate(TestMinutes.java:377)

testAddToLocalDate(org.joda.time.TestSeconds)  Time elapsed: 0.001 sec  <<< ERROR!
java.lang.IndexOutOfBoundsException: 0
	at org.joda.time.base.BaseSingleFieldPeriod.getValue(BaseSingleFieldPeriod.java:57)
	at org.joda.time.chrono.BaseChronology.add(BaseChronology.java:305)
	at org.joda.time.LocalDateTime.withPeriodAdded(LocalDateTime.java:1062)
	at org.joda.time.LocalDateTime.plus(LocalDateTime.java:1094)
	at org.joda.time.TestSeconds.testAddToLocalDate(TestSeconds.java:367)

testYears(org.joda.time.TestStringConvert)  Time elapsed: 0.001 sec  <<< ERROR!
java.lang.IndexOutOfBoundsException: 0
	at org.joda.time.base.BaseSingleFieldPeriod.getValue(BaseSingleFieldPeriod.java:57)
	at org.joda.time.base.BaseSingleFieldPeriod.equals(BaseSingleFieldPeriod.java:69)
	at junit.framework.Assert.assertEquals(Assert.java:62)
	at junit.framework.Assert.assertEquals(Assert.java:71)
	at org.joda.time.TestStringConvert.testYears(TestStringConvert.java:158)

testWeeks(org.joda.time.TestStringConvert)  Time elapsed: 0.001 sec  <<< ERROR!
java.lang.IndexOutOfBoundsException: 0
	at org.joda.time.base.BaseSingleFieldPeriod.getValue(BaseSingleFieldPeriod.java:57)
	at org.joda.time.base.BaseSingleFieldPeriod.equals(BaseSingleFieldPeriod.java:69)
	at junit.framework.Assert.assertEquals(Assert.java:62)
	at junit.framework.Assert.assertEquals(Assert.java:71)
	at org.joda.time.TestStringConvert.testWeeks(TestStringConvert.java:172)

testMinutes(org.joda.time.TestStringConvert)  Time elapsed: 0.001 sec  <<< ERROR!
java.lang.IndexOutOfBoundsException: 0
	at org.joda.time.base.BaseSingleFieldPeriod.getValue(BaseSingleFieldPeriod.java:57)
	at org.joda.time.base.BaseSingleFieldPeriod.equals(BaseSingleFieldPeriod.java:69)
	at junit.framework.Assert.assertEquals(Assert.java:62)
	at junit.framework.Assert.assertEquals(Assert.java:71)
	at org.joda.time.TestStringConvert.testMinutes(TestStringConvert.java:193)

testSeconds(org.joda.time.TestStringConvert)  Time elapsed: 0.001 sec  <<< ERROR!
java.lang.IndexOutOfBoundsException: 0
	at org.joda.time.base.BaseSingleFieldPeriod.getValue(BaseSingleFieldPeriod.java:57)
	at org.joda.time.base.BaseSingleFieldPeriod.equals(BaseSingleFieldPeriod.java:69)
	at junit.framework.Assert.assertEquals(Assert.java:62)
	at junit.framework.Assert.assertEquals(Assert.java:71)
	at org.joda.time.TestStringConvert.testSeconds(TestStringConvert.java:200)


Results :

Tests in error: 
  org.joda.time.TestBaseSingleFieldPeriod#testEqualsHashCode IndexOutOfBoundsException
  org.joda.time.TestBaseSingleFieldPeriod#testToMutablePeriod IndexOutOfBoundsException
  org.joda.time.TestBaseSingleFieldPeriod#testToPeriod IndexOutOfBoundsException
  org.joda.time.TestBaseSingleFieldPeriod#testValueIndexMethods IndexOutOfBoundsException
  org.joda.time.TestDays#testAddToLocalDate IndexOutOfBoundsException 0
  org.joda.time.TestDays#testToStandardHours IndexOutOfBoundsException 0
  org.joda.time.TestDays#testToStandardMinutes IndexOutOfBoundsException 0
  org.joda.time.TestDays#testToStandardSeconds IndexOutOfBoundsException 0
  org.joda.time.TestDuration_Basics#testToStandardDays IndexOutOfBoundsException
  org.joda.time.TestDuration_Basics#testToStandardHours IndexOutOfBoundsException
  org.joda.time.TestDuration_Basics#testToStandardMinutes IndexOutOfBoundsException
  org.joda.time.TestDuration_Basics#testToStandardSeconds IndexOutOfBoundsException
  org.joda.time.TestHours#testAddToLocalDate IndexOutOfBoundsException 0
  org.joda.time.TestHours#testToStandardMinutes IndexOutOfBoundsException 0
  org.joda.time.TestHours#testToStandardSeconds IndexOutOfBoundsException 0
  org.joda.time.TestMinutes#testAddToLocalDate IndexOutOfBoundsException 0
  org.joda.time.TestMinutes#testToStandardSeconds IndexOutOfBoundsException 0
  org.joda.time.TestMonths#testAddToLocalDate IndexOutOfBoundsException 0
  org.joda.time.TestSeconds#testAddToLocalDate IndexOutOfBoundsException 0
  org.joda.time.TestStringConvert#testMinutes IndexOutOfBoundsException 0
  org.joda.time.TestStringConvert#testSeconds IndexOutOfBoundsException 0
  org.joda.time.TestStringConvert#testWeeks IndexOutOfBoundsException 0
  org.joda.time.TestStringConvert#testYears IndexOutOfBoundsException 0
  org.joda.time.TestWeeks#testAddToLocalDate IndexOutOfBoundsException 0
  org.joda.time.TestWeeks#testToStandardDays IndexOutOfBoundsException 0
  org.joda.time.TestWeeks#testToStandardHours IndexOutOfBoundsException 0
  org.joda.time.TestWeeks#testToStandardMinutes IndexOutOfBoundsException 0
  org.joda.time.TestWeeks#testToStandardSeconds IndexOutOfBoundsException 0
  org.joda.time.TestYears#testAddToLocalDate IndexOutOfBoundsException 0

Tests run: 4157, Failures: 0, Errors: 29, Skipped: 0

[INFO] ------------------------------------------------------------------------
[INFO] BUILD FAILURE
[INFO] ------------------------------------------------------------------------
[INFO] Total time: 15.241s
[INFO] Finished at: Wed Aug 05 21:24:14 BST 2015
[INFO] Final Memory: 9M/213M
[INFO] ------------------------------------------------------------------------
[ERROR] Failed to execute goal org.apache.maven.plugins:maven-surefire-plugin:2.18.1:test (default-test) on project joda-time: There are test failures.
[ERROR] 
[ERROR] Please refer to /home/perham/Study/LittleDarwin/Cases/joda-time-2.8.1/target/surefire-reports for the individual test results.
[ERROR] -> [Help 1]
[ERROR] 
[ERROR] To see the full stack trace of the errors, re-run Maven with the -e switch.
[ERROR] Re-run Maven using the -X switch to enable full debug logging.
[ERROR] 
[ERROR] For more information about the errors and possible solutions, please read the following articles:
[ERROR] [Help 1] http://cwiki.apache.org/confluence/display/MAVEN/MojoFailureException
