[INFO] Scanning for projects...
[INFO]                                                                         
[INFO] ------------------------------------------------------------------------
[INFO] Building Joda-Time 2.8.1
[INFO] ------------------------------------------------------------------------
[INFO] 
[INFO] --- maven-resources-plugin:2.7:resources (default-resources) @ joda-time ---
[INFO] Using 'UTF-8' encoding to copy filtered resources.
[INFO] Copying 2 resources to META-INF
[INFO] Copying 10 resources
[INFO] 
[INFO] --- maven-compiler-plugin:3.3:compile (default-compile) @ joda-time ---
[INFO] Changes detected - recompiling the module!
[INFO] Compiling 166 source files to /home/perham/Study/LittleDarwin/Cases/joda-time-2.8.1/target/classes
[INFO] 
[INFO] --- exec-maven-plugin:1.4.0:java (compile-tzdb) @ joda-time ---
Writing zoneinfo files
Writing ZoneInfoMap
[INFO] 
[INFO] --- maven-resources-plugin:2.7:testResources (default-testResources) @ joda-time ---
[INFO] Using 'UTF-8' encoding to copy filtered resources.
[INFO] Copying 34 resources
[INFO] 
[INFO] --- maven-compiler-plugin:3.3:testCompile (default-testCompile) @ joda-time ---
[INFO] Nothing to compile - all classes are up to date
[INFO] 
[INFO] --- maven-surefire-plugin:2.18.1:test (default-test) @ joda-time ---
[INFO] Surefire report directory: /home/perham/Study/LittleDarwin/Cases/joda-time-2.8.1/target/surefire-reports

-------------------------------------------------------
 T E S T S
-------------------------------------------------------
Running org.joda.time.TestAllPackages

TestBuddhistChronology.testCalendar

TestCopticChronology.testCalendar

TestEthiopicChronology.testCalendar

TestIslamicChronology.testCalendar

Testing Gregorian chronology over 1000 iterations
100% complete (i=1000)

Testing Julian chronology over 1000 iterations
100% complete (i=1000)
Writing zoneinfo files
Writing ZoneInfoMap
Tests run: 4157, Failures: 0, Errors: 8, Skipped: 0, Time elapsed: 5.257 sec <<< FAILURE! - in org.joda.time.TestAllPackages
testConstructor_RP_RP1(org.joda.time.TestPeriod_Constructors)  Time elapsed: 0.004 sec  <<< ERROR!
java.lang.ClassCastException: org.joda.time.YearMonthDay cannot be cast to org.joda.time.base.BaseLocal
	at org.joda.time.base.BasePeriod.<init>(BasePeriod.java:52)
	at org.joda.time.Period.<init>(Period.java:582)
	at org.joda.time.TestPeriod_Constructors.testConstructor_RP_RP1(TestPeriod_Constructors.java:805)

testConstructor_RP_RP2(org.joda.time.TestPeriod_Constructors)  Time elapsed: 0 sec  <<< ERROR!
java.lang.ClassCastException: org.joda.time.YearMonthDay cannot be cast to org.joda.time.base.BaseLocal
	at org.joda.time.base.BasePeriod.<init>(BasePeriod.java:52)
	at org.joda.time.Period.<init>(Period.java:582)
	at org.joda.time.TestPeriod_Constructors.testConstructor_RP_RP2(TestPeriod_Constructors.java:821)

testConstructor_RP_RP7(org.joda.time.TestPeriod_Constructors)  Time elapsed: 0.001 sec  <<< ERROR!
java.lang.ClassCastException: org.joda.time.Partial cannot be cast to org.joda.time.base.BaseLocal
	at org.joda.time.base.BasePeriod.<init>(BasePeriod.java:52)
	at org.joda.time.Period.<init>(Period.java:582)
	at org.joda.time.TestPeriod_Constructors.testConstructor_RP_RP7(TestPeriod_Constructors.java:892)

testConstructor_RP_RP8(org.joda.time.TestPeriod_Constructors)  Time elapsed: 0.001 sec  <<< ERROR!
java.lang.ClassCastException: org.joda.time.Partial cannot be cast to org.joda.time.base.BaseLocal
	at org.joda.time.base.BasePeriod.<init>(BasePeriod.java:52)
	at org.joda.time.Period.<init>(Period.java:582)
	at org.joda.time.TestPeriod_Constructors.testConstructor_RP_RP8(TestPeriod_Constructors.java:901)

testConstructor_RP_RP_PeriodType1(org.joda.time.TestPeriod_Constructors)  Time elapsed: 0 sec  <<< ERROR!
java.lang.ClassCastException: org.joda.time.YearMonthDay cannot be cast to org.joda.time.base.BaseLocal
	at org.joda.time.base.BasePeriod.<init>(BasePeriod.java:52)
	at org.joda.time.Period.<init>(Period.java:616)
	at org.joda.time.TestPeriod_Constructors.testConstructor_RP_RP_PeriodType1(TestPeriod_Constructors.java:911)

testConstructor_RP_RP_PeriodType2(org.joda.time.TestPeriod_Constructors)  Time elapsed: 0 sec  <<< ERROR!
java.lang.ClassCastException: org.joda.time.YearMonthDay cannot be cast to org.joda.time.base.BaseLocal
	at org.joda.time.base.BasePeriod.<init>(BasePeriod.java:52)
	at org.joda.time.Period.<init>(Period.java:616)
	at org.joda.time.TestPeriod_Constructors.testConstructor_RP_RP_PeriodType2(TestPeriod_Constructors.java:927)

testConstructor_RP_RP_PeriodType7(org.joda.time.TestPeriod_Constructors)  Time elapsed: 0.001 sec  <<< ERROR!
java.lang.ClassCastException: org.joda.time.Partial cannot be cast to org.joda.time.base.BaseLocal
	at org.joda.time.base.BasePeriod.<init>(BasePeriod.java:52)
	at org.joda.time.Period.<init>(Period.java:616)
	at org.joda.time.TestPeriod_Constructors.testConstructor_RP_RP_PeriodType7(TestPeriod_Constructors.java:998)

testConstructor_RP_RP_PeriodType8(org.joda.time.TestPeriod_Constructors)  Time elapsed: 0.001 sec  <<< ERROR!
java.lang.ClassCastException: org.joda.time.Partial cannot be cast to org.joda.time.base.BaseLocal
	at org.joda.time.base.BasePeriod.<init>(BasePeriod.java:52)
	at org.joda.time.Period.<init>(Period.java:616)
	at org.joda.time.TestPeriod_Constructors.testConstructor_RP_RP_PeriodType8(TestPeriod_Constructors.java:1007)


Results :

Tests in error: 
  org.joda.time.TestPeriod_Constructors#testConstructor_RP_RP1 ClassCastException
  org.joda.time.TestPeriod_Constructors#testConstructor_RP_RP2 ClassCastException
  org.joda.time.TestPeriod_Constructors#testConstructor_RP_RP7 ClassCastException
  org.joda.time.TestPeriod_Constructors#testConstructor_RP_RP8 ClassCastException
  org.joda.time.TestPeriod_Constructors#testConstructor_RP_RP_PeriodType1 ClassCastException
  org.joda.time.TestPeriod_Constructors#testConstructor_RP_RP_PeriodType2 ClassCastException
  org.joda.time.TestPeriod_Constructors#testConstructor_RP_RP_PeriodType7 ClassCastException
  org.joda.time.TestPeriod_Constructors#testConstructor_RP_RP_PeriodType8 ClassCastException

Tests run: 4157, Failures: 0, Errors: 8, Skipped: 0

[INFO] ------------------------------------------------------------------------
[INFO] BUILD FAILURE
[INFO] ------------------------------------------------------------------------
[INFO] Total time: 15.256s
[INFO] Finished at: Wed Aug 05 21:17:21 BST 2015
[INFO] Final Memory: 9M/213M
[INFO] ------------------------------------------------------------------------
[ERROR] Failed to execute goal org.apache.maven.plugins:maven-surefire-plugin:2.18.1:test (default-test) on project joda-time: There are test failures.
[ERROR] 
[ERROR] Please refer to /home/perham/Study/LittleDarwin/Cases/joda-time-2.8.1/target/surefire-reports for the individual test results.
[ERROR] -> [Help 1]
[ERROR] 
[ERROR] To see the full stack trace of the errors, re-run Maven with the -e switch.
[ERROR] Re-run Maven using the -X switch to enable full debug logging.
[ERROR] 
[ERROR] For more information about the errors and possible solutions, please read the following articles:
[ERROR] [Help 1] http://cwiki.apache.org/confluence/display/MAVEN/MojoFailureException
