[INFO] Scanning for projects...
[INFO]                                                                         
[INFO] ------------------------------------------------------------------------
[INFO] Building Joda-Time 2.8.1
[INFO] ------------------------------------------------------------------------
[INFO] 
[INFO] --- maven-resources-plugin:2.7:resources (default-resources) @ joda-time ---
[INFO] Using 'UTF-8' encoding to copy filtered resources.
[INFO] Copying 2 resources to META-INF
[INFO] Copying 10 resources
[INFO] 
[INFO] --- maven-compiler-plugin:3.3:compile (default-compile) @ joda-time ---
[INFO] Changes detected - recompiling the module!
[INFO] Compiling 166 source files to /home/perham/Study/LittleDarwin/Cases/joda-time-2.8.1/target/classes
[INFO] 
[INFO] --- exec-maven-plugin:1.4.0:java (compile-tzdb) @ joda-time ---
Writing zoneinfo files
Writing ZoneInfoMap
[INFO] 
[INFO] --- maven-resources-plugin:2.7:testResources (default-testResources) @ joda-time ---
[INFO] Using 'UTF-8' encoding to copy filtered resources.
[INFO] Copying 34 resources
[INFO] 
[INFO] --- maven-compiler-plugin:3.3:testCompile (default-testCompile) @ joda-time ---
[INFO] Nothing to compile - all classes are up to date
[INFO] 
[INFO] --- maven-surefire-plugin:2.18.1:test (default-test) @ joda-time ---
[INFO] Surefire report directory: /home/perham/Study/LittleDarwin/Cases/joda-time-2.8.1/target/surefire-reports

-------------------------------------------------------
 T E S T S
-------------------------------------------------------
Running org.joda.time.TestAllPackages

TestBuddhistChronology.testCalendar

TestCopticChronology.testCalendar

TestEthiopicChronology.testCalendar

TestIslamicChronology.testCalendar

Testing Gregorian chronology over 1000 iterations
100% complete (i=1000)

Testing Julian chronology over 1000 iterations
100% complete (i=1000)
Writing zoneinfo files
Writing ZoneInfoMap
Tests run: 4157, Failures: 15, Errors: 13, Skipped: 0, Time elapsed: 5.418 sec <<< FAILURE! - in org.joda.time.TestAllPackages
testToPeriod_PeriodType(org.joda.time.TestDuration_Basics)  Time elapsed: 0.006 sec  <<< FAILURE!
junit.framework.AssertionFailedError: expected:<PT10805H6M7.008S> but was:<PT10805H6M7S>
	at junit.framework.Assert.fail(Assert.java:47)
	at junit.framework.Assert.failNotEquals(Assert.java:280)
	at junit.framework.Assert.assertEquals(Assert.java:64)
	at junit.framework.Assert.assertEquals(Assert.java:71)
	at org.joda.time.TestDuration_Basics.testToPeriod_PeriodType(TestDuration_Basics.java:503)

testToPeriod_PeriodType_Chronology(org.joda.time.TestDuration_Basics)  Time elapsed: 0.001 sec  <<< FAILURE!
junit.framework.AssertionFailedError: expected:<P64W2DT5H6M7.008S> but was:<P64W2DT5H6M7S>
	at junit.framework.Assert.fail(Assert.java:47)
	at junit.framework.Assert.failNotEquals(Assert.java:280)
	at junit.framework.Assert.assertEquals(Assert.java:64)
	at junit.framework.Assert.assertEquals(Assert.java:71)
	at org.joda.time.TestDuration_Basics.testToPeriod_PeriodType_Chronology(TestDuration_Basics.java:529)

testConstructor_Object3(org.joda.time.TestPeriod_Constructors)  Time elapsed: 0 sec  <<< FAILURE!
junit.framework.AssertionFailedError: expected:<PeriodType[DayTime]> but was:<PeriodType[Standard]>
	at junit.framework.Assert.fail(Assert.java:47)
	at junit.framework.Assert.failNotEquals(Assert.java:280)
	at junit.framework.Assert.assertEquals(Assert.java:64)
	at junit.framework.Assert.assertEquals(Assert.java:71)
	at org.joda.time.TestPeriod_Constructors.testConstructor_Object3(TestPeriod_Constructors.java:1172)

testConstructor_Object_PeriodType1(org.joda.time.TestPeriod_Constructors)  Time elapsed: 0.001 sec  <<< FAILURE!
junit.framework.AssertionFailedError: expected:<PeriodType[YearMonthDayTime]> but was:<PeriodType[Standard]>
	at junit.framework.Assert.fail(Assert.java:47)
	at junit.framework.Assert.failNotEquals(Assert.java:280)
	at junit.framework.Assert.assertEquals(Assert.java:64)
	at junit.framework.Assert.assertEquals(Assert.java:71)
	at org.joda.time.TestPeriod_Constructors.testConstructor_Object_PeriodType1(TestPeriod_Constructors.java:1203)

testConstructor_Object_PeriodType2(org.joda.time.TestPeriod_Constructors)  Time elapsed: 0.001 sec  <<< FAILURE!
junit.framework.AssertionFailedError: expected:<PeriodType[YearMonthDayTime]> but was:<PeriodType[Standard]>
	at junit.framework.Assert.fail(Assert.java:47)
	at junit.framework.Assert.failNotEquals(Assert.java:280)
	at junit.framework.Assert.assertEquals(Assert.java:64)
	at junit.framework.Assert.assertEquals(Assert.java:71)
	at org.joda.time.TestPeriod_Constructors.testConstructor_Object_PeriodType2(TestPeriod_Constructors.java:1216)

testConstructor_Object_PeriodType3(org.joda.time.TestPeriod_Constructors)  Time elapsed: 0 sec  <<< FAILURE!
junit.framework.AssertionFailedError: expected:<PeriodType[YearMonthDayTime]> but was:<PeriodType[DayTime]>
	at junit.framework.Assert.fail(Assert.java:47)
	at junit.framework.Assert.failNotEquals(Assert.java:280)
	at junit.framework.Assert.assertEquals(Assert.java:64)
	at junit.framework.Assert.assertEquals(Assert.java:71)
	at org.joda.time.TestPeriod_Constructors.testConstructor_Object_PeriodType3(TestPeriod_Constructors.java:1229)

testConstructor_Object_PeriodType4(org.joda.time.TestPeriod_Constructors)  Time elapsed: 0.001 sec  <<< FAILURE!
junit.framework.AssertionFailedError: expected:<PeriodType[DayTime]> but was:<PeriodType[Standard]>
	at junit.framework.Assert.fail(Assert.java:47)
	at junit.framework.Assert.failNotEquals(Assert.java:280)
	at junit.framework.Assert.assertEquals(Assert.java:64)
	at junit.framework.Assert.assertEquals(Assert.java:71)
	at org.joda.time.TestPeriod_Constructors.testConstructor_Object_PeriodType4(TestPeriod_Constructors.java:1242)

testWithPeriodType2(org.joda.time.TestPeriod_Basics)  Time elapsed: 0.001 sec  <<< FAILURE!
junit.framework.AssertionFailedError: expected:<PeriodType[DayTime]> but was:<PeriodType[Standard]>
	at junit.framework.Assert.fail(Assert.java:47)
	at junit.framework.Assert.failNotEquals(Assert.java:280)
	at junit.framework.Assert.assertEquals(Assert.java:64)
	at junit.framework.Assert.assertEquals(Assert.java:71)
	at org.joda.time.TestPeriod_Basics.testWithPeriodType2(TestPeriod_Basics.java:536)

testWithPeriodType3(org.joda.time.TestPeriod_Basics)  Time elapsed: 0 sec  <<< FAILURE!
junit.framework.AssertionFailedError
	at junit.framework.Assert.fail(Assert.java:47)
	at junit.framework.Assert.fail(Assert.java:53)
	at org.joda.time.TestPeriod_Basics.testWithPeriodType3(TestPeriod_Basics.java:543)

testWithPeriodType5(org.joda.time.TestPeriod_Basics)  Time elapsed: 0.001 sec  <<< FAILURE!
junit.framework.AssertionFailedError: expected:<PeriodType[YearMonthDayTime]> but was:<PeriodType[Standard]>
	at junit.framework.Assert.fail(Assert.java:47)
	at junit.framework.Assert.failNotEquals(Assert.java:280)
	at junit.framework.Assert.assertEquals(Assert.java:64)
	at junit.framework.Assert.assertEquals(Assert.java:71)
	at org.joda.time.TestPeriod_Basics.testWithPeriodType5(TestPeriod_Basics.java:558)

testConstructor_Object3(org.joda.time.TestMutablePeriod_Constructors)  Time elapsed: 0.001 sec  <<< FAILURE!
junit.framework.AssertionFailedError: expected:<PeriodType[DayTime]> but was:<PeriodType[Standard]>
	at junit.framework.Assert.fail(Assert.java:47)
	at junit.framework.Assert.failNotEquals(Assert.java:280)
	at junit.framework.Assert.assertEquals(Assert.java:64)
	at junit.framework.Assert.assertEquals(Assert.java:71)
	at org.joda.time.TestMutablePeriod_Constructors.testConstructor_Object3(TestMutablePeriod_Constructors.java:854)

testConstructor_Object_PeriodType1(org.joda.time.TestMutablePeriod_Constructors)  Time elapsed: 0.001 sec  <<< FAILURE!
junit.framework.AssertionFailedError: expected:<PeriodType[YearMonthDayTime]> but was:<PeriodType[Standard]>
	at junit.framework.Assert.fail(Assert.java:47)
	at junit.framework.Assert.failNotEquals(Assert.java:280)
	at junit.framework.Assert.assertEquals(Assert.java:64)
	at junit.framework.Assert.assertEquals(Assert.java:71)
	at org.joda.time.TestMutablePeriod_Constructors.testConstructor_Object_PeriodType1(TestMutablePeriod_Constructors.java:885)

testConstructor_Object_PeriodType2(org.joda.time.TestMutablePeriod_Constructors)  Time elapsed: 0.001 sec  <<< FAILURE!
junit.framework.AssertionFailedError: expected:<PeriodType[YearMonthDayTime]> but was:<PeriodType[Standard]>
	at junit.framework.Assert.fail(Assert.java:47)
	at junit.framework.Assert.failNotEquals(Assert.java:280)
	at junit.framework.Assert.assertEquals(Assert.java:64)
	at junit.framework.Assert.assertEquals(Assert.java:71)
	at org.joda.time.TestMutablePeriod_Constructors.testConstructor_Object_PeriodType2(TestMutablePeriod_Constructors.java:898)

testConstructor_Object_PeriodType3(org.joda.time.TestMutablePeriod_Constructors)  Time elapsed: 0.005 sec  <<< FAILURE!
junit.framework.AssertionFailedError: expected:<PeriodType[YearMonthDayTime]> but was:<PeriodType[DayTime]>
	at junit.framework.Assert.fail(Assert.java:47)
	at junit.framework.Assert.failNotEquals(Assert.java:280)
	at junit.framework.Assert.assertEquals(Assert.java:64)
	at junit.framework.Assert.assertEquals(Assert.java:71)
	at org.joda.time.TestMutablePeriod_Constructors.testConstructor_Object_PeriodType3(TestMutablePeriod_Constructors.java:911)

testConstructor_Object_PeriodType4(org.joda.time.TestMutablePeriod_Constructors)  Time elapsed: 0 sec  <<< FAILURE!
junit.framework.AssertionFailedError: expected:<PeriodType[DayTime]> but was:<PeriodType[Standard]>
	at junit.framework.Assert.fail(Assert.java:47)
	at junit.framework.Assert.failNotEquals(Assert.java:280)
	at junit.framework.Assert.assertEquals(Assert.java:64)
	at junit.framework.Assert.assertEquals(Assert.java:71)
	at org.joda.time.TestMutablePeriod_Constructors.testConstructor_Object_PeriodType4(TestMutablePeriod_Constructors.java:924)

testFactory_parseMonths_String(org.joda.time.TestMonths)  Time elapsed: 0.001 sec  <<< ERROR!
java.lang.ArrayIndexOutOfBoundsException: 1
	at org.joda.time.base.BasePeriod.getValue(BasePeriod.java:106)
	at org.joda.time.PeriodType.getIndexedField(PeriodType.java:675)
	at org.joda.time.Period.getMonths(Period.java:766)
	at org.joda.time.Months.parseMonths(Months.java:199)
	at org.joda.time.TestMonths.testFactory_parseMonths_String(TestMonths.java:161)

testFactory_parseWeeks_String(org.joda.time.TestWeeks)  Time elapsed: 0 sec  <<< ERROR!
java.lang.ArrayIndexOutOfBoundsException: 2
	at org.joda.time.base.BasePeriod.getValue(BasePeriod.java:106)
	at org.joda.time.PeriodType.getIndexedField(PeriodType.java:675)
	at org.joda.time.Period.getWeeks(Period.java:775)
	at org.joda.time.Weeks.parseWeeks(Weeks.java:186)
	at org.joda.time.TestWeeks.testFactory_parseWeeks_String(TestWeeks.java:133)

testFactory_parseDays_String(org.joda.time.TestDays)  Time elapsed: 0 sec  <<< ERROR!
java.lang.ArrayIndexOutOfBoundsException: 3
	at org.joda.time.base.BasePeriod.getValue(BasePeriod.java:106)
	at org.joda.time.PeriodType.getIndexedField(PeriodType.java:675)
	at org.joda.time.Period.getDays(Period.java:784)
	at org.joda.time.Days.parseDays(Days.java:204)
	at org.joda.time.TestDays.testFactory_parseDays_String(TestDays.java:175)

testFactory_parseHours_String(org.joda.time.TestHours)  Time elapsed: 0.001 sec  <<< ERROR!
java.lang.ArrayIndexOutOfBoundsException: 4
	at org.joda.time.base.BasePeriod.getValue(BasePeriod.java:106)
	at org.joda.time.PeriodType.getIndexedField(PeriodType.java:675)
	at org.joda.time.Period.getHours(Period.java:794)
	at org.joda.time.Hours.parseHours(Hours.java:206)
	at org.joda.time.TestHours.testFactory_parseHours_String(TestHours.java:144)

testFactory_parseMinutes_String(org.joda.time.TestMinutes)  Time elapsed: 0 sec  <<< ERROR!
java.lang.ArrayIndexOutOfBoundsException: 5
	at org.joda.time.base.BasePeriod.getValue(BasePeriod.java:106)
	at org.joda.time.PeriodType.getIndexedField(PeriodType.java:675)
	at org.joda.time.Period.getMinutes(Period.java:803)
	at org.joda.time.Minutes.parseMinutes(Minutes.java:186)
	at org.joda.time.TestMinutes.testFactory_parseMinutes_String(TestMinutes.java:134)

testFactory_parseSeconds_String(org.joda.time.TestSeconds)  Time elapsed: 0.001 sec  <<< ERROR!
java.lang.ArrayIndexOutOfBoundsException: 6
	at org.joda.time.base.BasePeriod.getValue(BasePeriod.java:106)
	at org.joda.time.PeriodType.getIndexedField(PeriodType.java:675)
	at org.joda.time.Period.getSeconds(Period.java:812)
	at org.joda.time.Seconds.parseSeconds(Seconds.java:186)
	at org.joda.time.TestSeconds.testFactory_parseSeconds_String(TestSeconds.java:131)

testMonths(org.joda.time.TestStringConvert)  Time elapsed: 0.001 sec  <<< ERROR!
java.lang.ArrayIndexOutOfBoundsException: 1
	at org.joda.time.base.BasePeriod.getValue(BasePeriod.java:106)
	at org.joda.time.PeriodType.getIndexedField(PeriodType.java:675)
	at org.joda.time.Period.getMonths(Period.java:766)
	at org.joda.time.Months.parseMonths(Months.java:199)
	at sun.reflect.NativeMethodAccessorImpl.invoke0(Native Method)
	at sun.reflect.NativeMethodAccessorImpl.invoke(NativeMethodAccessorImpl.java:57)
	at sun.reflect.DelegatingMethodAccessorImpl.invoke(DelegatingMethodAccessorImpl.java:43)
	at java.lang.reflect.Method.invoke(Method.java:606)
	at org.joda.convert.MethodsStringConverter.convertFromString(MethodsStringConverter.java:70)
	at org.joda.convert.StringConvert.convertFromString(StringConvert.java:163)
	at org.joda.time.TestStringConvert.testMonths(TestStringConvert.java:165)

testWeeks(org.joda.time.TestStringConvert)  Time elapsed: 0.001 sec  <<< ERROR!
java.lang.ArrayIndexOutOfBoundsException: 2
	at org.joda.time.base.BasePeriod.getValue(BasePeriod.java:106)
	at org.joda.time.PeriodType.getIndexedField(PeriodType.java:675)
	at org.joda.time.Period.getWeeks(Period.java:775)
	at org.joda.time.Weeks.parseWeeks(Weeks.java:186)
	at sun.reflect.NativeMethodAccessorImpl.invoke0(Native Method)
	at sun.reflect.NativeMethodAccessorImpl.invoke(NativeMethodAccessorImpl.java:57)
	at sun.reflect.DelegatingMethodAccessorImpl.invoke(DelegatingMethodAccessorImpl.java:43)
	at java.lang.reflect.Method.invoke(Method.java:606)
	at org.joda.convert.MethodsStringConverter.convertFromString(MethodsStringConverter.java:70)
	at org.joda.convert.StringConvert.convertFromString(StringConvert.java:163)
	at org.joda.time.TestStringConvert.testWeeks(TestStringConvert.java:172)

testDays(org.joda.time.TestStringConvert)  Time elapsed: 0.001 sec  <<< ERROR!
java.lang.ArrayIndexOutOfBoundsException: 3
	at org.joda.time.base.BasePeriod.getValue(BasePeriod.java:106)
	at org.joda.time.PeriodType.getIndexedField(PeriodType.java:675)
	at org.joda.time.Period.getDays(Period.java:784)
	at org.joda.time.Days.parseDays(Days.java:204)
	at sun.reflect.NativeMethodAccessorImpl.invoke0(Native Method)
	at sun.reflect.NativeMethodAccessorImpl.invoke(NativeMethodAccessorImpl.java:57)
	at sun.reflect.DelegatingMethodAccessorImpl.invoke(DelegatingMethodAccessorImpl.java:43)
	at java.lang.reflect.Method.invoke(Method.java:606)
	at org.joda.convert.MethodsStringConverter.convertFromString(MethodsStringConverter.java:70)
	at org.joda.convert.StringConvert.convertFromString(StringConvert.java:163)
	at org.joda.time.TestStringConvert.testDays(TestStringConvert.java:179)

testHours(org.joda.time.TestStringConvert)  Time elapsed: 0.002 sec  <<< ERROR!
java.lang.ArrayIndexOutOfBoundsException: 4
	at org.joda.time.base.BasePeriod.getValue(BasePeriod.java:106)
	at org.joda.time.PeriodType.getIndexedField(PeriodType.java:675)
	at org.joda.time.Period.getHours(Period.java:794)
	at org.joda.time.Hours.parseHours(Hours.java:206)
	at sun.reflect.NativeMethodAccessorImpl.invoke0(Native Method)
	at sun.reflect.NativeMethodAccessorImpl.invoke(NativeMethodAccessorImpl.java:57)
	at sun.reflect.DelegatingMethodAccessorImpl.invoke(DelegatingMethodAccessorImpl.java:43)
	at java.lang.reflect.Method.invoke(Method.java:606)
	at org.joda.convert.MethodsStringConverter.convertFromString(MethodsStringConverter.java:70)
	at org.joda.convert.StringConvert.convertFromString(StringConvert.java:163)
	at org.joda.time.TestStringConvert.testHours(TestStringConvert.java:186)

testMinutes(org.joda.time.TestStringConvert)  Time elapsed: 0.001 sec  <<< ERROR!
java.lang.ArrayIndexOutOfBoundsException: 5
	at org.joda.time.base.BasePeriod.getValue(BasePeriod.java:106)
	at org.joda.time.PeriodType.getIndexedField(PeriodType.java:675)
	at org.joda.time.Period.getMinutes(Period.java:803)
	at org.joda.time.Minutes.parseMinutes(Minutes.java:186)
	at sun.reflect.NativeMethodAccessorImpl.invoke0(Native Method)
	at sun.reflect.NativeMethodAccessorImpl.invoke(NativeMethodAccessorImpl.java:57)
	at sun.reflect.DelegatingMethodAccessorImpl.invoke(DelegatingMethodAccessorImpl.java:43)
	at java.lang.reflect.Method.invoke(Method.java:606)
	at org.joda.convert.MethodsStringConverter.convertFromString(MethodsStringConverter.java:70)
	at org.joda.convert.StringConvert.convertFromString(StringConvert.java:163)
	at org.joda.time.TestStringConvert.testMinutes(TestStringConvert.java:193)

testSeconds(org.joda.time.TestStringConvert)  Time elapsed: 0.002 sec  <<< ERROR!
java.lang.ArrayIndexOutOfBoundsException: 6
	at org.joda.time.base.BasePeriod.getValue(BasePeriod.java:106)
	at org.joda.time.PeriodType.getIndexedField(PeriodType.java:675)
	at org.joda.time.Period.getSeconds(Period.java:812)
	at org.joda.time.Seconds.parseSeconds(Seconds.java:186)
	at sun.reflect.NativeMethodAccessorImpl.invoke0(Native Method)
	at sun.reflect.NativeMethodAccessorImpl.invoke(NativeMethodAccessorImpl.java:57)
	at sun.reflect.DelegatingMethodAccessorImpl.invoke(DelegatingMethodAccessorImpl.java:43)
	at java.lang.reflect.Method.invoke(Method.java:606)
	at org.joda.convert.MethodsStringConverter.convertFromString(MethodsStringConverter.java:70)
	at org.joda.convert.StringConvert.convertFromString(StringConvert.java:163)
	at org.joda.time.TestStringConvert.testSeconds(TestStringConvert.java:200)

testParsePeriod_parseType(org.joda.time.format.TestPeriodFormatter)  Time elapsed: 0.001 sec  <<< ERROR!
java.lang.ArrayIndexOutOfBoundsException: 6
	at org.joda.time.base.BasePeriod.getValue(BasePeriod.java:106)
	at org.joda.time.base.AbstractPeriod.get(AbstractPeriod.java:117)
	at org.joda.time.format.PeriodFormatterBuilder$FieldFormatter.getFieldValue(PeriodFormatterBuilder.java:1752)
	at org.joda.time.format.PeriodFormatterBuilder$FieldFormatter.calculatePrintedLength(PeriodFormatterBuilder.java:1414)
	at org.joda.time.format.PeriodFormatterBuilder$Composite.calculatePrintedLength(PeriodFormatterBuilder.java:2131)
	at org.joda.time.format.PeriodFormatterBuilder$Separator.calculatePrintedLength(PeriodFormatterBuilder.java:1966)
	at org.joda.time.format.PeriodFormatter.print(PeriodFormatter.java:244)
	at org.joda.time.base.AbstractPeriod.toString(AbstractPeriod.java:228)
	at java.lang.String.valueOf(String.java:2847)
	at java.lang.StringBuffer.append(StringBuffer.java:232)
	at junit.framework.Assert.format(Assert.java:287)
	at junit.framework.Assert.failNotEquals(Assert.java:280)
	at junit.framework.Assert.assertEquals(Assert.java:64)
	at junit.framework.Assert.assertEquals(Assert.java:71)
	at org.joda.time.format.TestPeriodFormatter.testParsePeriod_parseType(TestPeriodFormatter.java:199)


Results :

Failed tests: 
  org.joda.time.TestDuration_Basics#testToPeriod_PeriodType AssertionFailedError
  org.joda.time.TestDuration_Basics#testToPeriod_PeriodType_Chronology AssertionFailedError
  org.joda.time.TestMutablePeriod_Constructors#testConstructor_Object3 AssertionFailedError
  org.joda.time.TestMutablePeriod_Constructors#testConstructor_Object_PeriodType1 AssertionFailedError
  org.joda.time.TestMutablePeriod_Constructors#testConstructor_Object_PeriodType2 AssertionFailedError
  org.joda.time.TestMutablePeriod_Constructors#testConstructor_Object_PeriodType3 AssertionFailedError
  org.joda.time.TestMutablePeriod_Constructors#testConstructor_Object_PeriodType4 AssertionFailedError
  org.joda.time.TestPeriod_Basics#testWithPeriodType2 AssertionFailedError expec...
  org.joda.time.TestPeriod_Basics#testWithPeriodType3 AssertionFailedError
  org.joda.time.TestPeriod_Basics#testWithPeriodType5 AssertionFailedError expec...
  org.joda.time.TestPeriod_Constructors#testConstructor_Object3 AssertionFailedError
  org.joda.time.TestPeriod_Constructors#testConstructor_Object_PeriodType1 AssertionFailedError
  org.joda.time.TestPeriod_Constructors#testConstructor_Object_PeriodType2 AssertionFailedError
  org.joda.time.TestPeriod_Constructors#testConstructor_Object_PeriodType3 AssertionFailedError
  org.joda.time.TestPeriod_Constructors#testConstructor_Object_PeriodType4 AssertionFailedError
Tests in error: 
  org.joda.time.TestDays#testFactory_parseDays_String ArrayIndexOutOfBoundsException
  org.joda.time.TestHours#testFactory_parseHours_String ArrayIndexOutOfBoundsException
  org.joda.time.TestMinutes#testFactory_parseMinutes_String ArrayIndexOutOfBoundsException
  org.joda.time.TestMonths#testFactory_parseMonths_String ArrayIndexOutOfBoundsException
  org.joda.time.TestSeconds#testFactory_parseSeconds_String ArrayIndexOutOfBoundsException
  org.joda.time.TestStringConvert#testDays ArrayIndexOutOfBoundsException 3
  org.joda.time.TestStringConvert#testHours ArrayIndexOutOfBoundsException 4
  org.joda.time.TestStringConvert#testMinutes ArrayIndexOutOfBoundsException 5
  org.joda.time.TestStringConvert#testMonths ArrayIndexOutOfBoundsException 1
  org.joda.time.TestStringConvert#testSeconds ArrayIndexOutOfBoundsException 6
  org.joda.time.TestStringConvert#testWeeks ArrayIndexOutOfBoundsException 2
  org.joda.time.TestWeeks#testFactory_parseWeeks_String ArrayIndexOutOfBoundsException
  org.joda.time.format.TestPeriodFormatter#testParsePeriod_parseType ArrayIndexOutOfBoundsException

Tests run: 4157, Failures: 15, Errors: 13, Skipped: 0

[INFO] ------------------------------------------------------------------------
[INFO] BUILD FAILURE
[INFO] ------------------------------------------------------------------------
[INFO] Total time: 15.935s
[INFO] Finished at: Wed Aug 05 21:13:33 BST 2015
[INFO] Final Memory: 9M/213M
[INFO] ------------------------------------------------------------------------
[ERROR] Failed to execute goal org.apache.maven.plugins:maven-surefire-plugin:2.18.1:test (default-test) on project joda-time: There are test failures.
[ERROR] 
[ERROR] Please refer to /home/perham/Study/LittleDarwin/Cases/joda-time-2.8.1/target/surefire-reports for the individual test results.
[ERROR] -> [Help 1]
[ERROR] 
[ERROR] To see the full stack trace of the errors, re-run Maven with the -e switch.
[ERROR] Re-run Maven using the -X switch to enable full debug logging.
[ERROR] 
[ERROR] For more information about the errors and possible solutions, please read the following articles:
[ERROR] [Help 1] http://cwiki.apache.org/confluence/display/MAVEN/MojoFailureException
