[INFO] Scanning for projects...
[INFO]                                                                         
[INFO] ------------------------------------------------------------------------
[INFO] Building Joda-Time 2.8.1
[INFO] ------------------------------------------------------------------------
[INFO] 
[INFO] --- maven-resources-plugin:2.7:resources (default-resources) @ joda-time ---
[INFO] Using 'UTF-8' encoding to copy filtered resources.
[INFO] Copying 2 resources to META-INF
[INFO] Copying 10 resources
[INFO] 
[INFO] --- maven-compiler-plugin:3.3:compile (default-compile) @ joda-time ---
[INFO] Changes detected - recompiling the module!
[INFO] Compiling 166 source files to /home/perham/Study/LittleDarwin/Cases/joda-time-2.8.1/target/classes
[INFO] 
[INFO] --- exec-maven-plugin:1.4.0:java (compile-tzdb) @ joda-time ---
Writing zoneinfo files
Writing ZoneInfoMap
[INFO] 
[INFO] --- maven-resources-plugin:2.7:testResources (default-testResources) @ joda-time ---
[INFO] Using 'UTF-8' encoding to copy filtered resources.
[INFO] Copying 34 resources
[INFO] 
[INFO] --- maven-compiler-plugin:3.3:testCompile (default-testCompile) @ joda-time ---
[INFO] Nothing to compile - all classes are up to date
[INFO] 
[INFO] --- maven-surefire-plugin:2.18.1:test (default-test) @ joda-time ---
[INFO] Surefire report directory: /home/perham/Study/LittleDarwin/Cases/joda-time-2.8.1/target/surefire-reports

-------------------------------------------------------
 T E S T S
-------------------------------------------------------
Running org.joda.time.TestAllPackages

TestBuddhistChronology.testCalendar

TestCopticChronology.testCalendar

TestEthiopicChronology.testCalendar

TestIslamicChronology.testCalendar

Testing Gregorian chronology over 1000 iterations
100% complete (i=1000)

Testing Julian chronology over 1000 iterations
100% complete (i=1000)
Writing zoneinfo files
Writing ZoneInfoMap
Tests run: 4157, Failures: 28, Errors: 5, Skipped: 0, Time elapsed: 5.287 sec <<< FAILURE! - in org.joda.time.TestAllPackages
testToString(org.joda.time.TestPeriod_Basics)  Time elapsed: 0.004 sec  <<< FAILURE!
junit.framework.ComparisonFailure: expected:<P1Y[2M]3W4DT5H6M7.008S> but was:<P1Y[]3W4DT5H6M7.008S>
	at junit.framework.Assert.assertEquals(Assert.java:81)
	at junit.framework.Assert.assertEquals(Assert.java:87)
	at org.joda.time.TestPeriod_Basics.testToString(TestPeriod_Basics.java:472)

testGet(org.joda.time.TestPeriod_Basics)  Time elapsed: 0.001 sec  <<< ERROR!
java.lang.ArrayIndexOutOfBoundsException: -1
	at org.joda.time.base.BasePeriod.getValue(BasePeriod.java:329)
	at org.joda.time.base.AbstractPeriod.get(AbstractPeriod.java:31)
	at org.joda.time.TestPeriod_Basics.testGet(TestPeriod_Basics.java:186)

testToString_PeriodFormatter(org.joda.time.TestPeriod_Basics)  Time elapsed: 0.006 sec  <<< FAILURE!
junit.framework.ComparisonFailure: expected:<1 year, [2 months, ]3 weeks, 4 days, 5 h...> but was:<1 year, []3 weeks, 4 days, 5 h...>
	at junit.framework.Assert.assertEquals(Assert.java:81)
	at junit.framework.Assert.assertEquals(Assert.java:87)
	at org.joda.time.TestPeriod_Basics.testToString_PeriodFormatter(TestPeriod_Basics.java:484)

testToString_nullPeriodFormatter(org.joda.time.TestPeriod_Basics)  Time elapsed: 0.001 sec  <<< FAILURE!
junit.framework.ComparisonFailure: expected:<P1Y[2M]3W4DT5H6M7.008S> but was:<P1Y[]3W4DT5H6M7.008S>
	at junit.framework.Assert.assertEquals(Assert.java:81)
	at junit.framework.Assert.assertEquals(Assert.java:87)
	at org.joda.time.TestPeriod_Basics.testToString_nullPeriodFormatter(TestPeriod_Basics.java:492)

testPlus(org.joda.time.TestPeriod_Basics)  Time elapsed: 0.002 sec  <<< ERROR!
java.lang.ArrayIndexOutOfBoundsException: -1
	at org.joda.time.base.BasePeriod.getValue(BasePeriod.java:329)
	at org.joda.time.base.AbstractPeriod.get(AbstractPeriod.java:31)
	at org.joda.time.Period.plus(Period.java:1048)
	at org.joda.time.TestPeriod_Basics.testPlus(TestPeriod_Basics.java:758)

testMinus(org.joda.time.TestPeriod_Basics)  Time elapsed: 0 sec  <<< ERROR!
java.lang.ArrayIndexOutOfBoundsException: -1
	at org.joda.time.base.BasePeriod.getValue(BasePeriod.java:329)
	at org.joda.time.base.AbstractPeriod.get(AbstractPeriod.java:31)
	at org.joda.time.Period.minus(Period.java:1227)
	at org.joda.time.TestPeriod_Basics.testMinus(TestPeriod_Basics.java:832)

testToString(org.joda.time.TestMutablePeriod_Basics)  Time elapsed: 0 sec  <<< FAILURE!
junit.framework.ComparisonFailure: expected:<P1Y[2M]3W4DT5H6M7.008S> but was:<P1Y[]3W4DT5H6M7.008S>
	at junit.framework.Assert.assertEquals(Assert.java:81)
	at junit.framework.Assert.assertEquals(Assert.java:87)
	at org.joda.time.TestMutablePeriod_Basics.testToString(TestMutablePeriod_Basics.java:405)

testPeriod(org.joda.time.TestStringConvert)  Time elapsed: 0.03 sec  <<< FAILURE!
junit.framework.ComparisonFailure: expected:<P1Y[2M]3W4DT5H6M7.008S> but was:<P1Y[]3W4DT5H6M7.008S>
	at junit.framework.Assert.assertEquals(Assert.java:81)
	at junit.framework.Assert.assertEquals(Assert.java:87)
	at org.joda.time.TestStringConvert.testPeriod(TestStringConvert.java:143)

testMutablePeriod(org.joda.time.TestStringConvert)  Time elapsed: 0.001 sec  <<< FAILURE!
junit.framework.ComparisonFailure: expected:<P1Y[2M]3W4DT5H6M7.008S> but was:<P1Y[]3W4DT5H6M7.008S>
	at junit.framework.Assert.assertEquals(Assert.java:81)
	at junit.framework.Assert.assertEquals(Assert.java:87)
	at org.joda.time.TestStringConvert.testMutablePeriod(TestStringConvert.java:150)

testPrint_simple(org.joda.time.format.TestPeriodFormatter)  Time elapsed: 0.001 sec  <<< FAILURE!
junit.framework.ComparisonFailure: expected:<P1Y[2M]3W4DT5H6M7.008S> but was:<P1Y[]3W4DT5H6M7.008S>
	at junit.framework.Assert.assertEquals(Assert.java:81)
	at junit.framework.Assert.assertEquals(Assert.java:87)
	at org.joda.time.format.TestPeriodFormatter.testPrint_simple(TestPeriodFormatter.java:101)

testPrint_bufferMethods(org.joda.time.format.TestPeriodFormatter)  Time elapsed: 0 sec  <<< FAILURE!
junit.framework.ComparisonFailure: expected:<P1Y[2M]3W4DT5H6M7.008S> but was:<P1Y[]3W4DT5H6M7.008S>
	at junit.framework.Assert.assertEquals(Assert.java:81)
	at junit.framework.Assert.assertEquals(Assert.java:87)
	at org.joda.time.format.TestPeriodFormatter.testPrint_bufferMethods(TestPeriodFormatter.java:109)

testPrint_writerMethods(org.joda.time.format.TestPeriodFormatter)  Time elapsed: 0 sec  <<< FAILURE!
junit.framework.ComparisonFailure: expected:<P1Y[2M]3W4DT5H6M7.008S> but was:<P1Y[]3W4DT5H6M7.008S>
	at junit.framework.Assert.assertEquals(Assert.java:81)
	at junit.framework.Assert.assertEquals(Assert.java:87)
	at org.joda.time.format.TestPeriodFormatter.testPrint_writerMethods(TestPeriodFormatter.java:123)

test_wordBased_da_formatMultiple(org.joda.time.format.TestPeriodFormat)  Time elapsed: 0.002 sec  <<< FAILURE!
junit.framework.ComparisonFailure: expected:<2 år, [3 måneder, ]4 uger, 2 dage, 5 ti...> but was:<2 år, []4 uger, 2 dage, 5 ti...>
	at junit.framework.Assert.assertEquals(Assert.java:81)
	at junit.framework.Assert.assertEquals(Assert.java:87)
	at org.joda.time.format.TestPeriodFormat.test_wordBased_da_formatMultiple(TestPeriodFormat.java:319)

test_wordBased_da_formatSinglular(org.joda.time.format.TestPeriodFormat)  Time elapsed: 0.001 sec  <<< FAILURE!
junit.framework.ComparisonFailure: expected:<1 år, 1 [måned, 1 ]uge, 1 dag, 1 time, ...> but was:<1 år, 1 []uge, 1 dag, 1 time, ...>
	at junit.framework.Assert.assertEquals(Assert.java:81)
	at junit.framework.Assert.assertEquals(Assert.java:87)
	at org.joda.time.format.TestPeriodFormat.test_wordBased_da_formatSinglular(TestPeriodFormat.java:325)

test_wordBased_ja_formatMultiple(org.joda.time.format.TestPeriodFormat)  Time elapsed: 0.003 sec  <<< FAILURE!
junit.framework.ComparisonFailure: expected:<2年[3か月]4週間2日5時間6分7秒8ミリ秒> but was:<2年[]4週間2日5時間6分7秒8ミリ秒>
	at junit.framework.Assert.assertEquals(Assert.java:81)
	at junit.framework.Assert.assertEquals(Assert.java:87)
	at org.joda.time.format.TestPeriodFormat.test_wordBased_ja_formatMultiple(TestPeriodFormat.java:338)

test_wordBased_ja_formatSingular(org.joda.time.format.TestPeriodFormat)  Time elapsed: 0.001 sec  <<< FAILURE!
junit.framework.ComparisonFailure: expected:<1年1[か月1]週間1日1時間1分1秒1ミリ秒> but was:<1年1[]週間1日1時間1分1秒1ミリ秒>
	at junit.framework.Assert.assertEquals(Assert.java:81)
	at junit.framework.Assert.assertEquals(Assert.java:87)
	at org.joda.time.format.TestPeriodFormat.test_wordBased_ja_formatSingular(TestPeriodFormat.java:344)

test_wordBased_pl_regEx(org.joda.time.format.TestPeriodFormat)  Time elapsed: 0.004 sec  <<< FAILURE!
junit.framework.ComparisonFailure: expected:<[1 miesiąc]> but was:<[]>
	at junit.framework.Assert.assertEquals(Assert.java:81)
	at junit.framework.Assert.assertEquals(Assert.java:87)
	at org.joda.time.format.TestPeriodFormat.test_wordBased_pl_regEx(TestPeriodFormat.java:445)

testFormatStandard(org.joda.time.format.TestISOPeriodFormat)  Time elapsed: 0.001 sec  <<< FAILURE!
junit.framework.ComparisonFailure: expected:<P1Y[2M]3W4DT5H6M7.008S> but was:<P1Y[]3W4DT5H6M7.008S>
	at junit.framework.Assert.assertEquals(Assert.java:81)
	at junit.framework.Assert.assertEquals(Assert.java:87)
	at org.joda.time.format.TestISOPeriodFormat.testFormatStandard(TestISOPeriodFormat.java:103)

testFormatStandard_negative(org.joda.time.format.TestISOPeriodFormat)  Time elapsed: 0 sec  <<< FAILURE!
junit.framework.ComparisonFailure: expected:<P-1Y-[2M-]3W-4DT-5H-6M-7.008S> but was:<P-1Y-[]3W-4DT-5H-6M-7.008S>
	at junit.framework.Assert.assertEquals(Assert.java:81)
	at junit.framework.Assert.assertEquals(Assert.java:87)
	at org.joda.time.format.TestISOPeriodFormat.testFormatStandard_negative(TestISOPeriodFormat.java:120)

testFormatAlternate(org.joda.time.format.TestISOPeriodFormat)  Time elapsed: 0.001 sec  <<< FAILURE!
junit.framework.ComparisonFailure: expected:<P00010[2]04T050607.008> but was:<P00010[0]04T050607.008>
	at junit.framework.Assert.assertEquals(Assert.java:81)
	at junit.framework.Assert.assertEquals(Assert.java:87)
	at org.joda.time.format.TestISOPeriodFormat.testFormatAlternate(TestISOPeriodFormat.java:141)

testFormatAlternateExtended(org.joda.time.format.TestISOPeriodFormat)  Time elapsed: 0.001 sec  <<< FAILURE!
junit.framework.ComparisonFailure: expected:<P0001-0[2]-04T05:06:07.008> but was:<P0001-0[0]-04T05:06:07.008>
	at junit.framework.Assert.assertEquals(Assert.java:81)
	at junit.framework.Assert.assertEquals(Assert.java:87)
	at org.joda.time.format.TestISOPeriodFormat.testFormatAlternateExtended(TestISOPeriodFormat.java:159)

testFormatAlternateWithWeeks(org.joda.time.format.TestISOPeriodFormat)  Time elapsed: 0 sec  <<< ERROR!
java.lang.ArrayIndexOutOfBoundsException

testFormatAlternateExtendedWithWeeks(org.joda.time.format.TestISOPeriodFormat)  Time elapsed: 0 sec  <<< ERROR!
java.lang.ArrayIndexOutOfBoundsException

testFormatPrintZeroDefault(org.joda.time.format.TestPeriodFormatterBuilder)  Time elapsed: 0.001 sec  <<< FAILURE!
junit.framework.ComparisonFailure: expected:<1-[2]-3-4> but was:<1-[]-3-4>
	at junit.framework.Assert.assertEquals(Assert.java:81)
	at junit.framework.Assert.assertEquals(Assert.java:87)
	at org.joda.time.format.TestPeriodFormatterBuilder.testFormatPrintZeroDefault(TestPeriodFormatterBuilder.java:872)

testFormatPrintZeroRarelyLast(org.joda.time.format.TestPeriodFormatterBuilder)  Time elapsed: 0.001 sec  <<< FAILURE!
junit.framework.ComparisonFailure: expected:<1-[2]-3-4> but was:<1-[]-3-4>
	at junit.framework.Assert.assertEquals(Assert.java:81)
	at junit.framework.Assert.assertEquals(Assert.java:87)
	at org.joda.time.format.TestPeriodFormatterBuilder.testFormatPrintZeroRarelyLast(TestPeriodFormatterBuilder.java:905)

testFormatPrintZeroRarelyFirst(org.joda.time.format.TestPeriodFormatterBuilder)  Time elapsed: 0 sec  <<< FAILURE!
junit.framework.ComparisonFailure: expected:<1-[2]-3-4> but was:<1-[]-3-4>
	at junit.framework.Assert.assertEquals(Assert.java:81)
	at junit.framework.Assert.assertEquals(Assert.java:87)
	at org.joda.time.format.TestPeriodFormatterBuilder.testFormatPrintZeroRarelyFirst(TestPeriodFormatterBuilder.java:930)

testFormatPrintZeroIfSupported(org.joda.time.format.TestPeriodFormatterBuilder)  Time elapsed: 0 sec  <<< FAILURE!
junit.framework.ComparisonFailure: expected:<1-[2]-3-4> but was:<1-[0]-3-4>
	at junit.framework.Assert.assertEquals(Assert.java:81)
	at junit.framework.Assert.assertEquals(Assert.java:87)
	at org.joda.time.format.TestPeriodFormatterBuilder.testFormatPrintZeroIfSupported(TestPeriodFormatterBuilder.java:1004)

testFormatPrintZeroAlways(org.joda.time.format.TestPeriodFormatterBuilder)  Time elapsed: 0.001 sec  <<< FAILURE!
junit.framework.ComparisonFailure: expected:<1-[2]-3-4> but was:<1-[0]-3-4>
	at junit.framework.Assert.assertEquals(Assert.java:81)
	at junit.framework.Assert.assertEquals(Assert.java:87)
	at org.joda.time.format.TestPeriodFormatterBuilder.testFormatPrintZeroAlways(TestPeriodFormatterBuilder.java:1029)

testFormatPrintZeroNever(org.joda.time.format.TestPeriodFormatterBuilder)  Time elapsed: 0 sec  <<< FAILURE!
junit.framework.ComparisonFailure: expected:<1-[2]-3-4> but was:<1-[]-3-4>
	at junit.framework.Assert.assertEquals(Assert.java:81)
	at junit.framework.Assert.assertEquals(Assert.java:87)
	at org.joda.time.format.TestPeriodFormatterBuilder.testFormatPrintZeroNever(TestPeriodFormatterBuilder.java:1054)

testFormatAppend_PrinterParser_Printer_null(org.joda.time.format.TestPeriodFormatterBuilder)  Time elapsed: 0.001 sec  <<< FAILURE!
junit.framework.ComparisonFailure: expected:<1-[2]> but was:<1-[]>
	at junit.framework.Assert.assertEquals(Assert.java:81)
	at junit.framework.Assert.assertEquals(Assert.java:87)
	at org.joda.time.format.TestPeriodFormatterBuilder.testFormatAppend_PrinterParser_Printer_null(TestPeriodFormatterBuilder.java:1086)

testFormatAppend_PrinterParser_PrinterParser(org.joda.time.format.TestPeriodFormatterBuilder)  Time elapsed: 0.001 sec  <<< FAILURE!
junit.framework.ComparisonFailure: expected:<1-[2]> but was:<1-[]>
	at junit.framework.Assert.assertEquals(Assert.java:81)
	at junit.framework.Assert.assertEquals(Assert.java:87)
	at org.joda.time.format.TestPeriodFormatterBuilder.testFormatAppend_PrinterParser_PrinterParser(TestPeriodFormatterBuilder.java:1115)

testFormatMonths(org.joda.time.format.TestPeriodFormatterBuilder)  Time elapsed: 0.001 sec  <<< FAILURE!
junit.framework.ComparisonFailure: expected:<[2]> but was:<[]>
	at junit.framework.Assert.assertEquals(Assert.java:81)
	at junit.framework.Assert.assertEquals(Assert.java:87)
	at org.joda.time.format.TestPeriodFormatterBuilder.testFormatMonths(TestPeriodFormatterBuilder.java:121)

testMonthsAndMinutesAreConsideredSeparateAndCaseIsNotIgnored(org.joda.time.format.TestPeriodFormatterBuilder)  Time elapsed: 0 sec  <<< FAILURE!
junit.framework.ComparisonFailure: expected:<[1M]> but was:<[]>
	at junit.framework.Assert.assertEquals(Assert.java:81)
	at junit.framework.Assert.assertEquals(Assert.java:87)
	at org.joda.time.format.TestPeriodFormatterBuilder.testMonthsAndMinutesAreConsideredSeparateAndCaseIsNotIgnored(TestPeriodFormatterBuilder.java:1178)


Results :

Failed tests: 
  org.joda.time.TestMutablePeriod_Basics#testToString ComparisonFailure expected...
  org.joda.time.TestPeriod_Basics#testToString ComparisonFailure expected:<P1Y[2...
  org.joda.time.TestPeriod_Basics#testToString_PeriodFormatter ComparisonFailure
  org.joda.time.TestPeriod_Basics#testToString_nullPeriodFormatter ComparisonFailure
  org.joda.time.TestStringConvert#testMutablePeriod ComparisonFailure expected:<...
  org.joda.time.TestStringConvert#testPeriod ComparisonFailure expected:<P1Y[2M]...
  org.joda.time.format.TestISOPeriodFormat#testFormatAlternate ComparisonFailure
  org.joda.time.format.TestISOPeriodFormat#testFormatAlternateExtended ComparisonFailure
  org.joda.time.format.TestISOPeriodFormat#testFormatStandard ComparisonFailure ...
  org.joda.time.format.TestISOPeriodFormat#testFormatStandard_negative ComparisonFailure
  org.joda.time.format.TestPeriodFormat#test_wordBased_da_formatMultiple ComparisonFailure
  org.joda.time.format.TestPeriodFormat#test_wordBased_da_formatSinglular ComparisonFailure
  org.joda.time.format.TestPeriodFormat#test_wordBased_ja_formatMultiple ComparisonFailure
  org.joda.time.format.TestPeriodFormat#test_wordBased_ja_formatSingular ComparisonFailure
  org.joda.time.format.TestPeriodFormat#test_wordBased_pl_regEx ComparisonFailure
  org.joda.time.format.TestPeriodFormatter#testPrint_bufferMethods ComparisonFailure
  org.joda.time.format.TestPeriodFormatter#testPrint_simple ComparisonFailure ex...
  org.joda.time.format.TestPeriodFormatter#testPrint_writerMethods ComparisonFailure
  org.joda.time.format.TestPeriodFormatterBuilder#testFormatAppend_PrinterParser_PrinterParser ComparisonFailure
  org.joda.time.format.TestPeriodFormatterBuilder#testFormatAppend_PrinterParser_Printer_null ComparisonFailure
  org.joda.time.format.TestPeriodFormatterBuilder#testFormatMonths ComparisonFailure
  org.joda.time.format.TestPeriodFormatterBuilder#testFormatPrintZeroAlways ComparisonFailure
  org.joda.time.format.TestPeriodFormatterBuilder#testFormatPrintZeroDefault ComparisonFailure
  org.joda.time.format.TestPeriodFormatterBuilder#testFormatPrintZeroIfSupported ComparisonFailure
  org.joda.time.format.TestPeriodFormatterBuilder#testFormatPrintZeroNever ComparisonFailure
  org.joda.time.format.TestPeriodFormatterBuilder#testFormatPrintZeroRarelyFirst ComparisonFailure
  org.joda.time.format.TestPeriodFormatterBuilder#testFormatPrintZeroRarelyLast ComparisonFailure
  org.joda.time.format.TestPeriodFormatterBuilder#testMonthsAndMinutesAreConsideredSeparateAndCaseIsNotIgnored ComparisonFailure
Tests in error: 
  org.joda.time.TestPeriod_Basics#testGet ArrayIndexOutOfBoundsException -1
  org.joda.time.TestPeriod_Basics#testMinus ArrayIndexOutOfBoundsException -1
  org.joda.time.TestPeriod_Basics#testPlus ArrayIndexOutOfBoundsException -1
  org.joda.time.format.TestISOPeriodFormat#testFormatAlternateExtendedWithWeeks ArrayIndexOutOfBoundsException
  org.joda.time.format.TestISOPeriodFormat#testFormatAlternateWithWeeks ArrayIndexOutOfBoundsException

Tests run: 4157, Failures: 28, Errors: 5, Skipped: 0

[INFO] ------------------------------------------------------------------------
[INFO] BUILD FAILURE
[INFO] ------------------------------------------------------------------------
[INFO] Total time: 15.397s
[INFO] Finished at: Wed Aug 05 20:58:40 BST 2015
[INFO] Final Memory: 9M/213M
[INFO] ------------------------------------------------------------------------
[ERROR] Failed to execute goal org.apache.maven.plugins:maven-surefire-plugin:2.18.1:test (default-test) on project joda-time: There are test failures.
[ERROR] 
[ERROR] Please refer to /home/perham/Study/LittleDarwin/Cases/joda-time-2.8.1/target/surefire-reports for the individual test results.
[ERROR] -> [Help 1]
[ERROR] 
[ERROR] To see the full stack trace of the errors, re-run Maven with the -e switch.
[ERROR] Re-run Maven using the -X switch to enable full debug logging.
[ERROR] 
[ERROR] For more information about the errors and possible solutions, please read the following articles:
[ERROR] [Help 1] http://cwiki.apache.org/confluence/display/MAVEN/MojoFailureException
