[INFO] Scanning for projects...
[INFO]                                                                         
[INFO] ------------------------------------------------------------------------
[INFO] Building Joda-Time 2.8.1
[INFO] ------------------------------------------------------------------------
[INFO] 
[INFO] --- maven-resources-plugin:2.7:resources (default-resources) @ joda-time ---
[INFO] Using 'UTF-8' encoding to copy filtered resources.
[INFO] Copying 2 resources to META-INF
[INFO] Copying 10 resources
[INFO] 
[INFO] --- maven-compiler-plugin:3.3:compile (default-compile) @ joda-time ---
[INFO] Changes detected - recompiling the module!
[INFO] Compiling 166 source files to /home/perham/Study/LittleDarwin/Cases/joda-time-2.8.1/target/classes
[INFO] 
[INFO] --- exec-maven-plugin:1.4.0:java (compile-tzdb) @ joda-time ---
Writing zoneinfo files
Writing ZoneInfoMap
[INFO] 
[INFO] --- maven-resources-plugin:2.7:testResources (default-testResources) @ joda-time ---
[INFO] Using 'UTF-8' encoding to copy filtered resources.
[INFO] Copying 34 resources
[INFO] 
[INFO] --- maven-compiler-plugin:3.3:testCompile (default-testCompile) @ joda-time ---
[INFO] Nothing to compile - all classes are up to date
[INFO] 
[INFO] --- maven-surefire-plugin:2.18.1:test (default-test) @ joda-time ---
[INFO] Surefire report directory: /home/perham/Study/LittleDarwin/Cases/joda-time-2.8.1/target/surefire-reports

-------------------------------------------------------
 T E S T S
-------------------------------------------------------
Running org.joda.time.TestAllPackages

TestBuddhistChronology.testCalendar

TestCopticChronology.testCalendar

TestEthiopicChronology.testCalendar

TestIslamicChronology.testCalendar

Testing Gregorian chronology over 1000 iterations
100% complete (i=1000)

Testing Julian chronology over 1000 iterations
100% complete (i=1000)
Writing zoneinfo files
Writing ZoneInfoMap
Tests run: 4157, Failures: 0, Errors: 122, Skipped: 0, Time elapsed: 5.475 sec <<< FAILURE! - in org.joda.time.TestAllPackages
testToPeriod_PeriodType(org.joda.time.TestDuration_Basics)  Time elapsed: 0.005 sec  <<< ERROR!
java.lang.ArrayIndexOutOfBoundsException: -1
	at org.joda.time.base.BasePeriod.getValue(BasePeriod.java:329)
	at org.joda.time.base.AbstractPeriod.equals(AbstractPeriod.java:42)
	at junit.framework.Assert.assertEquals(Assert.java:62)
	at junit.framework.Assert.assertEquals(Assert.java:71)
	at org.joda.time.TestDuration_Basics.testToPeriod_PeriodType(TestDuration_Basics.java:503)

testToPeriod_Chronology(org.joda.time.TestDuration_Basics)  Time elapsed: 0 sec  <<< ERROR!
java.lang.ArrayIndexOutOfBoundsException: -1
	at org.joda.time.base.BasePeriod.getValue(BasePeriod.java:329)
	at org.joda.time.base.AbstractPeriod.equals(AbstractPeriod.java:42)
	at junit.framework.Assert.assertEquals(Assert.java:62)
	at junit.framework.Assert.assertEquals(Assert.java:71)
	at org.joda.time.TestDuration_Basics.testToPeriod_Chronology(TestDuration_Basics.java:516)

testToPeriod_PeriodType_Chronology(org.joda.time.TestDuration_Basics)  Time elapsed: 0.001 sec  <<< ERROR!
java.lang.ArrayIndexOutOfBoundsException: -1
	at org.joda.time.base.BasePeriod.getValue(BasePeriod.java:329)
	at org.joda.time.base.AbstractPeriod.equals(AbstractPeriod.java:42)
	at junit.framework.Assert.assertEquals(Assert.java:62)
	at junit.framework.Assert.assertEquals(Assert.java:71)
	at org.joda.time.TestDuration_Basics.testToPeriod_PeriodType_Chronology(TestDuration_Basics.java:529)

testToPeriodFrom(org.joda.time.TestDuration_Basics)  Time elapsed: 0.002 sec  <<< ERROR!
java.lang.ArrayIndexOutOfBoundsException: -1
	at org.joda.time.base.BasePeriod.getValue(BasePeriod.java:329)
	at org.joda.time.base.AbstractPeriod.equals(AbstractPeriod.java:42)
	at junit.framework.Assert.assertEquals(Assert.java:62)
	at junit.framework.Assert.assertEquals(Assert.java:71)
	at org.joda.time.TestDuration_Basics.testToPeriodFrom(TestDuration_Basics.java:543)

testToPeriodFrom_PeriodType(org.joda.time.TestDuration_Basics)  Time elapsed: 0.001 sec  <<< ERROR!
java.lang.ArrayIndexOutOfBoundsException: -1
	at org.joda.time.base.BasePeriod.getValue(BasePeriod.java:329)
	at org.joda.time.base.AbstractPeriod.equals(AbstractPeriod.java:42)
	at junit.framework.Assert.assertEquals(Assert.java:62)
	at junit.framework.Assert.assertEquals(Assert.java:71)
	at org.joda.time.TestDuration_Basics.testToPeriodFrom_PeriodType(TestDuration_Basics.java:556)

testToPeriodTo(org.joda.time.TestDuration_Basics)  Time elapsed: 0.001 sec  <<< ERROR!
java.lang.ArrayIndexOutOfBoundsException: -1
	at org.joda.time.base.BasePeriod.getValue(BasePeriod.java:329)
	at org.joda.time.base.AbstractPeriod.equals(AbstractPeriod.java:42)
	at junit.framework.Assert.assertEquals(Assert.java:62)
	at junit.framework.Assert.assertEquals(Assert.java:71)
	at org.joda.time.TestDuration_Basics.testToPeriodTo(TestDuration_Basics.java:569)

testToPeriodTo_PeriodType(org.joda.time.TestDuration_Basics)  Time elapsed: 0.001 sec  <<< ERROR!
java.lang.ArrayIndexOutOfBoundsException: -1
	at org.joda.time.base.BasePeriod.getValue(BasePeriod.java:329)
	at org.joda.time.base.AbstractPeriod.equals(AbstractPeriod.java:42)
	at junit.framework.Assert.assertEquals(Assert.java:62)
	at junit.framework.Assert.assertEquals(Assert.java:71)
	at org.joda.time.TestDuration_Basics.testToPeriodTo_PeriodType(TestDuration_Basics.java:582)

testToPeriod_PeriodType1(org.joda.time.TestInterval_Basics)  Time elapsed: 0.001 sec  <<< ERROR!
java.lang.ArrayIndexOutOfBoundsException: -1
	at org.joda.time.base.BasePeriod.getValue(BasePeriod.java:329)
	at org.joda.time.base.AbstractPeriod.equals(AbstractPeriod.java:42)
	at junit.framework.Assert.assertEquals(Assert.java:62)
	at junit.framework.Assert.assertEquals(Assert.java:71)
	at org.joda.time.TestInterval_Basics.testToPeriod_PeriodType1(TestInterval_Basics.java:1010)

testToPeriod_PeriodType2(org.joda.time.TestInterval_Basics)  Time elapsed: 0.002 sec  <<< ERROR!
java.lang.ArrayIndexOutOfBoundsException: -1
	at org.joda.time.base.BasePeriod.getValue(BasePeriod.java:329)
	at org.joda.time.base.AbstractPeriod.equals(AbstractPeriod.java:42)
	at junit.framework.Assert.assertEquals(Assert.java:62)
	at junit.framework.Assert.assertEquals(Assert.java:71)
	at org.joda.time.TestInterval_Basics.testToPeriod_PeriodType2(TestInterval_Basics.java:1020)

testToPeriod(org.joda.time.TestInterval_Basics)  Time elapsed: 0.001 sec  <<< ERROR!
java.lang.ArrayIndexOutOfBoundsException: -1
	at org.joda.time.base.BasePeriod.getValue(BasePeriod.java:329)
	at org.joda.time.base.AbstractPeriod.equals(AbstractPeriod.java:42)
	at junit.framework.Assert.assertEquals(Assert.java:62)
	at junit.framework.Assert.assertEquals(Assert.java:71)
	at org.joda.time.TestInterval_Basics.testToPeriod(TestInterval_Basics.java:999)

testToPeriod_PeriodType1(org.joda.time.TestMutableInterval_Basics)  Time elapsed: 0.002 sec  <<< ERROR!
java.lang.ArrayIndexOutOfBoundsException: -1
	at org.joda.time.base.BasePeriod.getValue(BasePeriod.java:329)
	at org.joda.time.base.AbstractPeriod.equals(AbstractPeriod.java:42)
	at junit.framework.Assert.assertEquals(Assert.java:62)
	at junit.framework.Assert.assertEquals(Assert.java:71)
	at org.joda.time.TestMutableInterval_Basics.testToPeriod_PeriodType1(TestMutableInterval_Basics.java:435)

testToPeriod_PeriodType2(org.joda.time.TestMutableInterval_Basics)  Time elapsed: 0 sec  <<< ERROR!
java.lang.ArrayIndexOutOfBoundsException: -1
	at org.joda.time.base.BasePeriod.getValue(BasePeriod.java:329)
	at org.joda.time.base.AbstractPeriod.equals(AbstractPeriod.java:42)
	at junit.framework.Assert.assertEquals(Assert.java:62)
	at junit.framework.Assert.assertEquals(Assert.java:71)
	at org.joda.time.TestMutableInterval_Basics.testToPeriod_PeriodType2(TestMutableInterval_Basics.java:445)

testToPeriod(org.joda.time.TestMutableInterval_Basics)  Time elapsed: 0.001 sec  <<< ERROR!
java.lang.ArrayIndexOutOfBoundsException: -1
	at org.joda.time.base.BasePeriod.getValue(BasePeriod.java:329)
	at org.joda.time.base.AbstractPeriod.equals(AbstractPeriod.java:42)
	at junit.framework.Assert.assertEquals(Assert.java:62)
	at junit.framework.Assert.assertEquals(Assert.java:71)
	at org.joda.time.TestMutableInterval_Basics.testToPeriod(TestMutableInterval_Basics.java:424)

testParse_noFormatter(org.joda.time.TestPeriod_Constructors)  Time elapsed: 0 sec  <<< ERROR!
java.lang.ArrayIndexOutOfBoundsException: -1
	at org.joda.time.base.BasePeriod.getValue(BasePeriod.java:329)
	at org.joda.time.base.AbstractPeriod.equals(AbstractPeriod.java:42)
	at junit.framework.Assert.assertEquals(Assert.java:62)
	at junit.framework.Assert.assertEquals(Assert.java:71)
	at org.joda.time.TestPeriod_Constructors.testParse_noFormatter(TestPeriod_Constructors.java:104)

testConstructor_trickyDifferences_RI_RI_toFeb_standardYear(org.joda.time.TestPeriod_Constructors)  Time elapsed: 0.001 sec  <<< ERROR!
java.lang.ArrayIndexOutOfBoundsException: -1
	at org.joda.time.base.BasePeriod.getValue(BasePeriod.java:329)
	at org.joda.time.base.AbstractPeriod.equals(AbstractPeriod.java:42)
	at junit.framework.Assert.assertEquals(Assert.java:62)
	at junit.framework.Assert.assertEquals(Assert.java:71)
	at org.joda.time.TestPeriod_Constructors.testConstructor_trickyDifferences_RI_RI_toFeb_standardYear(TestPeriod_Constructors.java:1364)

testConstructor_trickyDifferences_RI_RI_toFeb_leapYear(org.joda.time.TestPeriod_Constructors)  Time elapsed: 0.001 sec  <<< ERROR!
java.lang.ArrayIndexOutOfBoundsException: -1
	at org.joda.time.base.BasePeriod.getValue(BasePeriod.java:329)
	at org.joda.time.base.AbstractPeriod.equals(AbstractPeriod.java:42)
	at junit.framework.Assert.assertEquals(Assert.java:62)
	at junit.framework.Assert.assertEquals(Assert.java:71)
	at org.joda.time.TestPeriod_Constructors.testConstructor_trickyDifferences_RI_RI_toFeb_leapYear(TestPeriod_Constructors.java:1372)

testConstructor_trickyDifferences_RI_RI_toFeb_exactMonths(org.joda.time.TestPeriod_Constructors)  Time elapsed: 0 sec  <<< ERROR!
java.lang.ArrayIndexOutOfBoundsException: -1
	at org.joda.time.base.BasePeriod.getValue(BasePeriod.java:329)
	at org.joda.time.base.AbstractPeriod.equals(AbstractPeriod.java:42)
	at junit.framework.Assert.assertEquals(Assert.java:62)
	at junit.framework.Assert.assertEquals(Assert.java:71)
	at org.joda.time.TestPeriod_Constructors.testConstructor_trickyDifferences_RI_RI_toFeb_exactMonths(TestPeriod_Constructors.java:1380)

testConstructor_trickyDifferences_RI_RI_toFeb_endOfMonth1(org.joda.time.TestPeriod_Constructors)  Time elapsed: 0.001 sec  <<< ERROR!
java.lang.ArrayIndexOutOfBoundsException: -1
	at org.joda.time.base.BasePeriod.getValue(BasePeriod.java:329)
	at org.joda.time.base.AbstractPeriod.equals(AbstractPeriod.java:42)
	at junit.framework.Assert.assertEquals(Assert.java:62)
	at junit.framework.Assert.assertEquals(Assert.java:71)
	at org.joda.time.TestPeriod_Constructors.testConstructor_trickyDifferences_RI_RI_toFeb_endOfMonth1(TestPeriod_Constructors.java:1388)

testConstructor_trickyDifferences_RI_RI_toFeb_endOfMonth2(org.joda.time.TestPeriod_Constructors)  Time elapsed: 0 sec  <<< ERROR!
java.lang.ArrayIndexOutOfBoundsException: -1
	at org.joda.time.base.BasePeriod.getValue(BasePeriod.java:329)
	at org.joda.time.base.AbstractPeriod.equals(AbstractPeriod.java:42)
	at junit.framework.Assert.assertEquals(Assert.java:62)
	at junit.framework.Assert.assertEquals(Assert.java:71)
	at org.joda.time.TestPeriod_Constructors.testConstructor_trickyDifferences_RI_RI_toFeb_endOfMonth2(TestPeriod_Constructors.java:1396)

testConstructor_trickyDifferences_RI_RI_toFeb_endOfMonth3(org.joda.time.TestPeriod_Constructors)  Time elapsed: 0.001 sec  <<< ERROR!
java.lang.ArrayIndexOutOfBoundsException: -1
	at org.joda.time.base.BasePeriod.getValue(BasePeriod.java:329)
	at org.joda.time.base.AbstractPeriod.equals(AbstractPeriod.java:42)
	at junit.framework.Assert.assertEquals(Assert.java:62)
	at junit.framework.Assert.assertEquals(Assert.java:71)
	at org.joda.time.TestPeriod_Constructors.testConstructor_trickyDifferences_RI_RI_toFeb_endOfMonth3(TestPeriod_Constructors.java:1404)

testConstructor_trickyDifferences_RI_RI_toMar_endOfMonth1(org.joda.time.TestPeriod_Constructors)  Time elapsed: 0.005 sec  <<< ERROR!
java.lang.ArrayIndexOutOfBoundsException: -1
	at org.joda.time.base.BasePeriod.getValue(BasePeriod.java:329)
	at org.joda.time.base.AbstractPeriod.equals(AbstractPeriod.java:42)
	at junit.framework.Assert.assertEquals(Assert.java:62)
	at junit.framework.Assert.assertEquals(Assert.java:71)
	at org.joda.time.TestPeriod_Constructors.testConstructor_trickyDifferences_RI_RI_toMar_endOfMonth1(TestPeriod_Constructors.java:1412)

testConstructor_trickyDifferences_RI_RI_toMar_endOfMonth2(org.joda.time.TestPeriod_Constructors)  Time elapsed: 0 sec  <<< ERROR!
java.lang.ArrayIndexOutOfBoundsException: -1
	at org.joda.time.base.BasePeriod.getValue(BasePeriod.java:329)
	at org.joda.time.base.AbstractPeriod.equals(AbstractPeriod.java:42)
	at junit.framework.Assert.assertEquals(Assert.java:62)
	at junit.framework.Assert.assertEquals(Assert.java:71)
	at org.joda.time.TestPeriod_Constructors.testConstructor_trickyDifferences_RI_RI_toMar_endOfMonth2(TestPeriod_Constructors.java:1420)

testConstructor_trickyDifferences_LD_LD_toFeb_standardYear(org.joda.time.TestPeriod_Constructors)  Time elapsed: 0 sec  <<< ERROR!
java.lang.ArrayIndexOutOfBoundsException: -1
	at org.joda.time.base.BasePeriod.getValue(BasePeriod.java:329)
	at org.joda.time.base.AbstractPeriod.equals(AbstractPeriod.java:42)
	at junit.framework.Assert.assertEquals(Assert.java:62)
	at junit.framework.Assert.assertEquals(Assert.java:71)
	at org.joda.time.TestPeriod_Constructors.testConstructor_trickyDifferences_LD_LD_toFeb_standardYear(TestPeriod_Constructors.java:1429)

testConstructor_trickyDifferences_LD_LD_toFeb_leapYear(org.joda.time.TestPeriod_Constructors)  Time elapsed: 0 sec  <<< ERROR!
java.lang.ArrayIndexOutOfBoundsException: -1
	at org.joda.time.base.BasePeriod.getValue(BasePeriod.java:329)
	at org.joda.time.base.AbstractPeriod.equals(AbstractPeriod.java:42)
	at junit.framework.Assert.assertEquals(Assert.java:62)
	at junit.framework.Assert.assertEquals(Assert.java:71)
	at org.joda.time.TestPeriod_Constructors.testConstructor_trickyDifferences_LD_LD_toFeb_leapYear(TestPeriod_Constructors.java:1437)

testConstructor_trickyDifferences_LD_LD_toFeb_exactMonths(org.joda.time.TestPeriod_Constructors)  Time elapsed: 0 sec  <<< ERROR!
java.lang.ArrayIndexOutOfBoundsException: -1
	at org.joda.time.base.BasePeriod.getValue(BasePeriod.java:329)
	at org.joda.time.base.AbstractPeriod.equals(AbstractPeriod.java:42)
	at junit.framework.Assert.assertEquals(Assert.java:62)
	at junit.framework.Assert.assertEquals(Assert.java:71)
	at org.joda.time.TestPeriod_Constructors.testConstructor_trickyDifferences_LD_LD_toFeb_exactMonths(TestPeriod_Constructors.java:1445)

testConstructor_trickyDifferences_LD_LD_toFeb_endOfMonth1(org.joda.time.TestPeriod_Constructors)  Time elapsed: 0 sec  <<< ERROR!
java.lang.ArrayIndexOutOfBoundsException: -1
	at org.joda.time.base.BasePeriod.getValue(BasePeriod.java:329)
	at org.joda.time.base.AbstractPeriod.equals(AbstractPeriod.java:42)
	at junit.framework.Assert.assertEquals(Assert.java:62)
	at junit.framework.Assert.assertEquals(Assert.java:71)
	at org.joda.time.TestPeriod_Constructors.testConstructor_trickyDifferences_LD_LD_toFeb_endOfMonth1(TestPeriod_Constructors.java:1453)

testConstructor_trickyDifferences_LD_LD_toFeb_endOfMonth2(org.joda.time.TestPeriod_Constructors)  Time elapsed: 0 sec  <<< ERROR!
java.lang.ArrayIndexOutOfBoundsException: -1
	at org.joda.time.base.BasePeriod.getValue(BasePeriod.java:329)
	at org.joda.time.base.AbstractPeriod.equals(AbstractPeriod.java:42)
	at junit.framework.Assert.assertEquals(Assert.java:62)
	at junit.framework.Assert.assertEquals(Assert.java:71)
	at org.joda.time.TestPeriod_Constructors.testConstructor_trickyDifferences_LD_LD_toFeb_endOfMonth2(TestPeriod_Constructors.java:1461)

testConstructor_trickyDifferences_LD_LD_toFeb_endOfMonth3(org.joda.time.TestPeriod_Constructors)  Time elapsed: 0 sec  <<< ERROR!
java.lang.ArrayIndexOutOfBoundsException: -1
	at org.joda.time.base.BasePeriod.getValue(BasePeriod.java:329)
	at org.joda.time.base.AbstractPeriod.equals(AbstractPeriod.java:42)
	at junit.framework.Assert.assertEquals(Assert.java:62)
	at junit.framework.Assert.assertEquals(Assert.java:71)
	at org.joda.time.TestPeriod_Constructors.testConstructor_trickyDifferences_LD_LD_toFeb_endOfMonth3(TestPeriod_Constructors.java:1469)

testConstructor_trickyDifferences_LD_LD_toMar_endOfMonth1(org.joda.time.TestPeriod_Constructors)  Time elapsed: 0 sec  <<< ERROR!
java.lang.ArrayIndexOutOfBoundsException: -1
	at org.joda.time.base.BasePeriod.getValue(BasePeriod.java:329)
	at org.joda.time.base.AbstractPeriod.equals(AbstractPeriod.java:42)
	at junit.framework.Assert.assertEquals(Assert.java:62)
	at junit.framework.Assert.assertEquals(Assert.java:71)
	at org.joda.time.TestPeriod_Constructors.testConstructor_trickyDifferences_LD_LD_toMar_endOfMonth1(TestPeriod_Constructors.java:1477)

testConstructor_trickyDifferences_LD_LD_toMar_endOfMonth2(org.joda.time.TestPeriod_Constructors)  Time elapsed: 0.001 sec  <<< ERROR!
java.lang.ArrayIndexOutOfBoundsException: -1
	at org.joda.time.base.BasePeriod.getValue(BasePeriod.java:329)
	at org.joda.time.base.AbstractPeriod.equals(AbstractPeriod.java:42)
	at junit.framework.Assert.assertEquals(Assert.java:62)
	at junit.framework.Assert.assertEquals(Assert.java:71)
	at org.joda.time.TestPeriod_Constructors.testConstructor_trickyDifferences_LD_LD_toMar_endOfMonth2(TestPeriod_Constructors.java:1485)

testSerialization(org.joda.time.TestPeriod_Basics)  Time elapsed: 0.018 sec  <<< ERROR!
java.lang.ArrayIndexOutOfBoundsException: -1
	at org.joda.time.base.BasePeriod.getValue(BasePeriod.java:329)
	at org.joda.time.base.AbstractPeriod.equals(AbstractPeriod.java:42)
	at junit.framework.Assert.assertEquals(Assert.java:62)
	at junit.framework.Assert.assertEquals(Assert.java:71)
	at org.joda.time.TestPeriod_Basics.testSerialization(TestPeriod_Basics.java:241)

testWithField1(org.joda.time.TestPeriod_Basics)  Time elapsed: 0.001 sec  <<< ERROR!
java.lang.ArrayIndexOutOfBoundsException: -1
	at org.joda.time.base.BasePeriod.getValue(BasePeriod.java:329)
	at org.joda.time.base.AbstractPeriod.equals(AbstractPeriod.java:42)
	at junit.framework.Assert.assertEquals(Assert.java:62)
	at junit.framework.Assert.assertEquals(Assert.java:71)
	at org.joda.time.TestPeriod_Basics.testWithField1(TestPeriod_Basics.java:605)

testWithFieldAdded1(org.joda.time.TestPeriod_Basics)  Time elapsed: 0.001 sec  <<< ERROR!
java.lang.ArrayIndexOutOfBoundsException: -1
	at org.joda.time.base.BasePeriod.getValue(BasePeriod.java:329)
	at org.joda.time.base.AbstractPeriod.equals(AbstractPeriod.java:42)
	at junit.framework.Assert.assertEquals(Assert.java:62)
	at junit.framework.Assert.assertEquals(Assert.java:71)
	at org.joda.time.TestPeriod_Basics.testWithFieldAdded1(TestPeriod_Basics.java:636)

testEqualsHashCode(org.joda.time.TestPeriod_Basics)  Time elapsed: 0.001 sec  <<< ERROR!
java.lang.ArrayIndexOutOfBoundsException: -1
	at org.joda.time.base.BasePeriod.getValue(BasePeriod.java:329)
	at org.joda.time.base.AbstractPeriod.equals(AbstractPeriod.java:42)
	at org.joda.time.TestPeriod_Basics.testEqualsHashCode(TestPeriod_Basics.java:198)

testToMutablePeriod(org.joda.time.TestPeriod_Basics)  Time elapsed: 0 sec  <<< ERROR!
java.lang.ArrayIndexOutOfBoundsException: -1
	at org.joda.time.base.BasePeriod.getValue(BasePeriod.java:329)
	at org.joda.time.base.AbstractPeriod.equals(AbstractPeriod.java:42)
	at junit.framework.Assert.assertEquals(Assert.java:62)
	at junit.framework.Assert.assertEquals(Assert.java:71)
	at org.joda.time.TestPeriod_Basics.testToMutablePeriod(TestPeriod_Basics.java:505)

testWithFields1(org.joda.time.TestPeriod_Basics)  Time elapsed: 0.001 sec  <<< ERROR!
java.lang.ArrayIndexOutOfBoundsException: -1
	at org.joda.time.base.BasePeriod.getValue(BasePeriod.java:329)
	at org.joda.time.base.AbstractPeriod.equals(AbstractPeriod.java:42)
	at junit.framework.Assert.assertEquals(Assert.java:62)
	at junit.framework.Assert.assertEquals(Assert.java:71)
	at org.joda.time.TestPeriod_Basics.testWithFields1(TestPeriod_Basics.java:575)

testWithFields2(org.joda.time.TestPeriod_Basics)  Time elapsed: 0 sec  <<< ERROR!
java.lang.ArrayIndexOutOfBoundsException: -1
	at org.joda.time.base.BasePeriod.getValue(BasePeriod.java:329)
	at org.joda.time.base.AbstractPeriod.equals(AbstractPeriod.java:42)
	at junit.framework.Assert.assertEquals(Assert.java:62)
	at junit.framework.Assert.assertEquals(Assert.java:71)
	at org.joda.time.TestPeriod_Basics.testWithFields2(TestPeriod_Basics.java:585)

testWithFields3(org.joda.time.TestPeriod_Basics)  Time elapsed: 0.001 sec  <<< ERROR!
java.lang.ArrayIndexOutOfBoundsException: -1
	at org.joda.time.base.BasePeriod.getValue(BasePeriod.java:329)
	at org.joda.time.base.AbstractPeriod.equals(AbstractPeriod.java:42)
	at junit.framework.Assert.assertEquals(Assert.java:62)
	at junit.framework.Assert.assertEquals(Assert.java:71)
	at org.joda.time.TestPeriod_Basics.testWithFields3(TestPeriod_Basics.java:596)

testWithField4(org.joda.time.TestPeriod_Basics)  Time elapsed: 0 sec  <<< ERROR!
java.lang.ArrayIndexOutOfBoundsException: -1
	at org.joda.time.base.BasePeriod.getValue(BasePeriod.java:329)
	at org.joda.time.base.AbstractPeriod.equals(AbstractPeriod.java:42)
	at junit.framework.Assert.assertEquals(Assert.java:62)
	at junit.framework.Assert.assertEquals(Assert.java:71)
	at org.joda.time.TestPeriod_Basics.testWithField4(TestPeriod_Basics.java:628)

testPeriodStatics(org.joda.time.TestPeriod_Basics)  Time elapsed: 0 sec  <<< ERROR!
java.lang.ArrayIndexOutOfBoundsException: -1
	at org.joda.time.base.BasePeriod.getValue(BasePeriod.java:329)
	at org.joda.time.base.AbstractPeriod.equals(AbstractPeriod.java:42)
	at junit.framework.Assert.assertEquals(Assert.java:62)
	at junit.framework.Assert.assertEquals(Assert.java:71)
	at org.joda.time.TestPeriod_Basics.testPeriodStatics(TestPeriod_Basics.java:666)

testWith(org.joda.time.TestPeriod_Basics)  Time elapsed: 0 sec  <<< ERROR!
java.lang.ArrayIndexOutOfBoundsException: -1
	at org.joda.time.base.BasePeriod.getValue(BasePeriod.java:329)
	at org.joda.time.base.AbstractPeriod.equals(AbstractPeriod.java:42)
	at junit.framework.Assert.assertEquals(Assert.java:62)
	at junit.framework.Assert.assertEquals(Assert.java:71)
	at org.joda.time.TestPeriod_Basics.testWith(TestPeriod_Basics.java:687)

testPlusFields(org.joda.time.TestPeriod_Basics)  Time elapsed: 0.001 sec  <<< ERROR!
java.lang.ArrayIndexOutOfBoundsException: -1
	at org.joda.time.base.BasePeriod.getValue(BasePeriod.java:329)
	at org.joda.time.base.AbstractPeriod.equals(AbstractPeriod.java:42)
	at junit.framework.Assert.assertEquals(Assert.java:62)
	at junit.framework.Assert.assertEquals(Assert.java:71)
	at org.joda.time.TestPeriod_Basics.testPlusFields(TestPeriod_Basics.java:862)

testMinusFields(org.joda.time.TestPeriod_Basics)  Time elapsed: 0 sec  <<< ERROR!
java.lang.ArrayIndexOutOfBoundsException: -1
	at org.joda.time.base.BasePeriod.getValue(BasePeriod.java:329)
	at org.joda.time.base.AbstractPeriod.equals(AbstractPeriod.java:42)
	at junit.framework.Assert.assertEquals(Assert.java:62)
	at junit.framework.Assert.assertEquals(Assert.java:71)
	at org.joda.time.TestPeriod_Basics.testMinusFields(TestPeriod_Basics.java:916)

testMultipliedBy(org.joda.time.TestPeriod_Basics)  Time elapsed: 0 sec  <<< ERROR!
java.lang.ArrayIndexOutOfBoundsException: -1
	at org.joda.time.base.BasePeriod.getValue(BasePeriod.java:329)
	at org.joda.time.base.AbstractPeriod.equals(AbstractPeriod.java:42)
	at junit.framework.Assert.assertEquals(Assert.java:62)
	at junit.framework.Assert.assertEquals(Assert.java:71)
	at org.joda.time.TestPeriod_Basics.testMultipliedBy(TestPeriod_Basics.java:947)

testNormalizedStandard_yearMonth1(org.joda.time.TestPeriod_Basics)  Time elapsed: 0.001 sec  <<< ERROR!
java.lang.ArrayIndexOutOfBoundsException: -1
	at org.joda.time.base.BasePeriod.getValue(BasePeriod.java:329)
	at org.joda.time.base.AbstractPeriod.equals(AbstractPeriod.java:42)
	at junit.framework.Assert.assertEquals(Assert.java:62)
	at junit.framework.Assert.assertEquals(Assert.java:71)
	at org.joda.time.TestPeriod_Basics.testNormalizedStandard_yearMonth1(TestPeriod_Basics.java:1405)

testNormalizedStandard_weekDay1(org.joda.time.TestPeriod_Basics)  Time elapsed: 0.001 sec  <<< ERROR!
java.lang.ArrayIndexOutOfBoundsException: -1
	at org.joda.time.base.BasePeriod.getValue(BasePeriod.java:329)
	at org.joda.time.base.AbstractPeriod.equals(AbstractPeriod.java:42)
	at junit.framework.Assert.assertEquals(Assert.java:62)
	at junit.framework.Assert.assertEquals(Assert.java:71)
	at org.joda.time.TestPeriod_Basics.testNormalizedStandard_weekDay1(TestPeriod_Basics.java:1420)

testNormalizedStandard_yearMonthWeekDay(org.joda.time.TestPeriod_Basics)  Time elapsed: 0 sec  <<< ERROR!
java.lang.ArrayIndexOutOfBoundsException: -1
	at org.joda.time.base.BasePeriod.getValue(BasePeriod.java:329)
	at org.joda.time.base.AbstractPeriod.equals(AbstractPeriod.java:42)
	at junit.framework.Assert.assertEquals(Assert.java:62)
	at junit.framework.Assert.assertEquals(Assert.java:71)
	at org.joda.time.TestPeriod_Basics.testNormalizedStandard_yearMonthWeekDay(TestPeriod_Basics.java:1435)

testNormalizedStandard_yearMonthDay(org.joda.time.TestPeriod_Basics)  Time elapsed: 0.001 sec  <<< ERROR!
java.lang.ArrayIndexOutOfBoundsException: -1
	at org.joda.time.base.BasePeriod.getValue(BasePeriod.java:329)
	at org.joda.time.base.AbstractPeriod.equals(AbstractPeriod.java:42)
	at junit.framework.Assert.assertEquals(Assert.java:62)
	at junit.framework.Assert.assertEquals(Assert.java:71)
	at org.joda.time.TestPeriod_Basics.testNormalizedStandard_yearMonthDay(TestPeriod_Basics.java:1442)

testNormalizedStandard_negative(org.joda.time.TestPeriod_Basics)  Time elapsed: 0 sec  <<< ERROR!
java.lang.ArrayIndexOutOfBoundsException: -1
	at org.joda.time.base.BasePeriod.getValue(BasePeriod.java:329)
	at org.joda.time.base.AbstractPeriod.equals(AbstractPeriod.java:42)
	at junit.framework.Assert.assertEquals(Assert.java:62)
	at junit.framework.Assert.assertEquals(Assert.java:71)
	at org.joda.time.TestPeriod_Basics.testNormalizedStandard_negative(TestPeriod_Basics.java:1449)

testNormalizedStandard_fullNegative(org.joda.time.TestPeriod_Basics)  Time elapsed: 0.008 sec  <<< ERROR!
java.lang.ArrayIndexOutOfBoundsException: -1
	at org.joda.time.base.BasePeriod.getValue(BasePeriod.java:329)
	at org.joda.time.base.AbstractPeriod.equals(AbstractPeriod.java:42)
	at junit.framework.Assert.assertEquals(Assert.java:62)
	at junit.framework.Assert.assertEquals(Assert.java:71)
	at org.joda.time.TestPeriod_Basics.testNormalizedStandard_fullNegative(TestPeriod_Basics.java:1456)

testNormalizedStandard_periodType_yearMonth1(org.joda.time.TestPeriod_Basics)  Time elapsed: 0.001 sec  <<< ERROR!
java.lang.ArrayIndexOutOfBoundsException: -1
	at org.joda.time.base.BasePeriod.getValue(BasePeriod.java:329)
	at org.joda.time.base.AbstractPeriod.equals(AbstractPeriod.java:42)
	at junit.framework.Assert.assertEquals(Assert.java:62)
	at junit.framework.Assert.assertEquals(Assert.java:71)
	at org.joda.time.TestPeriod_Basics.testNormalizedStandard_periodType_yearMonth1(TestPeriod_Basics.java:1464)

testNormalizedStandard_periodType_weekDay1(org.joda.time.TestPeriod_Basics)  Time elapsed: 0.004 sec  <<< ERROR!
java.lang.ArrayIndexOutOfBoundsException: -1
	at org.joda.time.base.BasePeriod.getValue(BasePeriod.java:329)
	at org.joda.time.base.AbstractPeriod.equals(AbstractPeriod.java:42)
	at junit.framework.Assert.assertEquals(Assert.java:62)
	at junit.framework.Assert.assertEquals(Assert.java:71)
	at org.joda.time.TestPeriod_Basics.testNormalizedStandard_periodType_weekDay1(TestPeriod_Basics.java:1487)

testNormalizedStandard_periodType_weekDay3(org.joda.time.TestPeriod_Basics)  Time elapsed: 0 sec  <<< ERROR!
java.lang.ArrayIndexOutOfBoundsException: -1
	at org.joda.time.base.BasePeriod.getValue(BasePeriod.java:329)
	at org.joda.time.base.AbstractPeriod.equals(AbstractPeriod.java:42)
	at junit.framework.Assert.assertEquals(Assert.java:62)
	at junit.framework.Assert.assertEquals(Assert.java:71)
	at org.joda.time.TestPeriod_Basics.testNormalizedStandard_periodType_weekDay3(TestPeriod_Basics.java:1502)

testNormalizedStandard_periodType_yearMonthWeekDay(org.joda.time.TestPeriod_Basics)  Time elapsed: 0 sec  <<< ERROR!
java.lang.ArrayIndexOutOfBoundsException: -1
	at org.joda.time.base.BasePeriod.getValue(BasePeriod.java:329)
	at org.joda.time.base.AbstractPeriod.equals(AbstractPeriod.java:42)
	at junit.framework.Assert.assertEquals(Assert.java:62)
	at junit.framework.Assert.assertEquals(Assert.java:71)
	at org.joda.time.TestPeriod_Basics.testNormalizedStandard_periodType_yearMonthWeekDay(TestPeriod_Basics.java:1509)

testNormalizedStandard_periodType_yearMonthDay(org.joda.time.TestPeriod_Basics)  Time elapsed: 0 sec  <<< ERROR!
java.lang.ArrayIndexOutOfBoundsException: -1
	at org.joda.time.base.BasePeriod.getValue(BasePeriod.java:329)
	at org.joda.time.base.AbstractPeriod.equals(AbstractPeriod.java:42)
	at junit.framework.Assert.assertEquals(Assert.java:62)
	at junit.framework.Assert.assertEquals(Assert.java:71)
	at org.joda.time.TestPeriod_Basics.testNormalizedStandard_periodType_yearMonthDay(TestPeriod_Basics.java:1516)

testNormalizedStandard_periodType_months1(org.joda.time.TestPeriod_Basics)  Time elapsed: 0 sec  <<< ERROR!
java.lang.ArrayIndexOutOfBoundsException: -1
	at org.joda.time.base.BasePeriod.getValue(BasePeriod.java:329)
	at org.joda.time.base.AbstractPeriod.equals(AbstractPeriod.java:42)
	at junit.framework.Assert.assertEquals(Assert.java:62)
	at junit.framework.Assert.assertEquals(Assert.java:71)
	at org.joda.time.TestPeriod_Basics.testNormalizedStandard_periodType_months1(TestPeriod_Basics.java:1523)

testNormalizedStandard_periodType_months2(org.joda.time.TestPeriod_Basics)  Time elapsed: 0.001 sec  <<< ERROR!
java.lang.ArrayIndexOutOfBoundsException: -1
	at org.joda.time.base.BasePeriod.getValue(BasePeriod.java:329)
	at org.joda.time.base.AbstractPeriod.equals(AbstractPeriod.java:42)
	at junit.framework.Assert.assertEquals(Assert.java:62)
	at junit.framework.Assert.assertEquals(Assert.java:71)
	at org.joda.time.TestPeriod_Basics.testNormalizedStandard_periodType_months2(TestPeriod_Basics.java:1530)

testNormalizedStandard_periodType_months3(org.joda.time.TestPeriod_Basics)  Time elapsed: 0.001 sec  <<< ERROR!
java.lang.ArrayIndexOutOfBoundsException: -1
	at org.joda.time.base.BasePeriod.getValue(BasePeriod.java:329)
	at org.joda.time.base.AbstractPeriod.equals(AbstractPeriod.java:42)
	at junit.framework.Assert.assertEquals(Assert.java:62)
	at junit.framework.Assert.assertEquals(Assert.java:71)
	at org.joda.time.TestPeriod_Basics.testNormalizedStandard_periodType_months3(TestPeriod_Basics.java:1537)

testNormalizedStandard_periodType_monthsWeeks(org.joda.time.TestPeriod_Basics)  Time elapsed: 0.001 sec  <<< ERROR!
java.lang.ArrayIndexOutOfBoundsException: -1
	at org.joda.time.base.BasePeriod.getValue(BasePeriod.java:329)
	at org.joda.time.base.AbstractPeriod.equals(AbstractPeriod.java:42)
	at junit.framework.Assert.assertEquals(Assert.java:62)
	at junit.framework.Assert.assertEquals(Assert.java:71)
	at org.joda.time.TestPeriod_Basics.testNormalizedStandard_periodType_monthsWeeks(TestPeriod_Basics.java:1558)

testParse_noFormatter(org.joda.time.TestMutablePeriod_Constructors)  Time elapsed: 0.001 sec  <<< ERROR!
java.lang.ArrayIndexOutOfBoundsException: -1
	at org.joda.time.base.BasePeriod.getValue(BasePeriod.java:329)
	at org.joda.time.base.AbstractPeriod.equals(AbstractPeriod.java:42)
	at junit.framework.Assert.assertEquals(Assert.java:62)
	at junit.framework.Assert.assertEquals(Assert.java:71)
	at org.joda.time.TestMutablePeriod_Constructors.testParse_noFormatter(TestMutablePeriod_Constructors.java:102)

testSerialization(org.joda.time.TestMutablePeriod_Basics)  Time elapsed: 0.003 sec  <<< ERROR!
java.lang.ArrayIndexOutOfBoundsException: -1
	at org.joda.time.base.BasePeriod.getValue(BasePeriod.java:329)
	at org.joda.time.base.AbstractPeriod.equals(AbstractPeriod.java:42)
	at junit.framework.Assert.assertEquals(Assert.java:62)
	at junit.framework.Assert.assertEquals(Assert.java:71)
	at org.joda.time.TestMutablePeriod_Basics.testSerialization(TestMutablePeriod_Basics.java:174)

testEqualsHashCode(org.joda.time.TestMutablePeriod_Basics)  Time elapsed: 0 sec  <<< ERROR!
java.lang.ArrayIndexOutOfBoundsException: -1
	at org.joda.time.base.BasePeriod.getValue(BasePeriod.java:329)
	at org.joda.time.base.AbstractPeriod.equals(AbstractPeriod.java:42)
	at org.joda.time.TestMutablePeriod_Basics.testEqualsHashCode(TestMutablePeriod_Basics.java:132)

testToMutablePeriod(org.joda.time.TestMutablePeriod_Basics)  Time elapsed: 0 sec  <<< ERROR!
java.lang.ArrayIndexOutOfBoundsException: -1
	at org.joda.time.base.BasePeriod.getValue(BasePeriod.java:329)
	at org.joda.time.base.AbstractPeriod.equals(AbstractPeriod.java:42)
	at junit.framework.Assert.assertEquals(Assert.java:62)
	at junit.framework.Assert.assertEquals(Assert.java:71)
	at org.joda.time.TestMutablePeriod_Basics.testToMutablePeriod(TestMutablePeriod_Basics.java:424)

testClone(org.joda.time.TestMutablePeriod_Basics)  Time elapsed: 0.001 sec  <<< ERROR!
java.lang.ArrayIndexOutOfBoundsException: -1
	at org.joda.time.base.BasePeriod.getValue(BasePeriod.java:329)
	at org.joda.time.base.AbstractPeriod.equals(AbstractPeriod.java:42)
	at junit.framework.Assert.assertEquals(Assert.java:62)
	at junit.framework.Assert.assertEquals(Assert.java:71)
	at org.joda.time.TestMutablePeriod_Basics.testClone(TestMutablePeriod_Basics.java:451)

testCopy(org.joda.time.TestMutablePeriod_Basics)  Time elapsed: 0.001 sec  <<< ERROR!
java.lang.ArrayIndexOutOfBoundsException: -1
	at org.joda.time.base.BasePeriod.getValue(BasePeriod.java:329)
	at org.joda.time.base.AbstractPeriod.equals(AbstractPeriod.java:42)
	at junit.framework.Assert.assertEquals(Assert.java:62)
	at junit.framework.Assert.assertEquals(Assert.java:71)
	at org.joda.time.TestMutablePeriod_Basics.testCopy(TestMutablePeriod_Basics.java:443)

testToPeriod(org.joda.time.TestMutablePeriod_Basics)  Time elapsed: 0 sec  <<< ERROR!
java.lang.ArrayIndexOutOfBoundsException: -1
	at org.joda.time.base.BasePeriod.getValue(BasePeriod.java:329)
	at org.joda.time.base.AbstractPeriod.equals(AbstractPeriod.java:42)
	at junit.framework.Assert.assertEquals(Assert.java:62)
	at junit.framework.Assert.assertEquals(Assert.java:71)
	at org.joda.time.TestMutablePeriod_Basics.testToPeriod(TestMutablePeriod_Basics.java:418)

testClear(org.joda.time.TestMutablePeriod_Updates)  Time elapsed: 0 sec  <<< ERROR!
java.lang.ArrayIndexOutOfBoundsException: -1
	at org.joda.time.base.BasePeriod.getValue(BasePeriod.java:329)
	at org.joda.time.base.AbstractPeriod.equals(AbstractPeriod.java:42)
	at junit.framework.Assert.assertEquals(Assert.java:62)
	at junit.framework.Assert.assertEquals(Assert.java:71)
	at org.joda.time.TestMutablePeriod_Updates.testClear(TestMutablePeriod_Updates.java:110)

testToMutablePeriod(org.joda.time.TestBaseSingleFieldPeriod)  Time elapsed: 0.001 sec  <<< ERROR!
java.lang.ArrayIndexOutOfBoundsException: -1
	at org.joda.time.base.BasePeriod.getValue(BasePeriod.java:329)
	at org.joda.time.base.AbstractPeriod.equals(AbstractPeriod.java:42)
	at junit.framework.Assert.assertEquals(Assert.java:62)
	at junit.framework.Assert.assertEquals(Assert.java:71)
	at org.joda.time.TestBaseSingleFieldPeriod.testToMutablePeriod(TestBaseSingleFieldPeriod.java:275)

testToPeriod(org.joda.time.TestBaseSingleFieldPeriod)  Time elapsed: 0 sec  <<< ERROR!
java.lang.ArrayIndexOutOfBoundsException: -1
	at org.joda.time.base.BasePeriod.getValue(BasePeriod.java:329)
	at org.joda.time.base.AbstractPeriod.equals(AbstractPeriod.java:42)
	at junit.framework.Assert.assertEquals(Assert.java:62)
	at junit.framework.Assert.assertEquals(Assert.java:71)
	at org.joda.time.TestBaseSingleFieldPeriod.testToPeriod(TestBaseSingleFieldPeriod.java:269)

testMutablePeriod(org.joda.time.TestStringConvert)  Time elapsed: 0.001 sec  <<< ERROR!
java.lang.ArrayIndexOutOfBoundsException: -1
	at org.joda.time.base.BasePeriod.getValue(BasePeriod.java:329)
	at org.joda.time.base.AbstractPeriod.equals(AbstractPeriod.java:42)
	at junit.framework.Assert.assertEquals(Assert.java:62)
	at junit.framework.Assert.assertEquals(Assert.java:71)
	at org.joda.time.TestStringConvert.testMutablePeriod(TestStringConvert.java:151)

testPeriod(org.joda.time.TestStringConvert)  Time elapsed: 0.001 sec  <<< ERROR!
java.lang.ArrayIndexOutOfBoundsException: -1
	at org.joda.time.base.BasePeriod.getValue(BasePeriod.java:329)
	at org.joda.time.base.AbstractPeriod.equals(AbstractPeriod.java:42)
	at junit.framework.Assert.assertEquals(Assert.java:62)
	at junit.framework.Assert.assertEquals(Assert.java:71)
	at org.joda.time.TestStringConvert.testPeriod(TestStringConvert.java:144)

testParseInto_simple(org.joda.time.format.TestPeriodFormatter)  Time elapsed: 0.001 sec  <<< ERROR!
java.lang.ArrayIndexOutOfBoundsException: -1
	at org.joda.time.base.BasePeriod.getValue(BasePeriod.java:329)
	at org.joda.time.base.AbstractPeriod.equals(AbstractPeriod.java:42)
	at junit.framework.Assert.assertEquals(Assert.java:62)
	at junit.framework.Assert.assertEquals(Assert.java:71)
	at org.joda.time.format.TestPeriodFormatter.testParseInto_simple(TestPeriodFormatter.java:222)

testParsePeriod_simple(org.joda.time.format.TestPeriodFormatter)  Time elapsed: 0.001 sec  <<< ERROR!
java.lang.ArrayIndexOutOfBoundsException: -1
	at org.joda.time.base.BasePeriod.getValue(BasePeriod.java:329)
	at org.joda.time.base.AbstractPeriod.equals(AbstractPeriod.java:42)
	at junit.framework.Assert.assertEquals(Assert.java:62)
	at junit.framework.Assert.assertEquals(Assert.java:71)
	at org.joda.time.format.TestPeriodFormatter.testParsePeriod_simple(TestPeriodFormatter.java:189)

testParsePeriod_parseType(org.joda.time.format.TestPeriodFormatter)  Time elapsed: 0 sec  <<< ERROR!
java.lang.ArrayIndexOutOfBoundsException: -1
	at org.joda.time.base.BasePeriod.getValue(BasePeriod.java:329)
	at org.joda.time.base.AbstractPeriod.equals(AbstractPeriod.java:42)
	at junit.framework.Assert.assertEquals(Assert.java:62)
	at junit.framework.Assert.assertEquals(Assert.java:71)
	at org.joda.time.format.TestPeriodFormatter.testParsePeriod_parseType(TestPeriodFormatter.java:199)

testParseMutablePeriod_simple(org.joda.time.format.TestPeriodFormatter)  Time elapsed: 0.001 sec  <<< ERROR!
java.lang.ArrayIndexOutOfBoundsException: -1
	at org.joda.time.base.BasePeriod.getValue(BasePeriod.java:329)
	at org.joda.time.base.AbstractPeriod.equals(AbstractPeriod.java:42)
	at junit.framework.Assert.assertEquals(Assert.java:62)
	at junit.framework.Assert.assertEquals(Assert.java:71)
	at org.joda.time.format.TestPeriodFormatter.testParseMutablePeriod_simple(TestPeriodFormatter.java:209)

test_getDefault_parseOneField(org.joda.time.format.TestPeriodFormat)  Time elapsed: 0.001 sec  <<< ERROR!
java.lang.ArrayIndexOutOfBoundsException: -1
	at org.joda.time.base.BasePeriod.getValue(BasePeriod.java:329)
	at org.joda.time.base.AbstractPeriod.equals(AbstractPeriod.java:42)
	at junit.framework.Assert.assertEquals(Assert.java:62)
	at junit.framework.Assert.assertEquals(Assert.java:71)
	at org.joda.time.format.TestPeriodFormat.test_getDefault_parseOneField(TestPeriodFormat.java:97)

test_getDefault_parseTwoFields(org.joda.time.format.TestPeriodFormat)  Time elapsed: 0 sec  <<< ERROR!
java.lang.ArrayIndexOutOfBoundsException: -1
	at org.joda.time.base.BasePeriod.getValue(BasePeriod.java:329)
	at org.joda.time.base.AbstractPeriod.equals(AbstractPeriod.java:42)
	at junit.framework.Assert.assertEquals(Assert.java:62)
	at junit.framework.Assert.assertEquals(Assert.java:71)
	at org.joda.time.format.TestPeriodFormat.test_getDefault_parseTwoFields(TestPeriodFormat.java:103)

test_wordBased_fr_parseOneField(org.joda.time.format.TestPeriodFormat)  Time elapsed: 0.001 sec  <<< ERROR!
java.lang.ArrayIndexOutOfBoundsException: -1
	at org.joda.time.base.BasePeriod.getValue(BasePeriod.java:329)
	at org.joda.time.base.AbstractPeriod.equals(AbstractPeriod.java:42)
	at junit.framework.Assert.assertEquals(Assert.java:62)
	at junit.framework.Assert.assertEquals(Assert.java:71)
	at org.joda.time.format.TestPeriodFormat.test_wordBased_fr_parseOneField(TestPeriodFormat.java:152)

test_wordBased_fr_parseTwoFields(org.joda.time.format.TestPeriodFormat)  Time elapsed: 0.001 sec  <<< ERROR!
java.lang.ArrayIndexOutOfBoundsException: -1
	at org.joda.time.base.BasePeriod.getValue(BasePeriod.java:329)
	at org.joda.time.base.AbstractPeriod.equals(AbstractPeriod.java:42)
	at junit.framework.Assert.assertEquals(Assert.java:62)
	at junit.framework.Assert.assertEquals(Assert.java:71)
	at org.joda.time.format.TestPeriodFormat.test_wordBased_fr_parseTwoFields(TestPeriodFormat.java:158)

test_wordBased_pt_parseOneField(org.joda.time.format.TestPeriodFormat)  Time elapsed: 0.001 sec  <<< ERROR!
java.lang.ArrayIndexOutOfBoundsException: -1
	at org.joda.time.base.BasePeriod.getValue(BasePeriod.java:329)
	at org.joda.time.base.AbstractPeriod.equals(AbstractPeriod.java:42)
	at junit.framework.Assert.assertEquals(Assert.java:62)
	at junit.framework.Assert.assertEquals(Assert.java:71)
	at org.joda.time.format.TestPeriodFormat.test_wordBased_pt_parseOneField(TestPeriodFormat.java:189)

test_wordBased_pt_parseTwoFields(org.joda.time.format.TestPeriodFormat)  Time elapsed: 0 sec  <<< ERROR!
java.lang.ArrayIndexOutOfBoundsException: -1
	at org.joda.time.base.BasePeriod.getValue(BasePeriod.java:329)
	at org.joda.time.base.AbstractPeriod.equals(AbstractPeriod.java:42)
	at junit.framework.Assert.assertEquals(Assert.java:62)
	at junit.framework.Assert.assertEquals(Assert.java:71)
	at org.joda.time.format.TestPeriodFormat.test_wordBased_pt_parseTwoFields(TestPeriodFormat.java:195)

test_wordBased_es_parseOneField(org.joda.time.format.TestPeriodFormat)  Time elapsed: 0 sec  <<< ERROR!
java.lang.ArrayIndexOutOfBoundsException: -1
	at org.joda.time.base.BasePeriod.getValue(BasePeriod.java:329)
	at org.joda.time.base.AbstractPeriod.equals(AbstractPeriod.java:42)
	at junit.framework.Assert.assertEquals(Assert.java:62)
	at junit.framework.Assert.assertEquals(Assert.java:71)
	at org.joda.time.format.TestPeriodFormat.test_wordBased_es_parseOneField(TestPeriodFormat.java:226)

test_wordBased_es_parseTwoFields(org.joda.time.format.TestPeriodFormat)  Time elapsed: 0.001 sec  <<< ERROR!
java.lang.ArrayIndexOutOfBoundsException: -1
	at org.joda.time.base.BasePeriod.getValue(BasePeriod.java:329)
	at org.joda.time.base.AbstractPeriod.equals(AbstractPeriod.java:42)
	at junit.framework.Assert.assertEquals(Assert.java:62)
	at junit.framework.Assert.assertEquals(Assert.java:71)
	at org.joda.time.format.TestPeriodFormat.test_wordBased_es_parseTwoFields(TestPeriodFormat.java:232)

test_wordBased_de_parseOneField(org.joda.time.format.TestPeriodFormat)  Time elapsed: 0 sec  <<< ERROR!
java.lang.ArrayIndexOutOfBoundsException: -1
	at org.joda.time.base.BasePeriod.getValue(BasePeriod.java:329)
	at org.joda.time.base.AbstractPeriod.equals(AbstractPeriod.java:42)
	at junit.framework.Assert.assertEquals(Assert.java:62)
	at junit.framework.Assert.assertEquals(Assert.java:71)
	at org.joda.time.format.TestPeriodFormat.test_wordBased_de_parseOneField(TestPeriodFormat.java:263)

test_wordBased_de_parseTwoFields(org.joda.time.format.TestPeriodFormat)  Time elapsed: 0.001 sec  <<< ERROR!
java.lang.ArrayIndexOutOfBoundsException: -1
	at org.joda.time.base.BasePeriod.getValue(BasePeriod.java:329)
	at org.joda.time.base.AbstractPeriod.equals(AbstractPeriod.java:42)
	at junit.framework.Assert.assertEquals(Assert.java:62)
	at junit.framework.Assert.assertEquals(Assert.java:71)
	at org.joda.time.format.TestPeriodFormat.test_wordBased_de_parseTwoFields(TestPeriodFormat.java:269)

test_wordBased_nl_parseOneField(org.joda.time.format.TestPeriodFormat)  Time elapsed: 0.001 sec  <<< ERROR!
java.lang.ArrayIndexOutOfBoundsException: -1
	at org.joda.time.base.BasePeriod.getValue(BasePeriod.java:329)
	at org.joda.time.base.AbstractPeriod.equals(AbstractPeriod.java:42)
	at junit.framework.Assert.assertEquals(Assert.java:62)
	at junit.framework.Assert.assertEquals(Assert.java:71)
	at org.joda.time.format.TestPeriodFormat.test_wordBased_nl_parseOneField(TestPeriodFormat.java:300)

test_wordBased_nl_parseTwoFields(org.joda.time.format.TestPeriodFormat)  Time elapsed: 0.001 sec  <<< ERROR!
java.lang.ArrayIndexOutOfBoundsException: -1
	at org.joda.time.base.BasePeriod.getValue(BasePeriod.java:329)
	at org.joda.time.base.AbstractPeriod.equals(AbstractPeriod.java:42)
	at junit.framework.Assert.assertEquals(Assert.java:62)
	at junit.framework.Assert.assertEquals(Assert.java:71)
	at org.joda.time.format.TestPeriodFormat.test_wordBased_nl_parseTwoFields(TestPeriodFormat.java:306)

test_wordBased_ja_parseOneField(org.joda.time.format.TestPeriodFormat)  Time elapsed: 0 sec  <<< ERROR!
java.lang.ArrayIndexOutOfBoundsException: -1
	at org.joda.time.base.BasePeriod.getValue(BasePeriod.java:329)
	at org.joda.time.base.AbstractPeriod.equals(AbstractPeriod.java:42)
	at junit.framework.Assert.assertEquals(Assert.java:62)
	at junit.framework.Assert.assertEquals(Assert.java:71)
	at org.joda.time.format.TestPeriodFormat.test_wordBased_ja_parseOneField(TestPeriodFormat.java:355)

test_wordBased_ja_parseTwoFields(org.joda.time.format.TestPeriodFormat)  Time elapsed: 0.001 sec  <<< ERROR!
java.lang.ArrayIndexOutOfBoundsException: -1
	at org.joda.time.base.BasePeriod.getValue(BasePeriod.java:329)
	at org.joda.time.base.AbstractPeriod.equals(AbstractPeriod.java:42)
	at junit.framework.Assert.assertEquals(Assert.java:62)
	at junit.framework.Assert.assertEquals(Assert.java:71)
	at org.joda.time.format.TestPeriodFormat.test_wordBased_ja_parseTwoFields(TestPeriodFormat.java:361)

test_wordBased_pl_parseOneField(org.joda.time.format.TestPeriodFormat)  Time elapsed: 0.001 sec  <<< ERROR!
java.lang.ArrayIndexOutOfBoundsException: -1
	at org.joda.time.base.BasePeriod.getValue(BasePeriod.java:329)
	at org.joda.time.base.AbstractPeriod.equals(AbstractPeriod.java:42)
	at junit.framework.Assert.assertEquals(Assert.java:62)
	at junit.framework.Assert.assertEquals(Assert.java:71)
	at org.joda.time.format.TestPeriodFormat.test_wordBased_pl_parseOneField(TestPeriodFormat.java:398)

test_wordBased_pl_parseTwoFields(org.joda.time.format.TestPeriodFormat)  Time elapsed: 0 sec  <<< ERROR!
java.lang.ArrayIndexOutOfBoundsException

test_wordBased_en_withLocale_pt(org.joda.time.format.TestPeriodFormat)  Time elapsed: 0 sec  <<< ERROR!
java.lang.ArrayIndexOutOfBoundsException

testParseStandard1(org.joda.time.format.TestISOPeriodFormatParsing)  Time elapsed: 0 sec  <<< ERROR!
java.lang.ArrayIndexOutOfBoundsException

testParseStandard6(org.joda.time.format.TestISOPeriodFormatParsing)  Time elapsed: 0 sec  <<< ERROR!
java.lang.ArrayIndexOutOfBoundsException

testParseStandard7(org.joda.time.format.TestISOPeriodFormatParsing)  Time elapsed: 0 sec  <<< ERROR!
java.lang.ArrayIndexOutOfBoundsException

testParseStandard8(org.joda.time.format.TestISOPeriodFormatParsing)  Time elapsed: 0.001 sec  <<< ERROR!
java.lang.ArrayIndexOutOfBoundsException

testParseStandard9(org.joda.time.format.TestISOPeriodFormatParsing)  Time elapsed: 0 sec  <<< ERROR!
java.lang.ArrayIndexOutOfBoundsException

testParseStandard10(org.joda.time.format.TestISOPeriodFormatParsing)  Time elapsed: 0 sec  <<< ERROR!
java.lang.ArrayIndexOutOfBoundsException

testParseStandard11(org.joda.time.format.TestISOPeriodFormatParsing)  Time elapsed: 0 sec  <<< ERROR!
java.lang.ArrayIndexOutOfBoundsException

testParseStandard2(org.joda.time.format.TestISOPeriodFormatParsing)  Time elapsed: 0.001 sec  <<< ERROR!
java.lang.ArrayIndexOutOfBoundsException

testParseStandard3(org.joda.time.format.TestISOPeriodFormatParsing)  Time elapsed: 0 sec  <<< ERROR!
java.lang.ArrayIndexOutOfBoundsException

testParseStandard4(org.joda.time.format.TestISOPeriodFormatParsing)  Time elapsed: 0 sec  <<< ERROR!
java.lang.ArrayIndexOutOfBoundsException

testParseStandard5(org.joda.time.format.TestISOPeriodFormatParsing)  Time elapsed: 0 sec  <<< ERROR!
java.lang.ArrayIndexOutOfBoundsException

testParseStandard1(org.joda.time.format.TestPeriodFormatParsing)  Time elapsed: 0 sec  <<< ERROR!
java.lang.ArrayIndexOutOfBoundsException

testParseNegativeMillis1(org.joda.time.format.TestPeriodFormatParsing)  Time elapsed: 0 sec  <<< ERROR!
java.lang.ArrayIndexOutOfBoundsException

testParseNegativeMillis2(org.joda.time.format.TestPeriodFormatParsing)  Time elapsed: 0 sec  <<< ERROR!
java.lang.ArrayIndexOutOfBoundsException

testParseCustom1(org.joda.time.format.TestPeriodFormatParsing)  Time elapsed: 0 sec  <<< ERROR!
java.lang.ArrayIndexOutOfBoundsException

testFormatPrefixSimple4IgnoringPrefix(org.joda.time.format.TestPeriodFormatterBuilder)  Time elapsed: 0.001 sec  <<< ERROR!
java.lang.ArrayIndexOutOfBoundsException

testPluralAffixParseOrder(org.joda.time.format.TestPeriodFormatterBuilder)  Time elapsed: 0 sec  <<< ERROR!
java.lang.ArrayIndexOutOfBoundsException

testFormatPrefixPlural4IgnoringPrefix(org.joda.time.format.TestPeriodFormatterBuilder)  Time elapsed: 0 sec  <<< ERROR!
java.lang.ArrayIndexOutOfBoundsException

testRegExAffixParseOrder(org.joda.time.format.TestPeriodFormatterBuilder)  Time elapsed: 0.001 sec  <<< ERROR!
java.lang.ArrayIndexOutOfBoundsException

testFormatPrefixRegEx4IgnoringPrefix(org.joda.time.format.TestPeriodFormatterBuilder)  Time elapsed: 0 sec  <<< ERROR!
java.lang.ArrayIndexOutOfBoundsException

testFormatPrefixComposite1(org.joda.time.format.TestPeriodFormatterBuilder)  Time elapsed: 0 sec  <<< ERROR!
java.lang.ArrayIndexOutOfBoundsException

testFormatPrefixSimple5IgnoringPrefix(org.joda.time.format.TestPeriodFormatterBuilder)  Time elapsed: 0 sec  <<< ERROR!
java.lang.ArrayIndexOutOfBoundsException

testFormatPrefixSimple6IgnoringPrefix(org.joda.time.format.TestPeriodFormatterBuilder)  Time elapsed: 0 sec  <<< ERROR!
java.lang.ArrayIndexOutOfBoundsException

testFormatSuffixPlural4IgnoringPrefix(org.joda.time.format.TestPeriodFormatterBuilder)  Time elapsed: 0 sec  <<< ERROR!
java.lang.ArrayIndexOutOfBoundsException

testFormatSuffixRegEx5IgnoringAffix(org.joda.time.format.TestPeriodFormatterBuilder)  Time elapsed: 0 sec  <<< ERROR!
java.lang.ArrayIndexOutOfBoundsException

testFormatSuffixComposite1(org.joda.time.format.TestPeriodFormatterBuilder)  Time elapsed: 0.001 sec  <<< ERROR!
java.lang.ArrayIndexOutOfBoundsException

testFormatSuffixComposite5IgnoringAffix(org.joda.time.format.TestPeriodFormatterBuilder)  Time elapsed: 0 sec  <<< ERROR!
java.lang.ArrayIndexOutOfBoundsException

testFormatAppend_PrinterParser_null_Parser(org.joda.time.format.TestPeriodFormatterBuilder)  Time elapsed: 0 sec  <<< ERROR!
java.lang.ArrayIndexOutOfBoundsException

testFormatAppend_PrinterParser_PrinterParser(org.joda.time.format.TestPeriodFormatterBuilder)  Time elapsed: 0 sec  <<< ERROR!
java.lang.ArrayIndexOutOfBoundsException

testMonthsAndMinutesAreConsideredSeparateAndCaseIsNotIgnored(org.joda.time.format.TestPeriodFormatterBuilder)  Time elapsed: 0 sec  <<< ERROR!
java.lang.ArrayIndexOutOfBoundsException


Results :

Tests in error: 
  org.joda.time.TestBaseSingleFieldPeriod#testToMutablePeriod ArrayIndexOutOfBoundsException
  org.joda.time.TestBaseSingleFieldPeriod#testToPeriod ArrayIndexOutOfBoundsException
  org.joda.time.TestDuration_Basics#testToPeriodFrom ArrayIndexOutOfBoundsException
  org.joda.time.TestDuration_Basics#testToPeriodFrom_PeriodType ArrayIndexOutOfBoundsException
  org.joda.time.TestDuration_Basics#testToPeriodTo ArrayIndexOutOfBoundsException
  org.joda.time.TestDuration_Basics#testToPeriodTo_PeriodType ArrayIndexOutOfBoundsException
  org.joda.time.TestDuration_Basics#testToPeriod_Chronology ArrayIndexOutOfBoundsException
  org.joda.time.TestDuration_Basics#testToPeriod_PeriodType ArrayIndexOutOfBoundsException
  org.joda.time.TestDuration_Basics#testToPeriod_PeriodType_Chronology ArrayIndexOutOfBoundsException
  org.joda.time.TestInterval_Basics#testToPeriod ArrayIndexOutOfBoundsException ...
  org.joda.time.TestInterval_Basics#testToPeriod_PeriodType1 ArrayIndexOutOfBoundsException
  org.joda.time.TestInterval_Basics#testToPeriod_PeriodType2 ArrayIndexOutOfBoundsException
  org.joda.time.TestMutableInterval_Basics#testToPeriod ArrayIndexOutOfBoundsException
  org.joda.time.TestMutableInterval_Basics#testToPeriod_PeriodType1 ArrayIndexOutOfBoundsException
  org.joda.time.TestMutableInterval_Basics#testToPeriod_PeriodType2 ArrayIndexOutOfBoundsException
  org.joda.time.TestMutablePeriod_Basics#testClone ArrayIndexOutOfBoundsException
  org.joda.time.TestMutablePeriod_Basics#testCopy ArrayIndexOutOfBoundsException
  org.joda.time.TestMutablePeriod_Basics#testEqualsHashCode ArrayIndexOutOfBoundsException
  org.joda.time.TestMutablePeriod_Basics#testSerialization ArrayIndexOutOfBoundsException
  org.joda.time.TestMutablePeriod_Basics#testToMutablePeriod ArrayIndexOutOfBoundsException
  org.joda.time.TestMutablePeriod_Basics#testToPeriod ArrayIndexOutOfBoundsException
  org.joda.time.TestMutablePeriod_Constructors#testParse_noFormatter ArrayIndexOutOfBoundsException
  org.joda.time.TestMutablePeriod_Updates#testClear ArrayIndexOutOfBoundsException
  org.joda.time.TestPeriod_Basics#testEqualsHashCode ArrayIndexOutOfBoundsException
  org.joda.time.TestPeriod_Basics#testMinusFields ArrayIndexOutOfBoundsException
  org.joda.time.TestPeriod_Basics#testMultipliedBy ArrayIndexOutOfBoundsException
  org.joda.time.TestPeriod_Basics#testNormalizedStandard_fullNegative ArrayIndexOutOfBoundsException
  org.joda.time.TestPeriod_Basics#testNormalizedStandard_negative ArrayIndexOutOfBoundsException
  org.joda.time.TestPeriod_Basics#testNormalizedStandard_periodType_months1 ArrayIndexOutOfBoundsException
  org.joda.time.TestPeriod_Basics#testNormalizedStandard_periodType_months2 ArrayIndexOutOfBoundsException
  org.joda.time.TestPeriod_Basics#testNormalizedStandard_periodType_months3 ArrayIndexOutOfBoundsException
  org.joda.time.TestPeriod_Basics#testNormalizedStandard_periodType_monthsWeeks ArrayIndexOutOfBoundsException
  org.joda.time.TestPeriod_Basics#testNormalizedStandard_periodType_weekDay1 ArrayIndexOutOfBoundsException
  org.joda.time.TestPeriod_Basics#testNormalizedStandard_periodType_weekDay3 ArrayIndexOutOfBoundsException
  org.joda.time.TestPeriod_Basics#testNormalizedStandard_periodType_yearMonth1 ArrayIndexOutOfBoundsException
  org.joda.time.TestPeriod_Basics#testNormalizedStandard_periodType_yearMonthDay ArrayIndexOutOfBoundsException
  org.joda.time.TestPeriod_Basics#testNormalizedStandard_periodType_yearMonthWeekDay ArrayIndexOutOfBoundsException
  org.joda.time.TestPeriod_Basics#testNormalizedStandard_weekDay1 ArrayIndexOutOfBoundsException
  org.joda.time.TestPeriod_Basics#testNormalizedStandard_yearMonth1 ArrayIndexOutOfBoundsException
  org.joda.time.TestPeriod_Basics#testNormalizedStandard_yearMonthDay ArrayIndexOutOfBoundsException
  org.joda.time.TestPeriod_Basics#testNormalizedStandard_yearMonthWeekDay ArrayIndexOutOfBoundsException
  org.joda.time.TestPeriod_Basics#testPeriodStatics ArrayIndexOutOfBoundsException
  org.joda.time.TestPeriod_Basics#testPlusFields ArrayIndexOutOfBoundsException ...
  org.joda.time.TestPeriod_Basics#testSerialization ArrayIndexOutOfBoundsException
  org.joda.time.TestPeriod_Basics#testToMutablePeriod ArrayIndexOutOfBoundsException
  org.joda.time.TestPeriod_Basics#testWith ArrayIndexOutOfBoundsException -1
  org.joda.time.TestPeriod_Basics#testWithField1 ArrayIndexOutOfBoundsException ...
  org.joda.time.TestPeriod_Basics#testWithField4 ArrayIndexOutOfBoundsException ...
  org.joda.time.TestPeriod_Basics#testWithFieldAdded1 ArrayIndexOutOfBoundsException
  org.joda.time.TestPeriod_Basics#testWithFields1 ArrayIndexOutOfBoundsException
  org.joda.time.TestPeriod_Basics#testWithFields2 ArrayIndexOutOfBoundsException
  org.joda.time.TestPeriod_Basics#testWithFields3 ArrayIndexOutOfBoundsException
  org.joda.time.TestPeriod_Constructors#testConstructor_trickyDifferences_LD_LD_toFeb_endOfMonth1 ArrayIndexOutOfBoundsException
  org.joda.time.TestPeriod_Constructors#testConstructor_trickyDifferences_LD_LD_toFeb_endOfMonth2 ArrayIndexOutOfBoundsException
  org.joda.time.TestPeriod_Constructors#testConstructor_trickyDifferences_LD_LD_toFeb_endOfMonth3 ArrayIndexOutOfBoundsException
  org.joda.time.TestPeriod_Constructors#testConstructor_trickyDifferences_LD_LD_toFeb_exactMonths ArrayIndexOutOfBoundsException
  org.joda.time.TestPeriod_Constructors#testConstructor_trickyDifferences_LD_LD_toFeb_leapYear ArrayIndexOutOfBoundsException
  org.joda.time.TestPeriod_Constructors#testConstructor_trickyDifferences_LD_LD_toFeb_standardYear ArrayIndexOutOfBoundsException
  org.joda.time.TestPeriod_Constructors#testConstructor_trickyDifferences_LD_LD_toMar_endOfMonth1 ArrayIndexOutOfBoundsException
  org.joda.time.TestPeriod_Constructors#testConstructor_trickyDifferences_LD_LD_toMar_endOfMonth2 ArrayIndexOutOfBoundsException
  org.joda.time.TestPeriod_Constructors#testConstructor_trickyDifferences_RI_RI_toFeb_endOfMonth1 ArrayIndexOutOfBoundsException
  org.joda.time.TestPeriod_Constructors#testConstructor_trickyDifferences_RI_RI_toFeb_endOfMonth2 ArrayIndexOutOfBoundsException
  org.joda.time.TestPeriod_Constructors#testConstructor_trickyDifferences_RI_RI_toFeb_endOfMonth3 ArrayIndexOutOfBoundsException
  org.joda.time.TestPeriod_Constructors#testConstructor_trickyDifferences_RI_RI_toFeb_exactMonths ArrayIndexOutOfBoundsException
  org.joda.time.TestPeriod_Constructors#testConstructor_trickyDifferences_RI_RI_toFeb_leapYear ArrayIndexOutOfBoundsException
  org.joda.time.TestPeriod_Constructors#testConstructor_trickyDifferences_RI_RI_toFeb_standardYear ArrayIndexOutOfBoundsException
  org.joda.time.TestPeriod_Constructors#testConstructor_trickyDifferences_RI_RI_toMar_endOfMonth1 ArrayIndexOutOfBoundsException
  org.joda.time.TestPeriod_Constructors#testConstructor_trickyDifferences_RI_RI_toMar_endOfMonth2 ArrayIndexOutOfBoundsException
  org.joda.time.TestPeriod_Constructors#testParse_noFormatter ArrayIndexOutOfBoundsException
  org.joda.time.TestStringConvert#testMutablePeriod ArrayIndexOutOfBoundsException
  org.joda.time.TestStringConvert#testPeriod ArrayIndexOutOfBoundsException -1
  org.joda.time.format.TestISOPeriodFormatParsing#testParseStandard1 ArrayIndexOutOfBoundsException
  org.joda.time.format.TestISOPeriodFormatParsing#testParseStandard10 ArrayIndexOutOfBoundsException
  org.joda.time.format.TestISOPeriodFormatParsing#testParseStandard11 ArrayIndexOutOfBoundsException
  org.joda.time.format.TestISOPeriodFormatParsing#testParseStandard2 ArrayIndexOutOfBoundsException
  org.joda.time.format.TestISOPeriodFormatParsing#testParseStandard3 ArrayIndexOutOfBoundsException
  org.joda.time.format.TestISOPeriodFormatParsing#testParseStandard4 ArrayIndexOutOfBoundsException
  org.joda.time.format.TestISOPeriodFormatParsing#testParseStandard5 ArrayIndexOutOfBoundsException
  org.joda.time.format.TestISOPeriodFormatParsing#testParseStandard6 ArrayIndexOutOfBoundsException
  org.joda.time.format.TestISOPeriodFormatParsing#testParseStandard7 ArrayIndexOutOfBoundsException
  org.joda.time.format.TestISOPeriodFormatParsing#testParseStandard8 ArrayIndexOutOfBoundsException
  org.joda.time.format.TestISOPeriodFormatParsing#testParseStandard9 ArrayIndexOutOfBoundsException
  org.joda.time.format.TestPeriodFormat#test_getDefault_parseOneField ArrayIndexOutOfBoundsException
  org.joda.time.format.TestPeriodFormat#test_getDefault_parseTwoFields ArrayIndexOutOfBoundsException
  org.joda.time.format.TestPeriodFormat#test_wordBased_de_parseOneField ArrayIndexOutOfBoundsException
  org.joda.time.format.TestPeriodFormat#test_wordBased_de_parseTwoFields ArrayIndexOutOfBoundsException
  org.joda.time.format.TestPeriodFormat#test_wordBased_en_withLocale_pt ArrayIndexOutOfBoundsException
  org.joda.time.format.TestPeriodFormat#test_wordBased_es_parseOneField ArrayIndexOutOfBoundsException
  org.joda.time.format.TestPeriodFormat#test_wordBased_es_parseTwoFields ArrayIndexOutOfBoundsException
  org.joda.time.format.TestPeriodFormat#test_wordBased_fr_parseOneField ArrayIndexOutOfBoundsException
  org.joda.time.format.TestPeriodFormat#test_wordBased_fr_parseTwoFields ArrayIndexOutOfBoundsException
  org.joda.time.format.TestPeriodFormat#test_wordBased_ja_parseOneField ArrayIndexOutOfBoundsException
  org.joda.time.format.TestPeriodFormat#test_wordBased_ja_parseTwoFields ArrayIndexOutOfBoundsException
  org.joda.time.format.TestPeriodFormat#test_wordBased_nl_parseOneField ArrayIndexOutOfBoundsException
  org.joda.time.format.TestPeriodFormat#test_wordBased_nl_parseTwoFields ArrayIndexOutOfBoundsException
  org.joda.time.format.TestPeriodFormat#test_wordBased_pl_parseOneField ArrayIndexOutOfBoundsException
  org.joda.time.format.TestPeriodFormat#test_wordBased_pl_parseTwoFields ArrayIndexOutOfBoundsException
  org.joda.time.format.TestPeriodFormat#test_wordBased_pt_parseOneField ArrayIndexOutOfBoundsException
  org.joda.time.format.TestPeriodFormat#test_wordBased_pt_parseTwoFields ArrayIndexOutOfBoundsException
  org.joda.time.format.TestPeriodFormatParsing#testParseCustom1 ArrayIndexOutOfBoundsException
  org.joda.time.format.TestPeriodFormatParsing#testParseNegativeMillis1 ArrayIndexOutOfBoundsException
  org.joda.time.format.TestPeriodFormatParsing#testParseNegativeMillis2 ArrayIndexOutOfBoundsException
  org.joda.time.format.TestPeriodFormatParsing#testParseStandard1 ArrayIndexOutOfBoundsException
  org.joda.time.format.TestPeriodFormatter#testParseInto_simple ArrayIndexOutOfBoundsException
  org.joda.time.format.TestPeriodFormatter#testParseMutablePeriod_simple ArrayIndexOutOfBoundsException
  org.joda.time.format.TestPeriodFormatter#testParsePeriod_parseType ArrayIndexOutOfBoundsException
  org.joda.time.format.TestPeriodFormatter#testParsePeriod_simple ArrayIndexOutOfBoundsException
  org.joda.time.format.TestPeriodFormatterBuilder#testFormatAppend_PrinterParser_PrinterParser ArrayIndexOutOfBoundsException
  org.joda.time.format.TestPeriodFormatterBuilder#testFormatAppend_PrinterParser_null_Parser ArrayIndexOutOfBoundsException
  org.joda.time.format.TestPeriodFormatterBuilder#testFormatPrefixComposite1 ArrayIndexOutOfBoundsException
  org.joda.time.format.TestPeriodFormatterBuilder#testFormatPrefixPlural4IgnoringPrefix ArrayIndexOutOfBoundsException
  org.joda.time.format.TestPeriodFormatterBuilder#testFormatPrefixRegEx4IgnoringPrefix ArrayIndexOutOfBoundsException
  org.joda.time.format.TestPeriodFormatterBuilder#testFormatPrefixSimple4IgnoringPrefix ArrayIndexOutOfBoundsException
  org.joda.time.format.TestPeriodFormatterBuilder#testFormatPrefixSimple5IgnoringPrefix ArrayIndexOutOfBoundsException
  org.joda.time.format.TestPeriodFormatterBuilder#testFormatPrefixSimple6IgnoringPrefix ArrayIndexOutOfBoundsException
  org.joda.time.format.TestPeriodFormatterBuilder#testFormatSuffixComposite1 ArrayIndexOutOfBoundsException
  org.joda.time.format.TestPeriodFormatterBuilder#testFormatSuffixComposite5IgnoringAffix ArrayIndexOutOfBoundsException
  org.joda.time.format.TestPeriodFormatterBuilder#testFormatSuffixPlural4IgnoringPrefix ArrayIndexOutOfBoundsException
  org.joda.time.format.TestPeriodFormatterBuilder#testFormatSuffixRegEx5IgnoringAffix ArrayIndexOutOfBoundsException
  org.joda.time.format.TestPeriodFormatterBuilder#testMonthsAndMinutesAreConsideredSeparateAndCaseIsNotIgnored ArrayIndexOutOfBoundsException
  org.joda.time.format.TestPeriodFormatterBuilder#testPluralAffixParseOrder ArrayIndexOutOfBoundsException
  org.joda.time.format.TestPeriodFormatterBuilder#testRegExAffixParseOrder ArrayIndexOutOfBoundsException

Tests run: 4157, Failures: 0, Errors: 122, Skipped: 0

[INFO] ------------------------------------------------------------------------
[INFO] BUILD FAILURE
[INFO] ------------------------------------------------------------------------
[INFO] Total time: 15.455s
[INFO] Finished at: Wed Aug 05 20:57:47 BST 2015
[INFO] Final Memory: 9M/213M
[INFO] ------------------------------------------------------------------------
[ERROR] Failed to execute goal org.apache.maven.plugins:maven-surefire-plugin:2.18.1:test (default-test) on project joda-time: There are test failures.
[ERROR] 
[ERROR] Please refer to /home/perham/Study/LittleDarwin/Cases/joda-time-2.8.1/target/surefire-reports for the individual test results.
[ERROR] -> [Help 1]
[ERROR] 
[ERROR] To see the full stack trace of the errors, re-run Maven with the -e switch.
[ERROR] Re-run Maven using the -X switch to enable full debug logging.
[ERROR] 
[ERROR] For more information about the errors and possible solutions, please read the following articles:
[ERROR] [Help 1] http://cwiki.apache.org/confluence/display/MAVEN/MojoFailureException
