[INFO] Scanning for projects...
[INFO]                                                                         
[INFO] ------------------------------------------------------------------------
[INFO] Building Joda-Time 2.8.1
[INFO] ------------------------------------------------------------------------
[INFO] 
[INFO] --- maven-resources-plugin:2.7:resources (default-resources) @ joda-time ---
[INFO] Using 'UTF-8' encoding to copy filtered resources.
[INFO] Copying 2 resources to META-INF
[INFO] Copying 10 resources
[INFO] 
[INFO] --- maven-compiler-plugin:3.3:compile (default-compile) @ joda-time ---
[INFO] Changes detected - recompiling the module!
[INFO] Compiling 166 source files to /home/perham/Study/LittleDarwin/Cases/joda-time-2.8.1/target/classes
[INFO] 
[INFO] --- exec-maven-plugin:1.4.0:java (compile-tzdb) @ joda-time ---
Writing zoneinfo files
Writing ZoneInfoMap
[INFO] 
[INFO] --- maven-resources-plugin:2.7:testResources (default-testResources) @ joda-time ---
[INFO] Using 'UTF-8' encoding to copy filtered resources.
[INFO] Copying 34 resources
[INFO] 
[INFO] --- maven-compiler-plugin:3.3:testCompile (default-testCompile) @ joda-time ---
[INFO] Nothing to compile - all classes are up to date
[INFO] 
[INFO] --- maven-surefire-plugin:2.18.1:test (default-test) @ joda-time ---
[INFO] Surefire report directory: /home/perham/Study/LittleDarwin/Cases/joda-time-2.8.1/target/surefire-reports

-------------------------------------------------------
 T E S T S
-------------------------------------------------------
Running org.joda.time.TestAllPackages

TestBuddhistChronology.testCalendar

TestCopticChronology.testCalendar

TestEthiopicChronology.testCalendar

TestIslamicChronology.testCalendar

Testing Gregorian chronology over 1000 iterations
100% complete (i=1000)

Testing Julian chronology over 1000 iterations
100% complete (i=1000)
Writing zoneinfo files
Writing ZoneInfoMap
Tests run: 4157, Failures: 12, Errors: 3, Skipped: 0, Time elapsed: 5.282 sec <<< FAILURE! - in org.joda.time.TestAllPackages
testToString_PeriodFormatter(org.joda.time.TestPeriod_Basics)  Time elapsed: 0.009 sec  <<< FAILURE!
junit.framework.ComparisonFailure: expected:<[1 year, 2 months, 3 weeks, 4 days, 5 hours, 6 minutes, 7 seconds and 8 milliseconds]> but was:<[P1Y2M3W4DT5H6M7.008S]>
	at junit.framework.Assert.assertEquals(Assert.java:81)
	at junit.framework.Assert.assertEquals(Assert.java:87)
	at org.joda.time.TestPeriod_Basics.testToString_PeriodFormatter(TestPeriod_Basics.java:484)

testToString_nullPeriodFormatter(org.joda.time.TestPeriod_Basics)  Time elapsed: 0.001 sec  <<< ERROR!
java.lang.NullPointerException
	at org.joda.time.base.AbstractPeriod.toString(AbstractPeriod.java:52)
	at org.joda.time.TestPeriod_Basics.testToString_nullPeriodFormatter(TestPeriod_Basics.java:492)

testMonthsAndMinutesAreConsideredSeparateAndCaseIsNotIgnored(org.joda.time.format.TestPeriodFormatterBuilder)  Time elapsed: 0.002 sec  <<< FAILURE!
junit.framework.ComparisonFailure: expected:<[]1M> but was:<[P]1M>
	at junit.framework.Assert.assertEquals(Assert.java:81)
	at junit.framework.Assert.assertEquals(Assert.java:87)
	at org.joda.time.format.TestPeriodFormatterBuilder.testMonthsAndMinutesAreConsideredSeparateAndCaseIsNotIgnored(TestPeriodFormatterBuilder.java:1178)

testFormatPrefixPlural4IgnoringPrefix(org.joda.time.format.TestPeriodFormatterBuilder)  Time elapsed: 0.001 sec  <<< FAILURE!
junit.framework.ComparisonFailure: expected:<[mss1]> but was:<[PT0.001S]>
	at junit.framework.Assert.assertEquals(Assert.java:81)
	at junit.framework.Assert.assertEquals(Assert.java:87)
	at org.joda.time.format.TestPeriodFormatterBuilder.testFormatPrefixPlural4IgnoringPrefix(TestPeriodFormatterBuilder.java:406)

testRegExAffixParseOrder(org.joda.time.format.TestPeriodFormatterBuilder)  Time elapsed: 0.001 sec  <<< ERROR!
java.lang.IllegalArgumentException: Invalid format: "P2D"
	at org.joda.time.format.PeriodFormatter.parseMutablePeriod(PeriodFormatter.java:330)
	at org.joda.time.format.PeriodFormatter.parsePeriod(PeriodFormatter.java:308)
	at org.joda.time.format.TestPeriodFormatterBuilder.testRegExAffixParseOrder(TestPeriodFormatterBuilder.java:424)

testFormatPrefixRegEx4IgnoringPrefix(org.joda.time.format.TestPeriodFormatterBuilder)  Time elapsed: 0.001 sec  <<< FAILURE!
junit.framework.ComparisonFailure: expected:<[mss1]> but was:<[PT0.001S]>
	at junit.framework.Assert.assertEquals(Assert.java:81)
	at junit.framework.Assert.assertEquals(Assert.java:87)
	at org.joda.time.format.TestPeriodFormatterBuilder.testFormatPrefixRegEx4IgnoringPrefix(TestPeriodFormatterBuilder.java:491)

testFormatPrefixComposite1(org.joda.time.format.TestPeriodFormatterBuilder)  Time elapsed: 0.002 sec  <<< FAILURE!
junit.framework.ComparisonFailure: expected:<[days:2]> but was:<[P2D]>
	at junit.framework.Assert.assertEquals(Assert.java:81)
	at junit.framework.Assert.assertEquals(Assert.java:87)
	at org.joda.time.format.TestPeriodFormatterBuilder.testFormatPrefixComposite1(TestPeriodFormatterBuilder.java:512)

testFormatPrefixSimple5IgnoringPrefix(org.joda.time.format.TestPeriodFormatterBuilder)  Time elapsed: 0.005 sec  <<< FAILURE!
junit.framework.ComparisonFailure: expected:<[1ms]> but was:<[PT0.001S]>
	at junit.framework.Assert.assertEquals(Assert.java:81)
	at junit.framework.Assert.assertEquals(Assert.java:87)
	at org.joda.time.format.TestPeriodFormatterBuilder.testFormatPrefixSimple5IgnoringPrefix(TestPeriodFormatterBuilder.java:562)

testFormatPrefixSimple6IgnoringPrefix(org.joda.time.format.TestPeriodFormatterBuilder)  Time elapsed: 0 sec  <<< FAILURE!
junit.framework.ComparisonFailure: expected:<[1ms]> but was:<[PT0.001S]>
	at junit.framework.Assert.assertEquals(Assert.java:81)
	at junit.framework.Assert.assertEquals(Assert.java:87)
	at org.joda.time.format.TestPeriodFormatterBuilder.testFormatPrefixSimple6IgnoringPrefix(TestPeriodFormatterBuilder.java:573)

testFormatSuffixPlural4IgnoringPrefix(org.joda.time.format.TestPeriodFormatterBuilder)  Time elapsed: 0 sec  <<< FAILURE!
junit.framework.ComparisonFailure: expected:<[1mss]> but was:<[PT0.001S]>
	at junit.framework.Assert.assertEquals(Assert.java:81)
	at junit.framework.Assert.assertEquals(Assert.java:87)
	at org.joda.time.format.TestPeriodFormatterBuilder.testFormatSuffixPlural4IgnoringPrefix(TestPeriodFormatterBuilder.java:630)

testFormatSuffixRegEx5IgnoringAffix(org.joda.time.format.TestPeriodFormatterBuilder)  Time elapsed: 0 sec  <<< FAILURE!
junit.framework.ComparisonFailure: expected:<[1mss]> but was:<[PT0.001S]>
	at junit.framework.Assert.assertEquals(Assert.java:81)
	at junit.framework.Assert.assertEquals(Assert.java:87)
	at org.joda.time.format.TestPeriodFormatterBuilder.testFormatSuffixRegEx5IgnoringAffix(TestPeriodFormatterBuilder.java:722)

testFormatSuffixComposite1(org.joda.time.format.TestPeriodFormatterBuilder)  Time elapsed: 0 sec  <<< FAILURE!
junit.framework.ComparisonFailure: expected:<[2days]> but was:<[P2D]>
	at junit.framework.Assert.assertEquals(Assert.java:81)
	at junit.framework.Assert.assertEquals(Assert.java:87)
	at org.joda.time.format.TestPeriodFormatterBuilder.testFormatSuffixComposite1(TestPeriodFormatterBuilder.java:742)

testFormatSuffixComposite5IgnoringAffix(org.joda.time.format.TestPeriodFormatterBuilder)  Time elapsed: 0.004 sec  <<< FAILURE!
junit.framework.ComparisonFailure: expected:<[1ms]> but was:<[PT0.001S]>
	at junit.framework.Assert.assertEquals(Assert.java:81)
	at junit.framework.Assert.assertEquals(Assert.java:87)
	at org.joda.time.format.TestPeriodFormatterBuilder.testFormatSuffixComposite5IgnoringAffix(TestPeriodFormatterBuilder.java:756)

testFormatPrefixSimple4IgnoringPrefix(org.joda.time.format.TestPeriodFormatterBuilder)  Time elapsed: 0 sec  <<< FAILURE!
junit.framework.ComparisonFailure: expected:<[ms1]> but was:<[PT0.001S]>
	at junit.framework.Assert.assertEquals(Assert.java:81)
	at junit.framework.Assert.assertEquals(Assert.java:87)
	at org.joda.time.format.TestPeriodFormatterBuilder.testFormatPrefixSimple4IgnoringPrefix(TestPeriodFormatterBuilder.java:347)

testPluralAffixParseOrder(org.joda.time.format.TestPeriodFormatterBuilder)  Time elapsed: 0 sec  <<< ERROR!
java.lang.IllegalArgumentException: Invalid format: "P2D"
	at org.joda.time.format.PeriodFormatter.parseMutablePeriod(PeriodFormatter.java:330)
	at org.joda.time.format.PeriodFormatter.parsePeriod(PeriodFormatter.java:308)
	at org.joda.time.format.TestPeriodFormatterBuilder.testPluralAffixParseOrder(TestPeriodFormatterBuilder.java:357)


Results :

Failed tests: 
  org.joda.time.TestPeriod_Basics#testToString_PeriodFormatter ComparisonFailure
  org.joda.time.format.TestPeriodFormatterBuilder#testFormatPrefixComposite1 ComparisonFailure
  org.joda.time.format.TestPeriodFormatterBuilder#testFormatPrefixPlural4IgnoringPrefix ComparisonFailure
  org.joda.time.format.TestPeriodFormatterBuilder#testFormatPrefixRegEx4IgnoringPrefix ComparisonFailure
  org.joda.time.format.TestPeriodFormatterBuilder#testFormatPrefixSimple4IgnoringPrefix ComparisonFailure
  org.joda.time.format.TestPeriodFormatterBuilder#testFormatPrefixSimple5IgnoringPrefix ComparisonFailure
  org.joda.time.format.TestPeriodFormatterBuilder#testFormatPrefixSimple6IgnoringPrefix ComparisonFailure
  org.joda.time.format.TestPeriodFormatterBuilder#testFormatSuffixComposite1 ComparisonFailure
  org.joda.time.format.TestPeriodFormatterBuilder#testFormatSuffixComposite5IgnoringAffix ComparisonFailure
  org.joda.time.format.TestPeriodFormatterBuilder#testFormatSuffixPlural4IgnoringPrefix ComparisonFailure
  org.joda.time.format.TestPeriodFormatterBuilder#testFormatSuffixRegEx5IgnoringAffix ComparisonFailure
  org.joda.time.format.TestPeriodFormatterBuilder#testMonthsAndMinutesAreConsideredSeparateAndCaseIsNotIgnored ComparisonFailure
Tests in error: 
  org.joda.time.TestPeriod_Basics#testToString_nullPeriodFormatter NullPointerException
  org.joda.time.format.TestPeriodFormatterBuilder#testPluralAffixParseOrder IllegalArgumentException
  org.joda.time.format.TestPeriodFormatterBuilder#testRegExAffixParseOrder IllegalArgumentException

Tests run: 4157, Failures: 12, Errors: 3, Skipped: 0

[INFO] ------------------------------------------------------------------------
[INFO] BUILD FAILURE
[INFO] ------------------------------------------------------------------------
[INFO] Total time: 15.728s
[INFO] Finished at: Wed Aug 05 20:58:57 BST 2015
[INFO] Final Memory: 9M/213M
[INFO] ------------------------------------------------------------------------
[ERROR] Failed to execute goal org.apache.maven.plugins:maven-surefire-plugin:2.18.1:test (default-test) on project joda-time: There are test failures.
[ERROR] 
[ERROR] Please refer to /home/perham/Study/LittleDarwin/Cases/joda-time-2.8.1/target/surefire-reports for the individual test results.
[ERROR] -> [Help 1]
[ERROR] 
[ERROR] To see the full stack trace of the errors, re-run Maven with the -e switch.
[ERROR] Re-run Maven using the -X switch to enable full debug logging.
[ERROR] 
[ERROR] For more information about the errors and possible solutions, please read the following articles:
[ERROR] [Help 1] http://cwiki.apache.org/confluence/display/MAVEN/MojoFailureException
