[INFO] Scanning for projects...
[INFO]                                                                         
[INFO] ------------------------------------------------------------------------
[INFO] Building Joda-Time 2.8.1
[INFO] ------------------------------------------------------------------------
[INFO] 
[INFO] --- maven-resources-plugin:2.7:resources (default-resources) @ joda-time ---
[INFO] Using 'UTF-8' encoding to copy filtered resources.
[INFO] Copying 2 resources to META-INF
[INFO] Copying 10 resources
[INFO] 
[INFO] --- maven-compiler-plugin:3.3:compile (default-compile) @ joda-time ---
[INFO] Changes detected - recompiling the module!
[INFO] Compiling 166 source files to /home/perham/Study/LittleDarwin/Cases/joda-time-2.8.1/target/classes
[INFO] 
[INFO] --- exec-maven-plugin:1.4.0:java (compile-tzdb) @ joda-time ---
Writing zoneinfo files
Writing ZoneInfoMap
[INFO] 
[INFO] --- maven-resources-plugin:2.7:testResources (default-testResources) @ joda-time ---
[INFO] Using 'UTF-8' encoding to copy filtered resources.
[INFO] Copying 34 resources
[INFO] 
[INFO] --- maven-compiler-plugin:3.3:testCompile (default-testCompile) @ joda-time ---
[INFO] Nothing to compile - all classes are up to date
[INFO] 
[INFO] --- maven-surefire-plugin:2.18.1:test (default-test) @ joda-time ---
[INFO] Surefire report directory: /home/perham/Study/LittleDarwin/Cases/joda-time-2.8.1/target/surefire-reports

-------------------------------------------------------
 T E S T S
-------------------------------------------------------
Running org.joda.time.TestAllPackages

TestBuddhistChronology.testCalendar

TestCopticChronology.testCalendar

TestEthiopicChronology.testCalendar

TestIslamicChronology.testCalendar

Testing Gregorian chronology over 1000 iterations
100% complete (i=1000)

Testing Julian chronology over 1000 iterations
100% complete (i=1000)
Writing zoneinfo files
Writing ZoneInfoMap
Tests run: 4157, Failures: 0, Errors: 76, Skipped: 0, Time elapsed: 5.369 sec <<< FAILURE! - in org.joda.time.TestAllPackages
testWithFieldAdded2(org.joda.time.TestTimeOfDay_Basics)  Time elapsed: 0.005 sec  <<< ERROR!
java.lang.ArrayIndexOutOfBoundsException: -1
	at org.joda.time.TimeOfDay.getFieldType(TimeOfDay.java:464)
	at org.joda.time.base.AbstractPartial.indexOf(AbstractPartial.java:49)
	at org.joda.time.base.AbstractPartial.indexOfSupported(AbstractPartial.java:51)
	at org.joda.time.TimeOfDay.withFieldAdded(TimeOfDay.java:553)
	at org.joda.time.TestTimeOfDay_Basics.testWithFieldAdded2(TestTimeOfDay_Basics.java:415)

testWithFieldAdded3(org.joda.time.TestTimeOfDay_Basics)  Time elapsed: 0 sec  <<< ERROR!
java.lang.ArrayIndexOutOfBoundsException: -1
	at org.joda.time.TimeOfDay.getFieldType(TimeOfDay.java:464)
	at org.joda.time.base.AbstractPartial.indexOf(AbstractPartial.java:49)
	at org.joda.time.base.AbstractPartial.indexOfSupported(AbstractPartial.java:51)
	at org.joda.time.TimeOfDay.withFieldAdded(TimeOfDay.java:553)
	at org.joda.time.TestTimeOfDay_Basics.testWithFieldAdded3(TestTimeOfDay_Basics.java:423)

testPlus_RP(org.joda.time.TestTimeOfDay_Basics)  Time elapsed: 0.001 sec  <<< ERROR!
java.lang.ArrayIndexOutOfBoundsException: -1
	at org.joda.time.TimeOfDay.getFieldType(TimeOfDay.java:464)
	at org.joda.time.base.AbstractPartial.indexOf(AbstractPartial.java:49)
	at org.joda.time.TimeOfDay.withPeriodAdded(TimeOfDay.java:586)
	at org.joda.time.TimeOfDay.plus(TimeOfDay.java:611)
	at org.joda.time.TestTimeOfDay_Basics.testPlus_RP(TestTimeOfDay_Basics.java:489)

testPlusMinutes_int(org.joda.time.TestTimeOfDay_Basics)  Time elapsed: 0.001 sec  <<< ERROR!
java.lang.ArrayIndexOutOfBoundsException: -1
	at org.joda.time.TimeOfDay.getFieldType(TimeOfDay.java:464)
	at org.joda.time.base.AbstractPartial.indexOf(AbstractPartial.java:49)
	at org.joda.time.base.AbstractPartial.indexOfSupported(AbstractPartial.java:51)
	at org.joda.time.TimeOfDay.withFieldAdded(TimeOfDay.java:553)
	at org.joda.time.TimeOfDay.plusMinutes(TimeOfDay.java:652)
	at org.joda.time.TestTimeOfDay_Basics.testPlusMinutes_int(TestTimeOfDay_Basics.java:509)

testPlusSeconds_int(org.joda.time.TestTimeOfDay_Basics)  Time elapsed: 0.002 sec  <<< ERROR!
java.lang.ArrayIndexOutOfBoundsException: -1
	at org.joda.time.TimeOfDay.getFieldType(TimeOfDay.java:464)
	at org.joda.time.base.AbstractPartial.indexOf(AbstractPartial.java:49)
	at org.joda.time.base.AbstractPartial.indexOfSupported(AbstractPartial.java:51)
	at org.joda.time.TimeOfDay.withFieldAdded(TimeOfDay.java:553)
	at org.joda.time.TimeOfDay.plusSeconds(TimeOfDay.java:672)
	at org.joda.time.TestTimeOfDay_Basics.testPlusSeconds_int(TestTimeOfDay_Basics.java:519)

testPlusMillis_int(org.joda.time.TestTimeOfDay_Basics)  Time elapsed: 0.001 sec  <<< ERROR!
java.lang.ArrayIndexOutOfBoundsException: -1
	at org.joda.time.TimeOfDay.getFieldType(TimeOfDay.java:464)
	at org.joda.time.base.AbstractPartial.indexOf(AbstractPartial.java:49)
	at org.joda.time.base.AbstractPartial.indexOfSupported(AbstractPartial.java:51)
	at org.joda.time.TimeOfDay.withFieldAdded(TimeOfDay.java:553)
	at org.joda.time.TimeOfDay.plusMillis(TimeOfDay.java:692)
	at org.joda.time.TestTimeOfDay_Basics.testPlusMillis_int(TestTimeOfDay_Basics.java:529)

testMinus_RP(org.joda.time.TestTimeOfDay_Basics)  Time elapsed: 0.001 sec  <<< ERROR!
java.lang.ArrayIndexOutOfBoundsException: -1
	at org.joda.time.TimeOfDay.getFieldType(TimeOfDay.java:464)
	at org.joda.time.base.AbstractPartial.indexOf(AbstractPartial.java:49)
	at org.joda.time.TimeOfDay.withPeriodAdded(TimeOfDay.java:586)
	at org.joda.time.TimeOfDay.minus(TimeOfDay.java:711)
	at org.joda.time.TestTimeOfDay_Basics.testMinus_RP(TestTimeOfDay_Basics.java:540)

testMinusMinutes_int(org.joda.time.TestTimeOfDay_Basics)  Time elapsed: 0.001 sec  <<< ERROR!
java.lang.ArrayIndexOutOfBoundsException: -1
	at org.joda.time.TimeOfDay.getFieldType(TimeOfDay.java:464)
	at org.joda.time.base.AbstractPartial.indexOf(AbstractPartial.java:49)
	at org.joda.time.base.AbstractPartial.indexOfSupported(AbstractPartial.java:51)
	at org.joda.time.TimeOfDay.withFieldAdded(TimeOfDay.java:553)
	at org.joda.time.TimeOfDay.minusMinutes(TimeOfDay.java:752)
	at org.joda.time.TestTimeOfDay_Basics.testMinusMinutes_int(TestTimeOfDay_Basics.java:560)

testMinusSeconds_int(org.joda.time.TestTimeOfDay_Basics)  Time elapsed: 0.001 sec  <<< ERROR!
java.lang.ArrayIndexOutOfBoundsException: -1
	at org.joda.time.TimeOfDay.getFieldType(TimeOfDay.java:464)
	at org.joda.time.base.AbstractPartial.indexOf(AbstractPartial.java:49)
	at org.joda.time.base.AbstractPartial.indexOfSupported(AbstractPartial.java:51)
	at org.joda.time.TimeOfDay.withFieldAdded(TimeOfDay.java:553)
	at org.joda.time.TimeOfDay.minusSeconds(TimeOfDay.java:772)
	at org.joda.time.TestTimeOfDay_Basics.testMinusSeconds_int(TestTimeOfDay_Basics.java:570)

testMinusMillis_int(org.joda.time.TestTimeOfDay_Basics)  Time elapsed: 0 sec  <<< ERROR!
java.lang.ArrayIndexOutOfBoundsException: -1
	at org.joda.time.TimeOfDay.getFieldType(TimeOfDay.java:464)
	at org.joda.time.base.AbstractPartial.indexOf(AbstractPartial.java:49)
	at org.joda.time.base.AbstractPartial.indexOfSupported(AbstractPartial.java:51)
	at org.joda.time.TimeOfDay.withFieldAdded(TimeOfDay.java:553)
	at org.joda.time.TimeOfDay.minusMillis(TimeOfDay.java:792)
	at org.joda.time.TestTimeOfDay_Basics.testMinusMillis_int(TestTimeOfDay_Basics.java:580)

testWithFieldAdded5(org.joda.time.TestTimeOfDay_Basics)  Time elapsed: 0.001 sec  <<< ERROR!
java.lang.ArrayIndexOutOfBoundsException: -1
	at org.joda.time.TimeOfDay.getFieldType(TimeOfDay.java:464)
	at org.joda.time.base.AbstractPartial.indexOf(AbstractPartial.java:49)
	at org.joda.time.base.AbstractPartial.indexOfSupported(AbstractPartial.java:51)
	at org.joda.time.TimeOfDay.withFieldAdded(TimeOfDay.java:553)
	at org.joda.time.TestTimeOfDay_Basics.testWithFieldAdded5(TestTimeOfDay_Basics.java:437)

testWithFieldAdded7(org.joda.time.TestTimeOfDay_Basics)  Time elapsed: 0 sec  <<< ERROR!
java.lang.ArrayIndexOutOfBoundsException: -1
	at org.joda.time.TimeOfDay.getFieldType(TimeOfDay.java:464)
	at org.joda.time.base.AbstractPartial.indexOf(AbstractPartial.java:49)
	at org.joda.time.base.AbstractPartial.indexOfSupported(AbstractPartial.java:51)
	at org.joda.time.TimeOfDay.withFieldAdded(TimeOfDay.java:553)
	at org.joda.time.TestTimeOfDay_Basics.testWithFieldAdded7(TestTimeOfDay_Basics.java:452)

testWithFieldAdded8(org.joda.time.TestTimeOfDay_Basics)  Time elapsed: 0.001 sec  <<< ERROR!
java.lang.ArrayIndexOutOfBoundsException: -1
	at org.joda.time.TimeOfDay.getFieldType(TimeOfDay.java:464)
	at org.joda.time.base.AbstractPartial.indexOf(AbstractPartial.java:49)
	at org.joda.time.base.AbstractPartial.indexOfSupported(AbstractPartial.java:51)
	at org.joda.time.TimeOfDay.withFieldAdded(TimeOfDay.java:553)
	at org.joda.time.TestTimeOfDay_Basics.testWithFieldAdded8(TestTimeOfDay_Basics.java:470)

testWithFieldAdded2(org.joda.time.TestYearMonthDay_Basics)  Time elapsed: 0.006 sec  <<< ERROR!
java.lang.ArrayIndexOutOfBoundsException: -1
	at org.joda.time.YearMonthDay.getFieldType(YearMonthDay.java:351)
	at org.joda.time.base.AbstractPartial.indexOf(AbstractPartial.java:49)
	at org.joda.time.base.AbstractPartial.indexOfSupported(AbstractPartial.java:51)
	at org.joda.time.YearMonthDay.withFieldAdded(YearMonthDay.java:439)
	at org.joda.time.TestYearMonthDay_Basics.testWithFieldAdded2(TestYearMonthDay_Basics.java:417)

testWithFieldAdded3(org.joda.time.TestYearMonthDay_Basics)  Time elapsed: 0 sec  <<< ERROR!
java.lang.ArrayIndexOutOfBoundsException: -1
	at org.joda.time.YearMonthDay.getFieldType(YearMonthDay.java:351)
	at org.joda.time.base.AbstractPartial.indexOf(AbstractPartial.java:49)
	at org.joda.time.base.AbstractPartial.indexOfSupported(AbstractPartial.java:51)
	at org.joda.time.YearMonthDay.withFieldAdded(YearMonthDay.java:439)
	at org.joda.time.TestYearMonthDay_Basics.testWithFieldAdded3(TestYearMonthDay_Basics.java:425)

testPlus_RP(org.joda.time.TestYearMonthDay_Basics)  Time elapsed: 0.002 sec  <<< ERROR!
java.lang.ArrayIndexOutOfBoundsException: -1
	at org.joda.time.YearMonthDay.getFieldType(YearMonthDay.java:351)
	at org.joda.time.base.AbstractPartial.indexOf(AbstractPartial.java:49)
	at org.joda.time.YearMonthDay.withPeriodAdded(YearMonthDay.java:471)
	at org.joda.time.YearMonthDay.plus(YearMonthDay.java:495)
	at org.joda.time.TestYearMonthDay_Basics.testPlus_RP(TestYearMonthDay_Basics.java:447)

testPlusMonths_int(org.joda.time.TestYearMonthDay_Basics)  Time elapsed: 0 sec  <<< ERROR!
java.lang.ArrayIndexOutOfBoundsException: -1
	at org.joda.time.YearMonthDay.getFieldType(YearMonthDay.java:351)
	at org.joda.time.base.AbstractPartial.indexOf(AbstractPartial.java:49)
	at org.joda.time.base.AbstractPartial.indexOfSupported(AbstractPartial.java:51)
	at org.joda.time.YearMonthDay.withFieldAdded(YearMonthDay.java:439)
	at org.joda.time.YearMonthDay.plusMonths(YearMonthDay.java:536)
	at org.joda.time.TestYearMonthDay_Basics.testPlusMonths_int(TestYearMonthDay_Basics.java:467)

testPlusDays_int(org.joda.time.TestYearMonthDay_Basics)  Time elapsed: 0 sec  <<< ERROR!
java.lang.ArrayIndexOutOfBoundsException: -1
	at org.joda.time.YearMonthDay.getFieldType(YearMonthDay.java:351)
	at org.joda.time.base.AbstractPartial.indexOf(AbstractPartial.java:49)
	at org.joda.time.base.AbstractPartial.indexOfSupported(AbstractPartial.java:51)
	at org.joda.time.YearMonthDay.withFieldAdded(YearMonthDay.java:439)
	at org.joda.time.YearMonthDay.plusDays(YearMonthDay.java:556)
	at org.joda.time.TestYearMonthDay_Basics.testPlusDays_int(TestYearMonthDay_Basics.java:477)

testMinus_RP(org.joda.time.TestYearMonthDay_Basics)  Time elapsed: 0 sec  <<< ERROR!
java.lang.ArrayIndexOutOfBoundsException: -1
	at org.joda.time.YearMonthDay.getFieldType(YearMonthDay.java:351)
	at org.joda.time.base.AbstractPartial.indexOf(AbstractPartial.java:49)
	at org.joda.time.YearMonthDay.withPeriodAdded(YearMonthDay.java:471)
	at org.joda.time.YearMonthDay.minus(YearMonthDay.java:574)
	at org.joda.time.TestYearMonthDay_Basics.testMinus_RP(TestYearMonthDay_Basics.java:488)

testMinusMonths_int(org.joda.time.TestYearMonthDay_Basics)  Time elapsed: 0.001 sec  <<< ERROR!
java.lang.ArrayIndexOutOfBoundsException: -1
	at org.joda.time.YearMonthDay.getFieldType(YearMonthDay.java:351)
	at org.joda.time.base.AbstractPartial.indexOf(AbstractPartial.java:49)
	at org.joda.time.base.AbstractPartial.indexOfSupported(AbstractPartial.java:51)
	at org.joda.time.YearMonthDay.withFieldAdded(YearMonthDay.java:439)
	at org.joda.time.YearMonthDay.minusMonths(YearMonthDay.java:615)
	at org.joda.time.TestYearMonthDay_Basics.testMinusMonths_int(TestYearMonthDay_Basics.java:508)

testMinusDays_int(org.joda.time.TestYearMonthDay_Basics)  Time elapsed: 0.001 sec  <<< ERROR!
java.lang.ArrayIndexOutOfBoundsException: -1
	at org.joda.time.YearMonthDay.getFieldType(YearMonthDay.java:351)
	at org.joda.time.base.AbstractPartial.indexOf(AbstractPartial.java:49)
	at org.joda.time.base.AbstractPartial.indexOfSupported(AbstractPartial.java:51)
	at org.joda.time.YearMonthDay.withFieldAdded(YearMonthDay.java:439)
	at org.joda.time.YearMonthDay.minusDays(YearMonthDay.java:635)
	at org.joda.time.TestYearMonthDay_Basics.testMinusDays_int(TestYearMonthDay_Basics.java:518)

testWithFieldAdded5(org.joda.time.TestYearMonthDay_Basics)  Time elapsed: 0.001 sec  <<< ERROR!
java.lang.ArrayIndexOutOfBoundsException: -1
	at org.joda.time.YearMonthDay.getFieldType(YearMonthDay.java:351)
	at org.joda.time.base.AbstractPartial.indexOf(AbstractPartial.java:49)
	at org.joda.time.base.AbstractPartial.indexOfSupported(AbstractPartial.java:51)
	at org.joda.time.YearMonthDay.withFieldAdded(YearMonthDay.java:439)
	at org.joda.time.TestYearMonthDay_Basics.testWithFieldAdded5(TestYearMonthDay_Basics.java:439)

testPlus_RP(org.joda.time.TestYearMonth_Basics)  Time elapsed: 0 sec  <<< ERROR!
java.lang.ArrayIndexOutOfBoundsException: -1
	at org.joda.time.YearMonth.getFieldType(YearMonth.java:418)
	at org.joda.time.base.AbstractPartial.indexOf(AbstractPartial.java:49)
	at org.joda.time.YearMonth.withPeriodAdded(YearMonth.java:538)
	at org.joda.time.YearMonth.plus(YearMonth.java:562)
	at org.joda.time.TestYearMonth_Basics.testPlus_RP(TestYearMonth_Basics.java:441)

testPlusMonths_int(org.joda.time.TestYearMonth_Basics)  Time elapsed: 0.002 sec  <<< ERROR!
java.lang.ArrayIndexOutOfBoundsException: -1
	at org.joda.time.YearMonth.getFieldType(YearMonth.java:418)
	at org.joda.time.base.AbstractPartial.indexOf(AbstractPartial.java:49)
	at org.joda.time.base.AbstractPartial.indexOfSupported(AbstractPartial.java:51)
	at org.joda.time.YearMonth.withFieldAdded(YearMonth.java:506)
	at org.joda.time.YearMonth.plusMonths(YearMonth.java:601)
	at org.joda.time.TestYearMonth_Basics.testPlusMonths_int(TestYearMonth_Basics.java:461)

testMinus_RP(org.joda.time.TestYearMonth_Basics)  Time elapsed: 0 sec  <<< ERROR!
java.lang.ArrayIndexOutOfBoundsException: -1
	at org.joda.time.YearMonth.getFieldType(YearMonth.java:418)
	at org.joda.time.base.AbstractPartial.indexOf(AbstractPartial.java:49)
	at org.joda.time.YearMonth.withPeriodAdded(YearMonth.java:538)
	at org.joda.time.YearMonth.minus(YearMonth.java:619)
	at org.joda.time.TestYearMonth_Basics.testMinus_RP(TestYearMonth_Basics.java:472)

testMinusMonths_int(org.joda.time.TestYearMonth_Basics)  Time elapsed: 0 sec  <<< ERROR!
java.lang.ArrayIndexOutOfBoundsException: -1
	at org.joda.time.YearMonth.getFieldType(YearMonth.java:418)
	at org.joda.time.base.AbstractPartial.indexOf(AbstractPartial.java:49)
	at org.joda.time.base.AbstractPartial.indexOfSupported(AbstractPartial.java:51)
	at org.joda.time.YearMonth.withFieldAdded(YearMonth.java:506)
	at org.joda.time.YearMonth.minusMonths(YearMonth.java:658)
	at org.joda.time.TestYearMonth_Basics.testMinusMonths_int(TestYearMonth_Basics.java:492)

testToInterval_Zone(org.joda.time.TestYearMonth_Basics)  Time elapsed: 0 sec  <<< ERROR!
java.lang.ArrayIndexOutOfBoundsException: -1
	at org.joda.time.YearMonth.getFieldType(YearMonth.java:418)
	at org.joda.time.base.AbstractPartial.indexOf(AbstractPartial.java:49)
	at org.joda.time.base.AbstractPartial.indexOfSupported(AbstractPartial.java:51)
	at org.joda.time.YearMonth.withFieldAdded(YearMonth.java:506)
	at org.joda.time.YearMonth.plusMonths(YearMonth.java:601)
	at org.joda.time.YearMonth.toInterval(YearMonth.java:699)
	at org.joda.time.TestYearMonth_Basics.testToInterval_Zone(TestYearMonth_Basics.java:551)

testToInterval_nullZone(org.joda.time.TestYearMonth_Basics)  Time elapsed: 0 sec  <<< ERROR!
java.lang.ArrayIndexOutOfBoundsException: -1
	at org.joda.time.YearMonth.getFieldType(YearMonth.java:418)
	at org.joda.time.base.AbstractPartial.indexOf(AbstractPartial.java:49)
	at org.joda.time.base.AbstractPartial.indexOfSupported(AbstractPartial.java:51)
	at org.joda.time.YearMonth.withFieldAdded(YearMonth.java:506)
	at org.joda.time.YearMonth.plusMonths(YearMonth.java:601)
	at org.joda.time.YearMonth.toInterval(YearMonth.java:699)
	at org.joda.time.TestYearMonth_Basics.testToInterval_nullZone(TestYearMonth_Basics.java:561)

testToInterval(org.joda.time.TestYearMonth_Basics)  Time elapsed: 0.001 sec  <<< ERROR!
java.lang.ArrayIndexOutOfBoundsException: -1
	at org.joda.time.YearMonth.getFieldType(YearMonth.java:418)
	at org.joda.time.base.AbstractPartial.indexOf(AbstractPartial.java:49)
	at org.joda.time.base.AbstractPartial.indexOfSupported(AbstractPartial.java:51)
	at org.joda.time.YearMonth.withFieldAdded(YearMonth.java:506)
	at org.joda.time.YearMonth.plusMonths(YearMonth.java:601)
	at org.joda.time.YearMonth.toInterval(YearMonth.java:699)
	at org.joda.time.YearMonth.toInterval(YearMonth.java:683)
	at org.joda.time.TestYearMonth_Basics.testToInterval(TestYearMonth_Basics.java:540)

testWithFieldAdded_nullField_zero(org.joda.time.TestYearMonth_Basics)  Time elapsed: 0.001 sec  <<< ERROR!
java.lang.ArrayIndexOutOfBoundsException: -1
	at org.joda.time.YearMonth.getFieldType(YearMonth.java:418)
	at org.joda.time.base.AbstractPartial.indexOf(AbstractPartial.java:49)
	at org.joda.time.base.AbstractPartial.indexOfSupported(AbstractPartial.java:51)
	at org.joda.time.YearMonth.withFieldAdded(YearMonth.java:506)
	at org.joda.time.TestYearMonth_Basics.testWithFieldAdded_nullField_zero(TestYearMonth_Basics.java:411)

testWithFieldAdded_nullField_nonZero(org.joda.time.TestYearMonth_Basics)  Time elapsed: 0.001 sec  <<< ERROR!
java.lang.ArrayIndexOutOfBoundsException: -1
	at org.joda.time.YearMonth.getFieldType(YearMonth.java:418)
	at org.joda.time.base.AbstractPartial.indexOf(AbstractPartial.java:49)
	at org.joda.time.base.AbstractPartial.indexOfSupported(AbstractPartial.java:51)
	at org.joda.time.YearMonth.withFieldAdded(YearMonth.java:506)
	at org.joda.time.TestYearMonth_Basics.testWithFieldAdded_nullField_nonZero(TestYearMonth_Basics.java:419)

testWithFieldAdded_unknownField(org.joda.time.TestYearMonth_Basics)  Time elapsed: 0 sec  <<< ERROR!
java.lang.ArrayIndexOutOfBoundsException: -1
	at org.joda.time.YearMonth.getFieldType(YearMonth.java:418)
	at org.joda.time.base.AbstractPartial.indexOf(AbstractPartial.java:49)
	at org.joda.time.base.AbstractPartial.indexOfSupported(AbstractPartial.java:51)
	at org.joda.time.YearMonth.withFieldAdded(YearMonth.java:506)
	at org.joda.time.TestYearMonth_Basics.testWithFieldAdded_unknownField(TestYearMonth_Basics.java:433)

testPlus_RP(org.joda.time.TestMonthDay_Basics)  Time elapsed: 0.001 sec  <<< ERROR!
java.lang.ArrayIndexOutOfBoundsException: -1
	at org.joda.time.MonthDay.getFieldType(MonthDay.java:426)
	at org.joda.time.base.AbstractPartial.indexOf(AbstractPartial.java:49)
	at org.joda.time.MonthDay.withPeriodAdded(MonthDay.java:546)
	at org.joda.time.MonthDay.plus(MonthDay.java:570)
	at org.joda.time.TestMonthDay_Basics.testPlus_RP(TestMonthDay_Basics.java:436)

testPlusDays_int(org.joda.time.TestMonthDay_Basics)  Time elapsed: 0.001 sec  <<< ERROR!
java.lang.ArrayIndexOutOfBoundsException: -1
	at org.joda.time.MonthDay.getFieldType(MonthDay.java:426)
	at org.joda.time.base.AbstractPartial.indexOf(AbstractPartial.java:49)
	at org.joda.time.base.AbstractPartial.indexOfSupported(AbstractPartial.java:51)
	at org.joda.time.MonthDay.withFieldAdded(MonthDay.java:514)
	at org.joda.time.MonthDay.plusDays(MonthDay.java:615)
	at org.joda.time.TestMonthDay_Basics.testPlusDays_int(TestMonthDay_Basics.java:502)

testMinus_RP(org.joda.time.TestMonthDay_Basics)  Time elapsed: 0.001 sec  <<< ERROR!
java.lang.ArrayIndexOutOfBoundsException: -1
	at org.joda.time.MonthDay.getFieldType(MonthDay.java:426)
	at org.joda.time.base.AbstractPartial.indexOf(AbstractPartial.java:49)
	at org.joda.time.MonthDay.withPeriodAdded(MonthDay.java:546)
	at org.joda.time.MonthDay.minus(MonthDay.java:633)
	at org.joda.time.TestMonthDay_Basics.testMinus_RP(TestMonthDay_Basics.java:572)

testMinusDays_int(org.joda.time.TestMonthDay_Basics)  Time elapsed: 0.001 sec  <<< ERROR!
java.lang.ArrayIndexOutOfBoundsException: -1
	at org.joda.time.MonthDay.getFieldType(MonthDay.java:426)
	at org.joda.time.base.AbstractPartial.indexOf(AbstractPartial.java:49)
	at org.joda.time.base.AbstractPartial.indexOfSupported(AbstractPartial.java:51)
	at org.joda.time.MonthDay.withFieldAdded(MonthDay.java:514)
	at org.joda.time.MonthDay.minusDays(MonthDay.java:675)
	at org.joda.time.TestMonthDay_Basics.testMinusDays_int(TestMonthDay_Basics.java:638)

testWithFieldAdded_nullField_zero(org.joda.time.TestMonthDay_Basics)  Time elapsed: 0.001 sec  <<< ERROR!
java.lang.ArrayIndexOutOfBoundsException: -1
	at org.joda.time.MonthDay.getFieldType(MonthDay.java:426)
	at org.joda.time.base.AbstractPartial.indexOf(AbstractPartial.java:49)
	at org.joda.time.base.AbstractPartial.indexOfSupported(AbstractPartial.java:51)
	at org.joda.time.MonthDay.withFieldAdded(MonthDay.java:514)
	at org.joda.time.TestMonthDay_Basics.testWithFieldAdded_nullField_zero(TestMonthDay_Basics.java:406)

testWithFieldAdded_nullField_nonZero(org.joda.time.TestMonthDay_Basics)  Time elapsed: 0 sec  <<< ERROR!
java.lang.ArrayIndexOutOfBoundsException: -1
	at org.joda.time.MonthDay.getFieldType(MonthDay.java:426)
	at org.joda.time.base.AbstractPartial.indexOf(AbstractPartial.java:49)
	at org.joda.time.base.AbstractPartial.indexOfSupported(AbstractPartial.java:51)
	at org.joda.time.MonthDay.withFieldAdded(MonthDay.java:514)
	at org.joda.time.TestMonthDay_Basics.testWithFieldAdded_nullField_nonZero(TestMonthDay_Basics.java:414)

testWithFieldAdded_unknownField(org.joda.time.TestMonthDay_Basics)  Time elapsed: 0.001 sec  <<< ERROR!
java.lang.ArrayIndexOutOfBoundsException: -1
	at org.joda.time.MonthDay.getFieldType(MonthDay.java:426)
	at org.joda.time.base.AbstractPartial.indexOf(AbstractPartial.java:49)
	at org.joda.time.base.AbstractPartial.indexOfSupported(AbstractPartial.java:51)
	at org.joda.time.MonthDay.withFieldAdded(MonthDay.java:514)
	at org.joda.time.TestMonthDay_Basics.testWithFieldAdded_unknownField(TestMonthDay_Basics.java:428)

testPlusDays_int_wrapMonth(org.joda.time.TestMonthDay_Basics)  Time elapsed: 0 sec  <<< ERROR!
java.lang.ArrayIndexOutOfBoundsException: -1
	at org.joda.time.MonthDay.getFieldType(MonthDay.java:426)
	at org.joda.time.base.AbstractPartial.indexOf(AbstractPartial.java:49)
	at org.joda.time.base.AbstractPartial.indexOfSupported(AbstractPartial.java:51)
	at org.joda.time.MonthDay.withFieldAdded(MonthDay.java:514)
	at org.joda.time.MonthDay.plusDays(MonthDay.java:615)
	at org.joda.time.TestMonthDay_Basics.testPlusDays_int_wrapMonth(TestMonthDay_Basics.java:509)

testPlusDays_int_wrapMonthTwice(org.joda.time.TestMonthDay_Basics)  Time elapsed: 0.001 sec  <<< ERROR!
java.lang.ArrayIndexOutOfBoundsException: -1
	at org.joda.time.MonthDay.getFieldType(MonthDay.java:426)
	at org.joda.time.base.AbstractPartial.indexOf(AbstractPartial.java:49)
	at org.joda.time.base.AbstractPartial.indexOfSupported(AbstractPartial.java:51)
	at org.joda.time.MonthDay.withFieldAdded(MonthDay.java:514)
	at org.joda.time.MonthDay.plusDays(MonthDay.java:615)
	at org.joda.time.TestMonthDay_Basics.testPlusDays_int_wrapMonthTwice(TestMonthDay_Basics.java:516)

testPlusDays_int_wrapMonthIntoNextYear(org.joda.time.TestMonthDay_Basics)  Time elapsed: 0 sec  <<< ERROR!
java.lang.ArrayIndexOutOfBoundsException: -1
	at org.joda.time.MonthDay.getFieldType(MonthDay.java:426)
	at org.joda.time.base.AbstractPartial.indexOf(AbstractPartial.java:49)
	at org.joda.time.base.AbstractPartial.indexOfSupported(AbstractPartial.java:51)
	at org.joda.time.MonthDay.withFieldAdded(MonthDay.java:514)
	at org.joda.time.MonthDay.plusDays(MonthDay.java:615)
	at org.joda.time.TestMonthDay_Basics.testPlusDays_int_wrapMonthIntoNextYear(TestMonthDay_Basics.java:523)

testPlusDays_int_wrapMonthTwiceIntoNextYear(org.joda.time.TestMonthDay_Basics)  Time elapsed: 0.001 sec  <<< ERROR!
java.lang.ArrayIndexOutOfBoundsException: -1
	at org.joda.time.MonthDay.getFieldType(MonthDay.java:426)
	at org.joda.time.base.AbstractPartial.indexOf(AbstractPartial.java:49)
	at org.joda.time.base.AbstractPartial.indexOfSupported(AbstractPartial.java:51)
	at org.joda.time.MonthDay.withFieldAdded(MonthDay.java:514)
	at org.joda.time.MonthDay.plusDays(MonthDay.java:615)
	at org.joda.time.TestMonthDay_Basics.testPlusDays_int_wrapMonthTwiceIntoNextYear(TestMonthDay_Basics.java:530)

testPlusDays_int_wrap50(org.joda.time.TestMonthDay_Basics)  Time elapsed: 0 sec  <<< ERROR!
java.lang.ArrayIndexOutOfBoundsException: -1
	at org.joda.time.MonthDay.getFieldType(MonthDay.java:426)
	at org.joda.time.base.AbstractPartial.indexOf(AbstractPartial.java:49)
	at org.joda.time.base.AbstractPartial.indexOfSupported(AbstractPartial.java:51)
	at org.joda.time.MonthDay.withFieldAdded(MonthDay.java:514)
	at org.joda.time.MonthDay.plusDays(MonthDay.java:615)
	at org.joda.time.TestMonthDay_Basics.testPlusDays_int_wrap50(TestMonthDay_Basics.java:537)

testPlusDays_int_toLeap(org.joda.time.TestMonthDay_Basics)  Time elapsed: 0.001 sec  <<< ERROR!
java.lang.ArrayIndexOutOfBoundsException: -1
	at org.joda.time.MonthDay.getFieldType(MonthDay.java:426)
	at org.joda.time.base.AbstractPartial.indexOf(AbstractPartial.java:49)
	at org.joda.time.base.AbstractPartial.indexOfSupported(AbstractPartial.java:51)
	at org.joda.time.MonthDay.withFieldAdded(MonthDay.java:514)
	at org.joda.time.MonthDay.plusDays(MonthDay.java:615)
	at org.joda.time.TestMonthDay_Basics.testPlusDays_int_toLeap(TestMonthDay_Basics.java:544)

testPlusDays_int_fromLeap(org.joda.time.TestMonthDay_Basics)  Time elapsed: 0.001 sec  <<< ERROR!
java.lang.ArrayIndexOutOfBoundsException: -1
	at org.joda.time.MonthDay.getFieldType(MonthDay.java:426)
	at org.joda.time.base.AbstractPartial.indexOf(AbstractPartial.java:49)
	at org.joda.time.base.AbstractPartial.indexOfSupported(AbstractPartial.java:51)
	at org.joda.time.MonthDay.withFieldAdded(MonthDay.java:514)
	at org.joda.time.MonthDay.plusDays(MonthDay.java:615)
	at org.joda.time.TestMonthDay_Basics.testPlusDays_int_fromLeap(TestMonthDay_Basics.java:551)

testPlusDays_int_negativeFromLeap(org.joda.time.TestMonthDay_Basics)  Time elapsed: 0 sec  <<< ERROR!
java.lang.ArrayIndexOutOfBoundsException: -1
	at org.joda.time.MonthDay.getFieldType(MonthDay.java:426)
	at org.joda.time.base.AbstractPartial.indexOf(AbstractPartial.java:49)
	at org.joda.time.base.AbstractPartial.indexOfSupported(AbstractPartial.java:51)
	at org.joda.time.MonthDay.withFieldAdded(MonthDay.java:514)
	at org.joda.time.MonthDay.plusDays(MonthDay.java:615)
	at org.joda.time.TestMonthDay_Basics.testPlusDays_int_negativeFromLeap(TestMonthDay_Basics.java:558)

testPlusDays_same(org.joda.time.TestMonthDay_Basics)  Time elapsed: 0.001 sec  <<< ERROR!
java.lang.ArrayIndexOutOfBoundsException: -1
	at org.joda.time.MonthDay.getFieldType(MonthDay.java:426)
	at org.joda.time.base.AbstractPartial.indexOf(AbstractPartial.java:49)
	at org.joda.time.base.AbstractPartial.indexOfSupported(AbstractPartial.java:51)
	at org.joda.time.MonthDay.withFieldAdded(MonthDay.java:514)
	at org.joda.time.MonthDay.plusDays(MonthDay.java:615)
	at org.joda.time.TestMonthDay_Basics.testPlusDays_same(TestMonthDay_Basics.java:565)

testMinusDays_int_wrapMonth(org.joda.time.TestMonthDay_Basics)  Time elapsed: 0.001 sec  <<< ERROR!
java.lang.ArrayIndexOutOfBoundsException: -1
	at org.joda.time.MonthDay.getFieldType(MonthDay.java:426)
	at org.joda.time.base.AbstractPartial.indexOf(AbstractPartial.java:49)
	at org.joda.time.base.AbstractPartial.indexOfSupported(AbstractPartial.java:51)
	at org.joda.time.MonthDay.withFieldAdded(MonthDay.java:514)
	at org.joda.time.MonthDay.minusDays(MonthDay.java:675)
	at org.joda.time.TestMonthDay_Basics.testMinusDays_int_wrapMonth(TestMonthDay_Basics.java:645)

testMinusDays_int_wrapMonthTwice(org.joda.time.TestMonthDay_Basics)  Time elapsed: 0 sec  <<< ERROR!
java.lang.ArrayIndexOutOfBoundsException: -1
	at org.joda.time.MonthDay.getFieldType(MonthDay.java:426)
	at org.joda.time.base.AbstractPartial.indexOf(AbstractPartial.java:49)
	at org.joda.time.base.AbstractPartial.indexOfSupported(AbstractPartial.java:51)
	at org.joda.time.MonthDay.withFieldAdded(MonthDay.java:514)
	at org.joda.time.MonthDay.minusDays(MonthDay.java:675)
	at org.joda.time.TestMonthDay_Basics.testMinusDays_int_wrapMonthTwice(TestMonthDay_Basics.java:652)

testMinusDays_int_wrapMonthIntoLastYear(org.joda.time.TestMonthDay_Basics)  Time elapsed: 0.001 sec  <<< ERROR!
java.lang.ArrayIndexOutOfBoundsException: -1
	at org.joda.time.MonthDay.getFieldType(MonthDay.java:426)
	at org.joda.time.base.AbstractPartial.indexOf(AbstractPartial.java:49)
	at org.joda.time.base.AbstractPartial.indexOfSupported(AbstractPartial.java:51)
	at org.joda.time.MonthDay.withFieldAdded(MonthDay.java:514)
	at org.joda.time.MonthDay.minusDays(MonthDay.java:675)
	at org.joda.time.TestMonthDay_Basics.testMinusDays_int_wrapMonthIntoLastYear(TestMonthDay_Basics.java:659)

testMinusDays_int_wrapMonthTwiceIntoLastYear(org.joda.time.TestMonthDay_Basics)  Time elapsed: 0.001 sec  <<< ERROR!
java.lang.ArrayIndexOutOfBoundsException: -1
	at org.joda.time.MonthDay.getFieldType(MonthDay.java:426)
	at org.joda.time.base.AbstractPartial.indexOf(AbstractPartial.java:49)
	at org.joda.time.base.AbstractPartial.indexOfSupported(AbstractPartial.java:51)
	at org.joda.time.MonthDay.withFieldAdded(MonthDay.java:514)
	at org.joda.time.MonthDay.minusDays(MonthDay.java:675)
	at org.joda.time.TestMonthDay_Basics.testMinusDays_int_wrapMonthTwiceIntoLastYear(TestMonthDay_Basics.java:666)

testMinusDays_int_toLeap(org.joda.time.TestMonthDay_Basics)  Time elapsed: 0 sec  <<< ERROR!
java.lang.ArrayIndexOutOfBoundsException: -1
	at org.joda.time.MonthDay.getFieldType(MonthDay.java:426)
	at org.joda.time.base.AbstractPartial.indexOf(AbstractPartial.java:49)
	at org.joda.time.base.AbstractPartial.indexOfSupported(AbstractPartial.java:51)
	at org.joda.time.MonthDay.withFieldAdded(MonthDay.java:514)
	at org.joda.time.MonthDay.minusDays(MonthDay.java:675)
	at org.joda.time.TestMonthDay_Basics.testMinusDays_int_toLeap(TestMonthDay_Basics.java:673)

testMinusDays_int_fromLeap(org.joda.time.TestMonthDay_Basics)  Time elapsed: 0.003 sec  <<< ERROR!
java.lang.ArrayIndexOutOfBoundsException: -1
	at org.joda.time.MonthDay.getFieldType(MonthDay.java:426)
	at org.joda.time.base.AbstractPartial.indexOf(AbstractPartial.java:49)
	at org.joda.time.base.AbstractPartial.indexOfSupported(AbstractPartial.java:51)
	at org.joda.time.MonthDay.withFieldAdded(MonthDay.java:514)
	at org.joda.time.MonthDay.minusDays(MonthDay.java:675)
	at org.joda.time.TestMonthDay_Basics.testMinusDays_int_fromLeap(TestMonthDay_Basics.java:680)

testMinusDays_int_negativeFromLeap(org.joda.time.TestMonthDay_Basics)  Time elapsed: 0 sec  <<< ERROR!
java.lang.ArrayIndexOutOfBoundsException: -1
	at org.joda.time.MonthDay.getFieldType(MonthDay.java:426)
	at org.joda.time.base.AbstractPartial.indexOf(AbstractPartial.java:49)
	at org.joda.time.base.AbstractPartial.indexOfSupported(AbstractPartial.java:51)
	at org.joda.time.MonthDay.withFieldAdded(MonthDay.java:514)
	at org.joda.time.MonthDay.minusDays(MonthDay.java:675)
	at org.joda.time.TestMonthDay_Basics.testMinusDays_int_negativeFromLeap(TestMonthDay_Basics.java:687)

testMinusDays_same(org.joda.time.TestMonthDay_Basics)  Time elapsed: 0 sec  <<< ERROR!
java.lang.ArrayIndexOutOfBoundsException: -1
	at org.joda.time.MonthDay.getFieldType(MonthDay.java:426)
	at org.joda.time.base.AbstractPartial.indexOf(AbstractPartial.java:49)
	at org.joda.time.base.AbstractPartial.indexOfSupported(AbstractPartial.java:51)
	at org.joda.time.MonthDay.withFieldAdded(MonthDay.java:514)
	at org.joda.time.MonthDay.minusDays(MonthDay.java:675)
	at org.joda.time.TestMonthDay_Basics.testMinusDays_same(TestMonthDay_Basics.java:694)

testWithFieldAdded2(org.joda.time.TestPartial_Basics)  Time elapsed: 0.011 sec  <<< ERROR!
java.lang.ArrayIndexOutOfBoundsException: -1
	at org.joda.time.Partial.getFieldType(Partial.java:369)
	at org.joda.time.base.AbstractPartial.indexOf(AbstractPartial.java:49)
	at org.joda.time.base.AbstractPartial.indexOfSupported(AbstractPartial.java:51)
	at org.joda.time.Partial.withFieldAdded(Partial.java:571)
	at org.joda.time.TestPartial_Basics.testWithFieldAdded2(TestPartial_Basics.java:562)

testWithFieldAdded3(org.joda.time.TestPartial_Basics)  Time elapsed: 0 sec  <<< ERROR!
java.lang.ArrayIndexOutOfBoundsException: -1
	at org.joda.time.Partial.getFieldType(Partial.java:369)
	at org.joda.time.base.AbstractPartial.indexOf(AbstractPartial.java:49)
	at org.joda.time.base.AbstractPartial.indexOfSupported(AbstractPartial.java:51)
	at org.joda.time.Partial.withFieldAdded(Partial.java:571)
	at org.joda.time.TestPartial_Basics.testWithFieldAdded3(TestPartial_Basics.java:571)

testPlus_RP(org.joda.time.TestPartial_Basics)  Time elapsed: 0 sec  <<< ERROR!
java.lang.ArrayIndexOutOfBoundsException: -1
	at org.joda.time.Partial.getFieldType(Partial.java:369)
	at org.joda.time.base.AbstractPartial.indexOf(AbstractPartial.java:49)
	at org.joda.time.Partial.withPeriodAdded(Partial.java:626)
	at org.joda.time.Partial.plus(Partial.java:645)
	at org.joda.time.TestPartial_Basics.testPlus_RP(TestPartial_Basics.java:722)

testMinus_RP(org.joda.time.TestPartial_Basics)  Time elapsed: 0.001 sec  <<< ERROR!
java.lang.ArrayIndexOutOfBoundsException: -1
	at org.joda.time.Partial.getFieldType(Partial.java:369)
	at org.joda.time.base.AbstractPartial.indexOf(AbstractPartial.java:49)
	at org.joda.time.Partial.withPeriodAdded(Partial.java:626)
	at org.joda.time.Partial.minus(Partial.java:658)
	at org.joda.time.TestPartial_Basics.testMinus_RP(TestPartial_Basics.java:733)

testWithFieldAdded5(org.joda.time.TestPartial_Basics)  Time elapsed: 0 sec  <<< ERROR!
java.lang.ArrayIndexOutOfBoundsException: -1
	at org.joda.time.Partial.getFieldType(Partial.java:369)
	at org.joda.time.base.AbstractPartial.indexOf(AbstractPartial.java:49)
	at org.joda.time.base.AbstractPartial.indexOfSupported(AbstractPartial.java:51)
	at org.joda.time.Partial.withFieldAdded(Partial.java:571)
	at org.joda.time.TestPartial_Basics.testWithFieldAdded5(TestPartial_Basics.java:586)

testWithFieldAdded7(org.joda.time.TestPartial_Basics)  Time elapsed: 0 sec  <<< ERROR!
java.lang.ArrayIndexOutOfBoundsException: -1
	at org.joda.time.Partial.getFieldType(Partial.java:369)
	at org.joda.time.base.AbstractPartial.indexOf(AbstractPartial.java:49)
	at org.joda.time.base.AbstractPartial.indexOfSupported(AbstractPartial.java:51)
	at org.joda.time.Partial.withFieldAdded(Partial.java:571)
	at org.joda.time.TestPartial_Basics.testWithFieldAdded7(TestPartial_Basics.java:606)

testWithFieldAdded8(org.joda.time.TestPartial_Basics)  Time elapsed: 0 sec  <<< ERROR!
java.lang.ArrayIndexOutOfBoundsException: -1
	at org.joda.time.Partial.getFieldType(Partial.java:369)
	at org.joda.time.base.AbstractPartial.indexOf(AbstractPartial.java:49)
	at org.joda.time.base.AbstractPartial.indexOfSupported(AbstractPartial.java:51)
	at org.joda.time.Partial.withFieldAdded(Partial.java:571)
	at org.joda.time.TestPartial_Basics.testWithFieldAdded8(TestPartial_Basics.java:626)

testWithFieldAddWrapped2(org.joda.time.TestPartial_Basics)  Time elapsed: 0 sec  <<< ERROR!
java.lang.ArrayIndexOutOfBoundsException: -1
	at org.joda.time.Partial.getFieldType(Partial.java:369)
	at org.joda.time.base.AbstractPartial.indexOf(AbstractPartial.java:49)
	at org.joda.time.base.AbstractPartial.indexOfSupported(AbstractPartial.java:51)
	at org.joda.time.Partial.withFieldAddWrapped(Partial.java:595)
	at org.joda.time.TestPartial_Basics.testWithFieldAddWrapped2(TestPartial_Basics.java:656)

testWithFieldAddWrapped3(org.joda.time.TestPartial_Basics)  Time elapsed: 0 sec  <<< ERROR!
java.lang.ArrayIndexOutOfBoundsException: -1
	at org.joda.time.Partial.getFieldType(Partial.java:369)
	at org.joda.time.base.AbstractPartial.indexOf(AbstractPartial.java:49)
	at org.joda.time.base.AbstractPartial.indexOfSupported(AbstractPartial.java:51)
	at org.joda.time.Partial.withFieldAddWrapped(Partial.java:595)
	at org.joda.time.TestPartial_Basics.testWithFieldAddWrapped3(TestPartial_Basics.java:665)

testWithFieldAddWrapped5(org.joda.time.TestPartial_Basics)  Time elapsed: 0.001 sec  <<< ERROR!
java.lang.ArrayIndexOutOfBoundsException: -1
	at org.joda.time.Partial.getFieldType(Partial.java:369)
	at org.joda.time.base.AbstractPartial.indexOf(AbstractPartial.java:49)
	at org.joda.time.base.AbstractPartial.indexOfSupported(AbstractPartial.java:51)
	at org.joda.time.Partial.withFieldAddWrapped(Partial.java:595)
	at org.joda.time.TestPartial_Basics.testWithFieldAddWrapped5(TestPartial_Basics.java:680)

testWithFieldAddWrapped7(org.joda.time.TestPartial_Basics)  Time elapsed: 0 sec  <<< ERROR!
java.lang.ArrayIndexOutOfBoundsException: -1
	at org.joda.time.Partial.getFieldType(Partial.java:369)
	at org.joda.time.base.AbstractPartial.indexOf(AbstractPartial.java:49)
	at org.joda.time.base.AbstractPartial.indexOfSupported(AbstractPartial.java:51)
	at org.joda.time.Partial.withFieldAddWrapped(Partial.java:595)
	at org.joda.time.TestPartial_Basics.testWithFieldAddWrapped7(TestPartial_Basics.java:697)

testWithFieldAddWrapped8(org.joda.time.TestPartial_Basics)  Time elapsed: 0.001 sec  <<< ERROR!
java.lang.ArrayIndexOutOfBoundsException: -1
	at org.joda.time.Partial.getFieldType(Partial.java:369)
	at org.joda.time.base.AbstractPartial.indexOf(AbstractPartial.java:49)
	at org.joda.time.base.AbstractPartial.indexOfSupported(AbstractPartial.java:51)
	at org.joda.time.Partial.withFieldAddWrapped(Partial.java:595)
	at org.joda.time.TestPartial_Basics.testWithFieldAddWrapped8(TestPartial_Basics.java:709)

testCutoverAddMonths(org.joda.time.chrono.TestGJChronology)  Time elapsed: 0.001 sec  <<< ERROR!
java.lang.ArrayIndexOutOfBoundsException: -1
	at org.joda.time.YearMonthDay.getFieldType(YearMonthDay.java:351)
	at org.joda.time.base.AbstractPartial.indexOf(AbstractPartial.java:49)
	at org.joda.time.base.AbstractPartial.indexOfSupported(AbstractPartial.java:51)
	at org.joda.time.YearMonthDay.withFieldAdded(YearMonthDay.java:439)
	at org.joda.time.chrono.TestGJChronology.testAdd(TestGJChronology.java:496)
	at org.joda.time.chrono.TestGJChronology.testCutoverAddMonths(TestGJChronology.java:422)

testCutoverAddDays(org.joda.time.chrono.TestGJChronology)  Time elapsed: 0 sec  <<< ERROR!
java.lang.ArrayIndexOutOfBoundsException: -1
	at org.joda.time.YearMonthDay.getFieldType(YearMonthDay.java:351)
	at org.joda.time.base.AbstractPartial.indexOf(AbstractPartial.java:49)
	at org.joda.time.base.AbstractPartial.indexOfSupported(AbstractPartial.java:51)
	at org.joda.time.YearMonthDay.withFieldAdded(YearMonthDay.java:439)
	at org.joda.time.chrono.TestGJChronology.testAdd(TestGJChronology.java:496)
	at org.joda.time.chrono.TestGJChronology.testCutoverAddDays(TestGJChronology.java:452)

testYearEndAddDays(org.joda.time.chrono.TestGJChronology)  Time elapsed: 0.001 sec  <<< ERROR!
java.lang.ArrayIndexOutOfBoundsException: -1
	at org.joda.time.YearMonthDay.getFieldType(YearMonthDay.java:351)
	at org.joda.time.base.AbstractPartial.indexOf(AbstractPartial.java:49)
	at org.joda.time.base.AbstractPartial.indexOfSupported(AbstractPartial.java:51)
	at org.joda.time.YearMonthDay.withFieldAdded(YearMonthDay.java:439)
	at org.joda.time.chrono.TestGJChronology.testAdd(TestGJChronology.java:496)
	at org.joda.time.chrono.TestGJChronology.testYearEndAddDays(TestGJChronology.java:462)

testSubtractDays(org.joda.time.chrono.TestGJChronology)  Time elapsed: 0.002 sec  <<< ERROR!
java.lang.ArrayIndexOutOfBoundsException: -1
	at org.joda.time.YearMonthDay.getFieldType(YearMonthDay.java:351)
	at org.joda.time.base.AbstractPartial.indexOf(AbstractPartial.java:49)
	at org.joda.time.YearMonthDay.withPeriodAdded(YearMonthDay.java:471)
	at org.joda.time.YearMonthDay.minus(YearMonthDay.java:574)
	at org.joda.time.chrono.TestGJChronology.testSubtractDays(TestGJChronology.java:477)

testTimeOfDayAdd(org.joda.time.chrono.TestGJChronology)  Time elapsed: 0.001 sec  <<< ERROR!
java.lang.ArrayIndexOutOfBoundsException: -1
	at org.joda.time.TimeOfDay.getFieldType(TimeOfDay.java:464)
	at org.joda.time.base.AbstractPartial.indexOf(AbstractPartial.java:49)
	at org.joda.time.base.AbstractPartial.indexOfSupported(AbstractPartial.java:51)
	at org.joda.time.TimeOfDay.withFieldAdded(TimeOfDay.java:553)
	at org.joda.time.TimeOfDay.plusMinutes(TimeOfDay.java:652)
	at org.joda.time.chrono.TestGJChronology.testTimeOfDayAdd(TestGJChronology.java:506)

testAddMonths(org.joda.time.chrono.TestISOChronology)  Time elapsed: 0.001 sec  <<< ERROR!
java.lang.ArrayIndexOutOfBoundsException

testPartialDayOfYearAdd(org.joda.time.chrono.TestISOChronology)  Time elapsed: 0.001 sec  <<< ERROR!
java.lang.ArrayIndexOutOfBoundsException: -1
	at org.joda.time.Partial.getFieldType(Partial.java:369)
	at org.joda.time.base.AbstractPartial.indexOf(AbstractPartial.java:49)
	at org.joda.time.base.AbstractPartial.indexOfSupported(AbstractPartial.java:51)
	at org.joda.time.Partial.withFieldAdded(Partial.java:571)
	at org.joda.time.chrono.TestISOChronology.testPartialDayOfYearAdd(TestISOChronology.java:442)

testTimeOfDayAdd(org.joda.time.chrono.TestISOChronology)  Time elapsed: 0 sec  <<< ERROR!
java.lang.ArrayIndexOutOfBoundsException: -1
	at org.joda.time.TimeOfDay.getFieldType(TimeOfDay.java:464)
	at org.joda.time.base.AbstractPartial.indexOf(AbstractPartial.java:49)
	at org.joda.time.base.AbstractPartial.indexOfSupported(AbstractPartial.java:51)
	at org.joda.time.TimeOfDay.withFieldAdded(TimeOfDay.java:553)
	at org.joda.time.TimeOfDay.plusMinutes(TimeOfDay.java:652)
	at org.joda.time.chrono.TestISOChronology.testTimeOfDayAdd(TestISOChronology.java:435)


Results :

Tests in error: 
  org.joda.time.TestMonthDay_Basics#testMinusDays_int ArrayIndexOutOfBoundsException
  org.joda.time.TestMonthDay_Basics#testMinusDays_int_fromLeap ArrayIndexOutOfBoundsException
  org.joda.time.TestMonthDay_Basics#testMinusDays_int_negativeFromLeap ArrayIndexOutOfBoundsException
  org.joda.time.TestMonthDay_Basics#testMinusDays_int_toLeap ArrayIndexOutOfBoundsException
  org.joda.time.TestMonthDay_Basics#testMinusDays_int_wrapMonth ArrayIndexOutOfBoundsException
  org.joda.time.TestMonthDay_Basics#testMinusDays_int_wrapMonthIntoLastYear ArrayIndexOutOfBoundsException
  org.joda.time.TestMonthDay_Basics#testMinusDays_int_wrapMonthTwice ArrayIndexOutOfBoundsException
  org.joda.time.TestMonthDay_Basics#testMinusDays_int_wrapMonthTwiceIntoLastYear ArrayIndexOutOfBoundsException
  org.joda.time.TestMonthDay_Basics#testMinusDays_same ArrayIndexOutOfBoundsException
  org.joda.time.TestMonthDay_Basics#testMinus_RP ArrayIndexOutOfBoundsException ...
  org.joda.time.TestMonthDay_Basics#testPlusDays_int ArrayIndexOutOfBoundsException
  org.joda.time.TestMonthDay_Basics#testPlusDays_int_fromLeap ArrayIndexOutOfBoundsException
  org.joda.time.TestMonthDay_Basics#testPlusDays_int_negativeFromLeap ArrayIndexOutOfBoundsException
  org.joda.time.TestMonthDay_Basics#testPlusDays_int_toLeap ArrayIndexOutOfBoundsException
  org.joda.time.TestMonthDay_Basics#testPlusDays_int_wrap50 ArrayIndexOutOfBoundsException
  org.joda.time.TestMonthDay_Basics#testPlusDays_int_wrapMonth ArrayIndexOutOfBoundsException
  org.joda.time.TestMonthDay_Basics#testPlusDays_int_wrapMonthIntoNextYear ArrayIndexOutOfBoundsException
  org.joda.time.TestMonthDay_Basics#testPlusDays_int_wrapMonthTwice ArrayIndexOutOfBoundsException
  org.joda.time.TestMonthDay_Basics#testPlusDays_int_wrapMonthTwiceIntoNextYear ArrayIndexOutOfBoundsException
  org.joda.time.TestMonthDay_Basics#testPlusDays_same ArrayIndexOutOfBoundsException
  org.joda.time.TestMonthDay_Basics#testPlus_RP ArrayIndexOutOfBoundsException -...
  org.joda.time.TestMonthDay_Basics#testWithFieldAdded_nullField_nonZero ArrayIndexOutOfBoundsException
  org.joda.time.TestMonthDay_Basics#testWithFieldAdded_nullField_zero ArrayIndexOutOfBoundsException
  org.joda.time.TestMonthDay_Basics#testWithFieldAdded_unknownField ArrayIndexOutOfBoundsException
  org.joda.time.TestPartial_Basics#testMinus_RP ArrayIndexOutOfBoundsException -...
  org.joda.time.TestPartial_Basics#testPlus_RP ArrayIndexOutOfBoundsException -1
  org.joda.time.TestPartial_Basics#testWithFieldAddWrapped2 ArrayIndexOutOfBoundsException
  org.joda.time.TestPartial_Basics#testWithFieldAddWrapped3 ArrayIndexOutOfBoundsException
  org.joda.time.TestPartial_Basics#testWithFieldAddWrapped5 ArrayIndexOutOfBoundsException
  org.joda.time.TestPartial_Basics#testWithFieldAddWrapped7 ArrayIndexOutOfBoundsException
  org.joda.time.TestPartial_Basics#testWithFieldAddWrapped8 ArrayIndexOutOfBoundsException
  org.joda.time.TestPartial_Basics#testWithFieldAdded2 ArrayIndexOutOfBoundsException
  org.joda.time.TestPartial_Basics#testWithFieldAdded3 ArrayIndexOutOfBoundsException
  org.joda.time.TestPartial_Basics#testWithFieldAdded5 ArrayIndexOutOfBoundsException
  org.joda.time.TestPartial_Basics#testWithFieldAdded7 ArrayIndexOutOfBoundsException
  org.joda.time.TestPartial_Basics#testWithFieldAdded8 ArrayIndexOutOfBoundsException
  org.joda.time.TestTimeOfDay_Basics#testMinusMillis_int ArrayIndexOutOfBoundsException
  org.joda.time.TestTimeOfDay_Basics#testMinusMinutes_int ArrayIndexOutOfBoundsException
  org.joda.time.TestTimeOfDay_Basics#testMinusSeconds_int ArrayIndexOutOfBoundsException
  org.joda.time.TestTimeOfDay_Basics#testMinus_RP ArrayIndexOutOfBoundsException
  org.joda.time.TestTimeOfDay_Basics#testPlusMillis_int ArrayIndexOutOfBoundsException
  org.joda.time.TestTimeOfDay_Basics#testPlusMinutes_int ArrayIndexOutOfBoundsException
  org.joda.time.TestTimeOfDay_Basics#testPlusSeconds_int ArrayIndexOutOfBoundsException
  org.joda.time.TestTimeOfDay_Basics#testPlus_RP ArrayIndexOutOfBoundsException ...
  org.joda.time.TestTimeOfDay_Basics#testWithFieldAdded2 ArrayIndexOutOfBoundsException
  org.joda.time.TestTimeOfDay_Basics#testWithFieldAdded3 ArrayIndexOutOfBoundsException
  org.joda.time.TestTimeOfDay_Basics#testWithFieldAdded5 ArrayIndexOutOfBoundsException
  org.joda.time.TestTimeOfDay_Basics#testWithFieldAdded7 ArrayIndexOutOfBoundsException
  org.joda.time.TestTimeOfDay_Basics#testWithFieldAdded8 ArrayIndexOutOfBoundsException
  org.joda.time.TestYearMonthDay_Basics#testMinusDays_int ArrayIndexOutOfBoundsException
  org.joda.time.TestYearMonthDay_Basics#testMinusMonths_int ArrayIndexOutOfBoundsException
  org.joda.time.TestYearMonthDay_Basics#testMinus_RP ArrayIndexOutOfBoundsException
  org.joda.time.TestYearMonthDay_Basics#testPlusDays_int ArrayIndexOutOfBoundsException
  org.joda.time.TestYearMonthDay_Basics#testPlusMonths_int ArrayIndexOutOfBoundsException
  org.joda.time.TestYearMonthDay_Basics#testPlus_RP ArrayIndexOutOfBoundsException
  org.joda.time.TestYearMonthDay_Basics#testWithFieldAdded2 ArrayIndexOutOfBoundsException
  org.joda.time.TestYearMonthDay_Basics#testWithFieldAdded3 ArrayIndexOutOfBoundsException
  org.joda.time.TestYearMonthDay_Basics#testWithFieldAdded5 ArrayIndexOutOfBoundsException
  org.joda.time.TestYearMonth_Basics#testMinusMonths_int ArrayIndexOutOfBoundsException
  org.joda.time.TestYearMonth_Basics#testMinus_RP ArrayIndexOutOfBoundsException
  org.joda.time.TestYearMonth_Basics#testPlusMonths_int ArrayIndexOutOfBoundsException
  org.joda.time.TestYearMonth_Basics#testPlus_RP ArrayIndexOutOfBoundsException ...
  org.joda.time.TestYearMonth_Basics#testToInterval ArrayIndexOutOfBoundsException
  org.joda.time.TestYearMonth_Basics#testToInterval_Zone ArrayIndexOutOfBoundsException
  org.joda.time.TestYearMonth_Basics#testToInterval_nullZone ArrayIndexOutOfBoundsException
  org.joda.time.TestYearMonth_Basics#testWithFieldAdded_nullField_nonZero ArrayIndexOutOfBoundsException
  org.joda.time.TestYearMonth_Basics#testWithFieldAdded_nullField_zero ArrayIndexOutOfBoundsException
  org.joda.time.TestYearMonth_Basics#testWithFieldAdded_unknownField ArrayIndexOutOfBoundsException
  org.joda.time.chrono.TestGJChronology#testCutoverAddDays ArrayIndexOutOfBoundsException
  org.joda.time.chrono.TestGJChronology#testCutoverAddMonths ArrayIndexOutOfBoundsException
  org.joda.time.chrono.TestGJChronology#testSubtractDays ArrayIndexOutOfBoundsException
  org.joda.time.chrono.TestGJChronology#testTimeOfDayAdd ArrayIndexOutOfBoundsException
  org.joda.time.chrono.TestGJChronology#testYearEndAddDays ArrayIndexOutOfBoundsException
  org.joda.time.chrono.TestISOChronology#testAddMonths ArrayIndexOutOfBoundsException
  org.joda.time.chrono.TestISOChronology#testPartialDayOfYearAdd ArrayIndexOutOfBoundsException
  org.joda.time.chrono.TestISOChronology#testTimeOfDayAdd ArrayIndexOutOfBoundsException

Tests run: 4157, Failures: 0, Errors: 76, Skipped: 0

[INFO] ------------------------------------------------------------------------
[INFO] BUILD FAILURE
[INFO] ------------------------------------------------------------------------
[INFO] Total time: 16.585s
[INFO] Finished at: Wed Aug 05 20:41:05 BST 2015
[INFO] Final Memory: 9M/213M
[INFO] ------------------------------------------------------------------------
[ERROR] Failed to execute goal org.apache.maven.plugins:maven-surefire-plugin:2.18.1:test (default-test) on project joda-time: There are test failures.
[ERROR] 
[ERROR] Please refer to /home/perham/Study/LittleDarwin/Cases/joda-time-2.8.1/target/surefire-reports for the individual test results.
[ERROR] -> [Help 1]
[ERROR] 
[ERROR] To see the full stack trace of the errors, re-run Maven with the -e switch.
[ERROR] Re-run Maven using the -X switch to enable full debug logging.
[ERROR] 
[ERROR] For more information about the errors and possible solutions, please read the following articles:
[ERROR] [Help 1] http://cwiki.apache.org/confluence/display/MAVEN/MojoFailureException
