[INFO] Scanning for projects...
[INFO]                                                                         
[INFO] ------------------------------------------------------------------------
[INFO] Building Joda-Time 2.8.1
[INFO] ------------------------------------------------------------------------
[INFO] 
[INFO] --- maven-resources-plugin:2.7:resources (default-resources) @ joda-time ---
[INFO] Using 'UTF-8' encoding to copy filtered resources.
[INFO] Copying 2 resources to META-INF
[INFO] Copying 10 resources
[INFO] 
[INFO] --- maven-compiler-plugin:3.3:compile (default-compile) @ joda-time ---
[INFO] Changes detected - recompiling the module!
[INFO] Compiling 166 source files to /home/perham/Study/LittleDarwin/Cases/joda-time-2.8.1/target/classes
[INFO] 
[INFO] --- exec-maven-plugin:1.4.0:java (compile-tzdb) @ joda-time ---
Writing zoneinfo files
Writing ZoneInfoMap
[INFO] 
[INFO] --- maven-resources-plugin:2.7:testResources (default-testResources) @ joda-time ---
[INFO] Using 'UTF-8' encoding to copy filtered resources.
[INFO] Copying 34 resources
[INFO] 
[INFO] --- maven-compiler-plugin:3.3:testCompile (default-testCompile) @ joda-time ---
[INFO] Nothing to compile - all classes are up to date
[INFO] 
[INFO] --- maven-surefire-plugin:2.18.1:test (default-test) @ joda-time ---
[INFO] Surefire report directory: /home/perham/Study/LittleDarwin/Cases/joda-time-2.8.1/target/surefire-reports

-------------------------------------------------------
 T E S T S
-------------------------------------------------------
Running org.joda.time.TestAllPackages

TestBuddhistChronology.testCalendar

TestCopticChronology.testCalendar

TestEthiopicChronology.testCalendar

TestIslamicChronology.testCalendar

Testing Gregorian chronology over 1000 iterations
100% complete (i=1000)

Testing Julian chronology over 1000 iterations
100% complete (i=1000)
Writing zoneinfo files
Writing ZoneInfoMap
Tests run: 4157, Failures: 0, Errors: 129, Skipped: 0, Time elapsed: 5.355 sec <<< FAILURE! - in org.joda.time.TestAllPackages
testToYearMonthDay(org.joda.time.TestDateTime_Basics)  Time elapsed: 0.005 sec  <<< ERROR!
java.lang.ArrayIndexOutOfBoundsException: -1
	at org.joda.time.base.BasePartial.getValue(BasePartial.java:225)
	at org.joda.time.base.AbstractPartial.equals(AbstractPartial.java:64)
	at junit.framework.Assert.assertEquals(Assert.java:62)
	at junit.framework.Assert.assertEquals(Assert.java:71)
	at org.joda.time.TestDateTime_Basics.testToYearMonthDay(TestDateTime_Basics.java:722)

testToTimeOfDay(org.joda.time.TestDateTime_Basics)  Time elapsed: 0.001 sec  <<< ERROR!
java.lang.ArrayIndexOutOfBoundsException: -1
	at org.joda.time.base.BasePartial.getValue(BasePartial.java:225)
	at org.joda.time.base.AbstractPartial.equals(AbstractPartial.java:64)
	at junit.framework.Assert.assertEquals(Assert.java:62)
	at junit.framework.Assert.assertEquals(Assert.java:71)
	at org.joda.time.TestDateTime_Basics.testToTimeOfDay(TestDateTime_Basics.java:729)

testToYearMonthDay(org.joda.time.TestDateMidnight_Basics)  Time elapsed: 0 sec  <<< ERROR!
java.lang.ArrayIndexOutOfBoundsException: -1
	at org.joda.time.base.BasePartial.getValue(BasePartial.java:225)
	at org.joda.time.base.AbstractPartial.equals(AbstractPartial.java:64)
	at junit.framework.Assert.assertEquals(Assert.java:62)
	at junit.framework.Assert.assertEquals(Assert.java:71)
	at org.joda.time.TestDateMidnight_Basics.testToYearMonthDay(TestDateMidnight_Basics.java:644)

testEqualsHashCode(org.joda.time.TestLocalDateTime_Basics)  Time elapsed: 0.001 sec  <<< ERROR!
java.lang.IndexOutOfBoundsException: Invalid index: -1
	at org.joda.time.LocalDateTime.getValue(LocalDateTime.java:587)
	at org.joda.time.base.AbstractPartial.equals(AbstractPartial.java:64)
	at org.joda.time.LocalDateTime.equals(LocalDateTime.java:682)
	at org.joda.time.TestLocalDateTime_Basics.testEqualsHashCode(TestLocalDateTime_Basics.java:302)

testToDate_summer(org.joda.time.TestLocalDateTime_Basics)  Time elapsed: 0.001 sec  <<< ERROR!
java.lang.IndexOutOfBoundsException: Invalid index: -1
	at org.joda.time.LocalDateTime.getValue(LocalDateTime.java:587)
	at org.joda.time.base.AbstractPartial.equals(AbstractPartial.java:64)
	at org.joda.time.LocalDateTime.equals(LocalDateTime.java:682)
	at org.joda.time.LocalDateTime.correctDstTransition(LocalDateTime.java:865)
	at org.joda.time.LocalDateTime.toDate(LocalDateTime.java:799)
	at org.joda.time.TestLocalDateTime_Basics.testToDate_summer(TestLocalDateTime_Basics.java:853)

testToDate_winter(org.joda.time.TestLocalDateTime_Basics)  Time elapsed: 0.002 sec  <<< ERROR!
java.lang.IndexOutOfBoundsException: Invalid index: -1
	at org.joda.time.LocalDateTime.getValue(LocalDateTime.java:587)
	at org.joda.time.base.AbstractPartial.equals(AbstractPartial.java:64)
	at org.joda.time.LocalDateTime.equals(LocalDateTime.java:682)
	at org.joda.time.LocalDateTime.correctDstTransition(LocalDateTime.java:865)
	at org.joda.time.LocalDateTime.toDate(LocalDateTime.java:799)
	at org.joda.time.TestLocalDateTime_Basics.testToDate_winter(TestLocalDateTime_Basics.java:871)

testToDate_summer_Zone(org.joda.time.TestLocalDateTime_Basics)  Time elapsed: 0.001 sec  <<< ERROR!
java.lang.IndexOutOfBoundsException: Invalid index: -1
	at org.joda.time.LocalDateTime.getValue(LocalDateTime.java:587)
	at org.joda.time.base.AbstractPartial.equals(AbstractPartial.java:64)
	at org.joda.time.LocalDateTime.equals(LocalDateTime.java:682)
	at org.joda.time.LocalDateTime.correctDstTransition(LocalDateTime.java:865)
	at org.joda.time.LocalDateTime.toDate(LocalDateTime.java:830)
	at org.joda.time.TestLocalDateTime_Basics.testToDate_summer_Zone(TestLocalDateTime_Basics.java:938)

testToDate_winter_Zone(org.joda.time.TestLocalDateTime_Basics)  Time elapsed: 0.001 sec  <<< ERROR!
java.lang.IndexOutOfBoundsException: Invalid index: -1
	at org.joda.time.LocalDateTime.getValue(LocalDateTime.java:587)
	at org.joda.time.base.AbstractPartial.equals(AbstractPartial.java:64)
	at org.joda.time.LocalDateTime.equals(LocalDateTime.java:682)
	at org.joda.time.LocalDateTime.correctDstTransition(LocalDateTime.java:865)
	at org.joda.time.LocalDateTime.toDate(LocalDateTime.java:830)
	at org.joda.time.TestLocalDateTime_Basics.testToDate_winter_Zone(TestLocalDateTime_Basics.java:956)

testEqualsHashCode(org.joda.time.TestLocalDate_Basics)  Time elapsed: 0.002 sec  <<< ERROR!
java.lang.IndexOutOfBoundsException: Invalid index: -1
	at org.joda.time.LocalDate.getValue(LocalDate.java:532)
	at org.joda.time.base.AbstractPartial.equals(AbstractPartial.java:64)
	at org.joda.time.LocalDate.equals(LocalDate.java:641)
	at org.joda.time.TestLocalDate_Basics.testEqualsHashCode(TestLocalDate_Basics.java:264)

testToDate_summer(org.joda.time.TestLocalDate_Basics)  Time elapsed: 0.001 sec  <<< ERROR!
java.lang.IndexOutOfBoundsException: Invalid index: -1
	at org.joda.time.LocalDate.getValue(LocalDate.java:532)
	at org.joda.time.base.AbstractPartial.equals(AbstractPartial.java:64)
	at org.joda.time.LocalDate.equals(LocalDate.java:641)
	at org.joda.time.LocalDate.toDate(LocalDate.java:1032)
	at org.joda.time.TestLocalDate_Basics.testToDate_summer(TestLocalDate_Basics.java:1005)

testToDate_winter(org.joda.time.TestLocalDate_Basics)  Time elapsed: 0.001 sec  <<< ERROR!
java.lang.IndexOutOfBoundsException: Invalid index: -1
	at org.joda.time.LocalDate.getValue(LocalDate.java:532)
	at org.joda.time.base.AbstractPartial.equals(AbstractPartial.java:64)
	at org.joda.time.LocalDate.equals(LocalDate.java:641)
	at org.joda.time.LocalDate.toDate(LocalDate.java:1032)
	at org.joda.time.TestLocalDate_Basics.testToDate_winter(TestLocalDate_Basics.java:1019)

testEqualsHashCode(org.joda.time.TestLocalTime_Basics)  Time elapsed: 0 sec  <<< ERROR!
java.lang.IndexOutOfBoundsException: Invalid index: -1
	at org.joda.time.LocalTime.getValue(LocalTime.java:584)
	at org.joda.time.base.AbstractPartial.equals(AbstractPartial.java:64)
	at org.joda.time.LocalTime.equals(LocalTime.java:691)
	at org.joda.time.TestLocalTime_Basics.testEqualsHashCode(TestLocalTime_Basics.java:289)

testWithField1(org.joda.time.TestTimeOfDay_Basics)  Time elapsed: 0 sec  <<< ERROR!
java.lang.ArrayIndexOutOfBoundsException: -1
	at org.joda.time.base.BasePartial.getValue(BasePartial.java:225)
	at org.joda.time.base.AbstractPartial.equals(AbstractPartial.java:64)
	at junit.framework.Assert.assertEquals(Assert.java:62)
	at junit.framework.Assert.assertEquals(Assert.java:71)
	at org.joda.time.TestTimeOfDay_Basics.testWithField1(TestTimeOfDay_Basics.java:377)

testWithFieldAdded1(org.joda.time.TestTimeOfDay_Basics)  Time elapsed: 0 sec  <<< ERROR!
java.lang.ArrayIndexOutOfBoundsException: -1
	at org.joda.time.base.BasePartial.getValue(BasePartial.java:225)
	at org.joda.time.base.AbstractPartial.equals(AbstractPartial.java:64)
	at junit.framework.Assert.assertEquals(Assert.java:62)
	at junit.framework.Assert.assertEquals(Assert.java:71)
	at org.joda.time.TestTimeOfDay_Basics.testWithFieldAdded1(TestTimeOfDay_Basics.java:408)

testPlus_RP(org.joda.time.TestTimeOfDay_Basics)  Time elapsed: 0 sec  <<< ERROR!
java.lang.ArrayIndexOutOfBoundsException: -1
	at org.joda.time.base.BasePartial.getValue(BasePartial.java:225)
	at org.joda.time.base.AbstractPartial.equals(AbstractPartial.java:64)
	at junit.framework.Assert.assertEquals(Assert.java:62)
	at junit.framework.Assert.assertEquals(Assert.java:71)
	at org.joda.time.TestTimeOfDay_Basics.testPlus_RP(TestTimeOfDay_Basics.java:491)

testEqualsHashCode(org.joda.time.TestTimeOfDay_Basics)  Time elapsed: 0 sec  <<< ERROR!
java.lang.ArrayIndexOutOfBoundsException: -1
	at org.joda.time.base.BasePartial.getValue(BasePartial.java:225)
	at org.joda.time.base.AbstractPartial.equals(AbstractPartial.java:64)
	at org.joda.time.TestTimeOfDay_Basics.testEqualsHashCode(TestTimeOfDay_Basics.java:200)

testSerialization(org.joda.time.TestTimeOfDay_Basics)  Time elapsed: 0.005 sec  <<< ERROR!
java.lang.ArrayIndexOutOfBoundsException: -1
	at org.joda.time.base.BasePartial.getValue(BasePartial.java:225)
	at org.joda.time.base.AbstractPartial.equals(AbstractPartial.java:64)
	at junit.framework.Assert.assertEquals(Assert.java:62)
	at junit.framework.Assert.assertEquals(Assert.java:71)
	at org.joda.time.TestTimeOfDay_Basics.testSerialization(TestTimeOfDay_Basics.java:864)

testPlusHours_int(org.joda.time.TestTimeOfDay_Basics)  Time elapsed: 0 sec  <<< ERROR!
java.lang.ArrayIndexOutOfBoundsException: -1
	at org.joda.time.base.BasePartial.getValue(BasePartial.java:225)
	at org.joda.time.base.AbstractPartial.equals(AbstractPartial.java:64)
	at junit.framework.Assert.assertEquals(Assert.java:62)
	at junit.framework.Assert.assertEquals(Assert.java:71)
	at org.joda.time.TestTimeOfDay_Basics.testPlusHours_int(TestTimeOfDay_Basics.java:501)

testPlusMinutes_int(org.joda.time.TestTimeOfDay_Basics)  Time elapsed: 0 sec  <<< ERROR!
java.lang.ArrayIndexOutOfBoundsException: -1
	at org.joda.time.base.BasePartial.getValue(BasePartial.java:225)
	at org.joda.time.base.AbstractPartial.equals(AbstractPartial.java:64)
	at junit.framework.Assert.assertEquals(Assert.java:62)
	at junit.framework.Assert.assertEquals(Assert.java:71)
	at org.joda.time.TestTimeOfDay_Basics.testPlusMinutes_int(TestTimeOfDay_Basics.java:511)

testPlusSeconds_int(org.joda.time.TestTimeOfDay_Basics)  Time elapsed: 0.001 sec  <<< ERROR!
java.lang.ArrayIndexOutOfBoundsException: -1
	at org.joda.time.base.BasePartial.getValue(BasePartial.java:225)
	at org.joda.time.base.AbstractPartial.equals(AbstractPartial.java:64)
	at junit.framework.Assert.assertEquals(Assert.java:62)
	at junit.framework.Assert.assertEquals(Assert.java:71)
	at org.joda.time.TestTimeOfDay_Basics.testPlusSeconds_int(TestTimeOfDay_Basics.java:521)

testPlusMillis_int(org.joda.time.TestTimeOfDay_Basics)  Time elapsed: 0.001 sec  <<< ERROR!
java.lang.ArrayIndexOutOfBoundsException: -1
	at org.joda.time.base.BasePartial.getValue(BasePartial.java:225)
	at org.joda.time.base.AbstractPartial.equals(AbstractPartial.java:64)
	at junit.framework.Assert.assertEquals(Assert.java:62)
	at junit.framework.Assert.assertEquals(Assert.java:71)
	at org.joda.time.TestTimeOfDay_Basics.testPlusMillis_int(TestTimeOfDay_Basics.java:531)

testMinus_RP(org.joda.time.TestTimeOfDay_Basics)  Time elapsed: 0.001 sec  <<< ERROR!
java.lang.ArrayIndexOutOfBoundsException: -1
	at org.joda.time.base.BasePartial.getValue(BasePartial.java:225)
	at org.joda.time.base.AbstractPartial.equals(AbstractPartial.java:64)
	at junit.framework.Assert.assertEquals(Assert.java:62)
	at junit.framework.Assert.assertEquals(Assert.java:71)
	at org.joda.time.TestTimeOfDay_Basics.testMinus_RP(TestTimeOfDay_Basics.java:542)

testMinusHours_int(org.joda.time.TestTimeOfDay_Basics)  Time elapsed: 0.008 sec  <<< ERROR!
java.lang.ArrayIndexOutOfBoundsException: -1
	at org.joda.time.base.BasePartial.getValue(BasePartial.java:225)
	at org.joda.time.base.AbstractPartial.equals(AbstractPartial.java:64)
	at junit.framework.Assert.assertEquals(Assert.java:62)
	at junit.framework.Assert.assertEquals(Assert.java:71)
	at org.joda.time.TestTimeOfDay_Basics.testMinusHours_int(TestTimeOfDay_Basics.java:552)

testMinusMinutes_int(org.joda.time.TestTimeOfDay_Basics)  Time elapsed: 0.001 sec  <<< ERROR!
java.lang.ArrayIndexOutOfBoundsException: -1
	at org.joda.time.base.BasePartial.getValue(BasePartial.java:225)
	at org.joda.time.base.AbstractPartial.equals(AbstractPartial.java:64)
	at junit.framework.Assert.assertEquals(Assert.java:62)
	at junit.framework.Assert.assertEquals(Assert.java:71)
	at org.joda.time.TestTimeOfDay_Basics.testMinusMinutes_int(TestTimeOfDay_Basics.java:562)

testMinusSeconds_int(org.joda.time.TestTimeOfDay_Basics)  Time elapsed: 0 sec  <<< ERROR!
java.lang.ArrayIndexOutOfBoundsException: -1
	at org.joda.time.base.BasePartial.getValue(BasePartial.java:225)
	at org.joda.time.base.AbstractPartial.equals(AbstractPartial.java:64)
	at junit.framework.Assert.assertEquals(Assert.java:62)
	at junit.framework.Assert.assertEquals(Assert.java:71)
	at org.joda.time.TestTimeOfDay_Basics.testMinusSeconds_int(TestTimeOfDay_Basics.java:572)

testMinusMillis_int(org.joda.time.TestTimeOfDay_Basics)  Time elapsed: 0 sec  <<< ERROR!
java.lang.ArrayIndexOutOfBoundsException: -1
	at org.joda.time.base.BasePartial.getValue(BasePartial.java:225)
	at org.joda.time.base.AbstractPartial.equals(AbstractPartial.java:64)
	at junit.framework.Assert.assertEquals(Assert.java:62)
	at junit.framework.Assert.assertEquals(Assert.java:71)
	at org.joda.time.TestTimeOfDay_Basics.testMinusMillis_int(TestTimeOfDay_Basics.java:582)

testWithFieldAdded6(org.joda.time.TestTimeOfDay_Basics)  Time elapsed: 0.001 sec  <<< ERROR!
java.lang.ArrayIndexOutOfBoundsException: -1
	at org.joda.time.base.BasePartial.getValue(BasePartial.java:225)
	at org.joda.time.base.AbstractPartial.equals(AbstractPartial.java:64)
	at junit.framework.Assert.assertEquals(Assert.java:62)
	at junit.framework.Assert.assertEquals(Assert.java:71)
	at org.joda.time.TestTimeOfDay_Basics.testWithFieldAdded6(TestTimeOfDay_Basics.java:446)

testWithFieldAdded7(org.joda.time.TestTimeOfDay_Basics)  Time elapsed: 0 sec  <<< ERROR!
java.lang.ArrayIndexOutOfBoundsException: -1
	at org.joda.time.base.BasePartial.getValue(BasePartial.java:225)
	at org.joda.time.base.AbstractPartial.equals(AbstractPartial.java:64)
	at junit.framework.Assert.assertEquals(Assert.java:62)
	at junit.framework.Assert.assertEquals(Assert.java:71)
	at org.joda.time.TestTimeOfDay_Basics.testWithFieldAdded7(TestTimeOfDay_Basics.java:453)

testWithFieldAdded8(org.joda.time.TestTimeOfDay_Basics)  Time elapsed: 0.001 sec  <<< ERROR!
java.lang.ArrayIndexOutOfBoundsException: -1
	at org.joda.time.base.BasePartial.getValue(BasePartial.java:225)
	at org.joda.time.base.AbstractPartial.equals(AbstractPartial.java:64)
	at junit.framework.Assert.assertEquals(Assert.java:62)
	at junit.framework.Assert.assertEquals(Assert.java:71)
	at org.joda.time.TestTimeOfDay_Basics.testWithFieldAdded8(TestTimeOfDay_Basics.java:471)

testFactory_FromCalendarFields(org.joda.time.TestTimeOfDay_Constructors)  Time elapsed: 0 sec  <<< ERROR!
java.lang.ArrayIndexOutOfBoundsException: -1
	at org.joda.time.base.BasePartial.getValue(BasePartial.java:225)
	at org.joda.time.base.AbstractPartial.equals(AbstractPartial.java:64)
	at junit.framework.Assert.assertEquals(Assert.java:62)
	at junit.framework.Assert.assertEquals(Assert.java:71)
	at org.joda.time.TestTimeOfDay_Constructors.testFactory_FromCalendarFields(TestTimeOfDay_Constructors.java:108)

testFactory_FromDateFields_after1970(org.joda.time.TestTimeOfDay_Constructors)  Time elapsed: 0 sec  <<< ERROR!
java.lang.ArrayIndexOutOfBoundsException: -1
	at org.joda.time.base.BasePartial.getValue(BasePartial.java:225)
	at org.joda.time.base.AbstractPartial.equals(AbstractPartial.java:64)
	at junit.framework.Assert.assertEquals(Assert.java:62)
	at junit.framework.Assert.assertEquals(Assert.java:71)
	at org.joda.time.TestTimeOfDay_Constructors.testFactory_FromDateFields_after1970(TestTimeOfDay_Constructors.java:120)

testFactory_FromDateFields_before1970(org.joda.time.TestTimeOfDay_Constructors)  Time elapsed: 0.001 sec  <<< ERROR!
java.lang.ArrayIndexOutOfBoundsException: -1
	at org.joda.time.base.BasePartial.getValue(BasePartial.java:225)
	at org.joda.time.base.AbstractPartial.equals(AbstractPartial.java:64)
	at junit.framework.Assert.assertEquals(Assert.java:62)
	at junit.framework.Assert.assertEquals(Assert.java:71)
	at org.joda.time.TestTimeOfDay_Constructors.testFactory_FromDateFields_before1970(TestTimeOfDay_Constructors.java:127)

testWithField1(org.joda.time.TestYearMonthDay_Basics)  Time elapsed: 0.001 sec  <<< ERROR!
java.lang.ArrayIndexOutOfBoundsException: -1
	at org.joda.time.base.BasePartial.getValue(BasePartial.java:225)
	at org.joda.time.base.AbstractPartial.equals(AbstractPartial.java:64)
	at junit.framework.Assert.assertEquals(Assert.java:62)
	at junit.framework.Assert.assertEquals(Assert.java:71)
	at org.joda.time.TestYearMonthDay_Basics.testWithField1(TestYearMonthDay_Basics.java:378)

testWithFieldAdded1(org.joda.time.TestYearMonthDay_Basics)  Time elapsed: 0 sec  <<< ERROR!
java.lang.ArrayIndexOutOfBoundsException: -1
	at org.joda.time.base.BasePartial.getValue(BasePartial.java:225)
	at org.joda.time.base.AbstractPartial.equals(AbstractPartial.java:64)
	at junit.framework.Assert.assertEquals(Assert.java:62)
	at junit.framework.Assert.assertEquals(Assert.java:71)
	at org.joda.time.TestYearMonthDay_Basics.testWithFieldAdded1(TestYearMonthDay_Basics.java:410)

testPlus_RP(org.joda.time.TestYearMonthDay_Basics)  Time elapsed: 0.003 sec  <<< ERROR!
java.lang.ArrayIndexOutOfBoundsException: -1
	at org.joda.time.base.BasePartial.getValue(BasePartial.java:225)
	at org.joda.time.base.AbstractPartial.equals(AbstractPartial.java:64)
	at junit.framework.Assert.assertEquals(Assert.java:62)
	at junit.framework.Assert.assertEquals(Assert.java:71)
	at org.joda.time.TestYearMonthDay_Basics.testPlus_RP(TestYearMonthDay_Basics.java:449)

testEqualsHashCode(org.joda.time.TestYearMonthDay_Basics)  Time elapsed: 0 sec  <<< ERROR!
java.lang.ArrayIndexOutOfBoundsException: -1
	at org.joda.time.base.BasePartial.getValue(BasePartial.java:225)
	at org.joda.time.base.AbstractPartial.equals(AbstractPartial.java:64)
	at org.joda.time.TestYearMonthDay_Basics.testEqualsHashCode(TestYearMonthDay_Basics.java:181)

testSerialization(org.joda.time.TestYearMonthDay_Basics)  Time elapsed: 0.003 sec  <<< ERROR!
java.lang.ArrayIndexOutOfBoundsException: -1
	at org.joda.time.base.BasePartial.getValue(BasePartial.java:225)
	at org.joda.time.base.AbstractPartial.equals(AbstractPartial.java:64)
	at junit.framework.Assert.assertEquals(Assert.java:62)
	at junit.framework.Assert.assertEquals(Assert.java:71)
	at org.joda.time.TestYearMonthDay_Basics.testSerialization(TestYearMonthDay_Basics.java:790)

testPlusYears_int(org.joda.time.TestYearMonthDay_Basics)  Time elapsed: 0 sec  <<< ERROR!
java.lang.ArrayIndexOutOfBoundsException: -1
	at org.joda.time.base.BasePartial.getValue(BasePartial.java:225)
	at org.joda.time.base.AbstractPartial.equals(AbstractPartial.java:64)
	at junit.framework.Assert.assertEquals(Assert.java:62)
	at junit.framework.Assert.assertEquals(Assert.java:71)
	at org.joda.time.TestYearMonthDay_Basics.testPlusYears_int(TestYearMonthDay_Basics.java:459)

testPlusMonths_int(org.joda.time.TestYearMonthDay_Basics)  Time elapsed: 0.001 sec  <<< ERROR!
java.lang.ArrayIndexOutOfBoundsException: -1
	at org.joda.time.base.BasePartial.getValue(BasePartial.java:225)
	at org.joda.time.base.AbstractPartial.equals(AbstractPartial.java:64)
	at junit.framework.Assert.assertEquals(Assert.java:62)
	at junit.framework.Assert.assertEquals(Assert.java:71)
	at org.joda.time.TestYearMonthDay_Basics.testPlusMonths_int(TestYearMonthDay_Basics.java:469)

testPlusDays_int(org.joda.time.TestYearMonthDay_Basics)  Time elapsed: 0 sec  <<< ERROR!
java.lang.ArrayIndexOutOfBoundsException: -1
	at org.joda.time.base.BasePartial.getValue(BasePartial.java:225)
	at org.joda.time.base.AbstractPartial.equals(AbstractPartial.java:64)
	at junit.framework.Assert.assertEquals(Assert.java:62)
	at junit.framework.Assert.assertEquals(Assert.java:71)
	at org.joda.time.TestYearMonthDay_Basics.testPlusDays_int(TestYearMonthDay_Basics.java:479)

testMinus_RP(org.joda.time.TestYearMonthDay_Basics)  Time elapsed: 0.001 sec  <<< ERROR!
java.lang.ArrayIndexOutOfBoundsException: -1
	at org.joda.time.base.BasePartial.getValue(BasePartial.java:225)
	at org.joda.time.base.AbstractPartial.equals(AbstractPartial.java:64)
	at junit.framework.Assert.assertEquals(Assert.java:62)
	at junit.framework.Assert.assertEquals(Assert.java:71)
	at org.joda.time.TestYearMonthDay_Basics.testMinus_RP(TestYearMonthDay_Basics.java:490)

testMinusYears_int(org.joda.time.TestYearMonthDay_Basics)  Time elapsed: 0 sec  <<< ERROR!
java.lang.ArrayIndexOutOfBoundsException: -1
	at org.joda.time.base.BasePartial.getValue(BasePartial.java:225)
	at org.joda.time.base.AbstractPartial.equals(AbstractPartial.java:64)
	at junit.framework.Assert.assertEquals(Assert.java:62)
	at junit.framework.Assert.assertEquals(Assert.java:71)
	at org.joda.time.TestYearMonthDay_Basics.testMinusYears_int(TestYearMonthDay_Basics.java:500)

testMinusMonths_int(org.joda.time.TestYearMonthDay_Basics)  Time elapsed: 0.001 sec  <<< ERROR!
java.lang.ArrayIndexOutOfBoundsException: -1
	at org.joda.time.base.BasePartial.getValue(BasePartial.java:225)
	at org.joda.time.base.AbstractPartial.equals(AbstractPartial.java:64)
	at junit.framework.Assert.assertEquals(Assert.java:62)
	at junit.framework.Assert.assertEquals(Assert.java:71)
	at org.joda.time.TestYearMonthDay_Basics.testMinusMonths_int(TestYearMonthDay_Basics.java:510)

testMinusDays_int(org.joda.time.TestYearMonthDay_Basics)  Time elapsed: 0.001 sec  <<< ERROR!
java.lang.ArrayIndexOutOfBoundsException: -1
	at org.joda.time.base.BasePartial.getValue(BasePartial.java:225)
	at org.joda.time.base.AbstractPartial.equals(AbstractPartial.java:64)
	at junit.framework.Assert.assertEquals(Assert.java:62)
	at junit.framework.Assert.assertEquals(Assert.java:71)
	at org.joda.time.TestYearMonthDay_Basics.testMinusDays_int(TestYearMonthDay_Basics.java:520)

testWithField4(org.joda.time.TestYearMonthDay_Basics)  Time elapsed: 0.001 sec  <<< ERROR!
java.lang.ArrayIndexOutOfBoundsException: -1
	at org.joda.time.base.BasePartial.getValue(BasePartial.java:225)
	at org.joda.time.base.AbstractPartial.equals(AbstractPartial.java:64)
	at junit.framework.Assert.assertEquals(Assert.java:62)
	at junit.framework.Assert.assertEquals(Assert.java:71)
	at org.joda.time.TestYearMonthDay_Basics.testWithField4(TestYearMonthDay_Basics.java:401)

testFactory_FromDateFields(org.joda.time.TestYearMonthDay_Constructors)  Time elapsed: 0.001 sec  <<< ERROR!
java.lang.ArrayIndexOutOfBoundsException: -1
	at org.joda.time.base.BasePartial.getValue(BasePartial.java:225)
	at org.joda.time.base.AbstractPartial.equals(AbstractPartial.java:64)
	at junit.framework.Assert.assertEquals(Assert.java:62)
	at junit.framework.Assert.assertEquals(Assert.java:71)
	at org.joda.time.TestYearMonthDay_Constructors.testFactory_FromDateFields(TestYearMonthDay_Constructors.java:98)

testFactory_FromCalendarFields(org.joda.time.TestYearMonthDay_Constructors)  Time elapsed: 0 sec  <<< ERROR!
java.lang.ArrayIndexOutOfBoundsException: -1
	at org.joda.time.base.BasePartial.getValue(BasePartial.java:225)
	at org.joda.time.base.AbstractPartial.equals(AbstractPartial.java:64)
	at junit.framework.Assert.assertEquals(Assert.java:62)
	at junit.framework.Assert.assertEquals(Assert.java:71)
	at org.joda.time.TestYearMonthDay_Constructors.testFactory_FromCalendarFields(TestYearMonthDay_Constructors.java:86)

testPlus_RP(org.joda.time.TestYearMonth_Basics)  Time elapsed: 0 sec  <<< ERROR!
java.lang.ArrayIndexOutOfBoundsException: -1
	at org.joda.time.base.BasePartial.getValue(BasePartial.java:225)
	at org.joda.time.base.AbstractPartial.equals(AbstractPartial.java:64)
	at junit.framework.Assert.assertEquals(Assert.java:62)
	at junit.framework.Assert.assertEquals(Assert.java:71)
	at org.joda.time.TestYearMonth_Basics.testPlus_RP(TestYearMonth_Basics.java:443)

testEqualsHashCode(org.joda.time.TestYearMonth_Basics)  Time elapsed: 0.001 sec  <<< ERROR!
java.lang.ArrayIndexOutOfBoundsException: -1
	at org.joda.time.base.BasePartial.getValue(BasePartial.java:225)
	at org.joda.time.base.AbstractPartial.equals(AbstractPartial.java:64)
	at org.joda.time.TestYearMonth_Basics.testEqualsHashCode(TestYearMonth_Basics.java:181)

testSerialization(org.joda.time.TestYearMonth_Basics)  Time elapsed: 0.003 sec  <<< ERROR!
java.lang.ArrayIndexOutOfBoundsException: -1
	at org.joda.time.base.BasePartial.getValue(BasePartial.java:225)
	at org.joda.time.base.AbstractPartial.equals(AbstractPartial.java:64)
	at junit.framework.Assert.assertEquals(Assert.java:62)
	at junit.framework.Assert.assertEquals(Assert.java:71)
	at org.joda.time.TestYearMonth_Basics.testSerialization(TestYearMonth_Basics.java:614)

testPlusYears_int(org.joda.time.TestYearMonth_Basics)  Time elapsed: 0.002 sec  <<< ERROR!
java.lang.ArrayIndexOutOfBoundsException: -1
	at org.joda.time.base.BasePartial.getValue(BasePartial.java:225)
	at org.joda.time.base.AbstractPartial.equals(AbstractPartial.java:64)
	at junit.framework.Assert.assertEquals(Assert.java:62)
	at junit.framework.Assert.assertEquals(Assert.java:71)
	at org.joda.time.TestYearMonth_Basics.testPlusYears_int(TestYearMonth_Basics.java:453)

testPlusMonths_int(org.joda.time.TestYearMonth_Basics)  Time elapsed: 0 sec  <<< ERROR!
java.lang.ArrayIndexOutOfBoundsException: -1
	at org.joda.time.base.BasePartial.getValue(BasePartial.java:225)
	at org.joda.time.base.AbstractPartial.equals(AbstractPartial.java:64)
	at junit.framework.Assert.assertEquals(Assert.java:62)
	at junit.framework.Assert.assertEquals(Assert.java:71)
	at org.joda.time.TestYearMonth_Basics.testPlusMonths_int(TestYearMonth_Basics.java:463)

testMinus_RP(org.joda.time.TestYearMonth_Basics)  Time elapsed: 0 sec  <<< ERROR!
java.lang.ArrayIndexOutOfBoundsException: -1
	at org.joda.time.base.BasePartial.getValue(BasePartial.java:225)
	at org.joda.time.base.AbstractPartial.equals(AbstractPartial.java:64)
	at junit.framework.Assert.assertEquals(Assert.java:62)
	at junit.framework.Assert.assertEquals(Assert.java:71)
	at org.joda.time.TestYearMonth_Basics.testMinus_RP(TestYearMonth_Basics.java:474)

testMinusYears_int(org.joda.time.TestYearMonth_Basics)  Time elapsed: 0 sec  <<< ERROR!
java.lang.ArrayIndexOutOfBoundsException: -1
	at org.joda.time.base.BasePartial.getValue(BasePartial.java:225)
	at org.joda.time.base.AbstractPartial.equals(AbstractPartial.java:64)
	at junit.framework.Assert.assertEquals(Assert.java:62)
	at junit.framework.Assert.assertEquals(Assert.java:71)
	at org.joda.time.TestYearMonth_Basics.testMinusYears_int(TestYearMonth_Basics.java:484)

testMinusMonths_int(org.joda.time.TestYearMonth_Basics)  Time elapsed: 0.001 sec  <<< ERROR!
java.lang.ArrayIndexOutOfBoundsException: -1
	at org.joda.time.base.BasePartial.getValue(BasePartial.java:225)
	at org.joda.time.base.AbstractPartial.equals(AbstractPartial.java:64)
	at junit.framework.Assert.assertEquals(Assert.java:62)
	at junit.framework.Assert.assertEquals(Assert.java:71)
	at org.joda.time.TestYearMonth_Basics.testMinusMonths_int(TestYearMonth_Basics.java:494)

testWithFieldAdded(org.joda.time.TestYearMonth_Basics)  Time elapsed: 0.001 sec  <<< ERROR!
java.lang.ArrayIndexOutOfBoundsException: -1
	at org.joda.time.base.BasePartial.getValue(BasePartial.java:225)
	at org.joda.time.base.AbstractPartial.equals(AbstractPartial.java:64)
	at junit.framework.Assert.assertEquals(Assert.java:62)
	at junit.framework.Assert.assertEquals(Assert.java:71)
	at org.joda.time.TestYearMonth_Basics.testWithFieldAdded(TestYearMonth_Basics.java:404)

testWithField(org.joda.time.TestYearMonth_Basics)  Time elapsed: 0 sec  <<< ERROR!
java.lang.ArrayIndexOutOfBoundsException: -1
	at org.joda.time.base.BasePartial.getValue(BasePartial.java:225)
	at org.joda.time.base.AbstractPartial.equals(AbstractPartial.java:64)
	at junit.framework.Assert.assertEquals(Assert.java:62)
	at junit.framework.Assert.assertEquals(Assert.java:71)
	at org.joda.time.TestYearMonth_Basics.testWithField(TestYearMonth_Basics.java:372)

testWithField_same(org.joda.time.TestYearMonth_Basics)  Time elapsed: 0 sec  <<< ERROR!
java.lang.ArrayIndexOutOfBoundsException: -1
	at org.joda.time.base.BasePartial.getValue(BasePartial.java:225)
	at org.joda.time.base.AbstractPartial.equals(AbstractPartial.java:64)
	at junit.framework.Assert.assertEquals(Assert.java:62)
	at junit.framework.Assert.assertEquals(Assert.java:71)
	at org.joda.time.TestYearMonth_Basics.testWithField_same(TestYearMonth_Basics.java:395)

testConstructor(org.joda.time.TestYearMonth_Constructors)  Time elapsed: 0.001 sec  <<< ERROR!
java.lang.ArrayIndexOutOfBoundsException: -1
	at org.joda.time.base.BasePartial.getValue(BasePartial.java:225)
	at org.joda.time.base.AbstractPartial.equals(AbstractPartial.java:64)
	at junit.framework.Assert.assertEquals(Assert.java:62)
	at junit.framework.Assert.assertEquals(Assert.java:71)
	at org.joda.time.TestYearMonth_Constructors.testConstructor(TestYearMonth_Constructors.java:126)

testConstructor_DateTimeZone(org.joda.time.TestYearMonth_Constructors)  Time elapsed: 0.001 sec  <<< ERROR!
java.lang.ArrayIndexOutOfBoundsException: -1
	at org.joda.time.base.BasePartial.getValue(BasePartial.java:225)
	at org.joda.time.base.AbstractPartial.equals(AbstractPartial.java:64)
	at junit.framework.Assert.assertEquals(Assert.java:62)
	at junit.framework.Assert.assertEquals(Assert.java:71)
	at org.joda.time.TestYearMonth_Constructors.testConstructor_DateTimeZone(TestYearMonth_Constructors.java:141)

testConstructor_Chronology(org.joda.time.TestYearMonth_Constructors)  Time elapsed: 0 sec  <<< ERROR!
java.lang.ArrayIndexOutOfBoundsException: -1
	at org.joda.time.base.BasePartial.getValue(BasePartial.java:225)
	at org.joda.time.base.AbstractPartial.equals(AbstractPartial.java:64)
	at junit.framework.Assert.assertEquals(Assert.java:62)
	at junit.framework.Assert.assertEquals(Assert.java:71)
	at org.joda.time.TestYearMonth_Constructors.testConstructor_Chronology(TestYearMonth_Constructors.java:172)

testParse_noFormatter(org.joda.time.TestYearMonth_Constructors)  Time elapsed: 0 sec  <<< ERROR!
java.lang.ArrayIndexOutOfBoundsException: -1
	at org.joda.time.base.BasePartial.getValue(BasePartial.java:225)
	at org.joda.time.base.AbstractPartial.equals(AbstractPartial.java:64)
	at junit.framework.Assert.assertEquals(Assert.java:62)
	at junit.framework.Assert.assertEquals(Assert.java:71)
	at org.joda.time.TestYearMonth_Constructors.testParse_noFormatter(TestYearMonth_Constructors.java:84)

testParse_formatter(org.joda.time.TestYearMonth_Constructors)  Time elapsed: 0 sec  <<< ERROR!
java.lang.ArrayIndexOutOfBoundsException: -1
	at org.joda.time.base.BasePartial.getValue(BasePartial.java:225)
	at org.joda.time.base.AbstractPartial.equals(AbstractPartial.java:64)
	at junit.framework.Assert.assertEquals(Assert.java:62)
	at junit.framework.Assert.assertEquals(Assert.java:71)
	at org.joda.time.TestYearMonth_Constructors.testParse_formatter(TestYearMonth_Constructors.java:90)

testFactory_FromDateFields(org.joda.time.TestYearMonth_Constructors)  Time elapsed: 0 sec  <<< ERROR!
java.lang.ArrayIndexOutOfBoundsException: -1
	at org.joda.time.base.BasePartial.getValue(BasePartial.java:225)
	at org.joda.time.base.AbstractPartial.equals(AbstractPartial.java:64)
	at junit.framework.Assert.assertEquals(Assert.java:62)
	at junit.framework.Assert.assertEquals(Assert.java:71)
	at org.joda.time.TestYearMonth_Constructors.testFactory_FromDateFields(TestYearMonth_Constructors.java:110)

testFactory_FromCalendarFields(org.joda.time.TestYearMonth_Constructors)  Time elapsed: 0 sec  <<< ERROR!
java.lang.ArrayIndexOutOfBoundsException: -1
	at org.joda.time.base.BasePartial.getValue(BasePartial.java:225)
	at org.joda.time.base.AbstractPartial.equals(AbstractPartial.java:64)
	at junit.framework.Assert.assertEquals(Assert.java:62)
	at junit.framework.Assert.assertEquals(Assert.java:71)
	at org.joda.time.TestYearMonth_Constructors.testFactory_FromCalendarFields(TestYearMonth_Constructors.java:98)

testPlus_RP(org.joda.time.TestMonthDay_Basics)  Time elapsed: 0.001 sec  <<< ERROR!
java.lang.ArrayIndexOutOfBoundsException: -1
	at org.joda.time.base.BasePartial.getValue(BasePartial.java:225)
	at org.joda.time.base.AbstractPartial.equals(AbstractPartial.java:64)
	at junit.framework.Assert.assertEquals(Assert.java:62)
	at junit.framework.Assert.assertEquals(Assert.java:71)
	at org.joda.time.TestMonthDay_Basics.testPlus_RP(TestMonthDay_Basics.java:438)

testEqualsHashCode(org.joda.time.TestMonthDay_Basics)  Time elapsed: 0.001 sec  <<< ERROR!
java.lang.ArrayIndexOutOfBoundsException: -1
	at org.joda.time.base.BasePartial.getValue(BasePartial.java:225)
	at org.joda.time.base.AbstractPartial.equals(AbstractPartial.java:64)
	at org.joda.time.TestMonthDay_Basics.testEqualsHashCode(TestMonthDay_Basics.java:180)

testSerialization(org.joda.time.TestMonthDay_Basics)  Time elapsed: 0.003 sec  <<< ERROR!
java.lang.ArrayIndexOutOfBoundsException: -1
	at org.joda.time.base.BasePartial.getValue(BasePartial.java:225)
	at org.joda.time.base.AbstractPartial.equals(AbstractPartial.java:64)
	at junit.framework.Assert.assertEquals(Assert.java:62)
	at junit.framework.Assert.assertEquals(Assert.java:71)
	at org.joda.time.TestMonthDay_Basics.testSerialization(TestMonthDay_Basics.java:780)

testPlusMonths_int(org.joda.time.TestMonthDay_Basics)  Time elapsed: 0.001 sec  <<< ERROR!
java.lang.ArrayIndexOutOfBoundsException: -1
	at org.joda.time.base.BasePartial.getValue(BasePartial.java:225)
	at org.joda.time.base.AbstractPartial.equals(AbstractPartial.java:64)
	at junit.framework.Assert.assertEquals(Assert.java:62)
	at junit.framework.Assert.assertEquals(Assert.java:71)
	at org.joda.time.TestMonthDay_Basics.testPlusMonths_int(TestMonthDay_Basics.java:448)

testPlusDays_int(org.joda.time.TestMonthDay_Basics)  Time elapsed: 0 sec  <<< ERROR!
java.lang.ArrayIndexOutOfBoundsException: -1
	at org.joda.time.base.BasePartial.getValue(BasePartial.java:225)
	at org.joda.time.base.AbstractPartial.equals(AbstractPartial.java:64)
	at junit.framework.Assert.assertEquals(Assert.java:62)
	at junit.framework.Assert.assertEquals(Assert.java:71)
	at org.joda.time.TestMonthDay_Basics.testPlusDays_int(TestMonthDay_Basics.java:504)

testMinus_RP(org.joda.time.TestMonthDay_Basics)  Time elapsed: 0.001 sec  <<< ERROR!
java.lang.ArrayIndexOutOfBoundsException: -1
	at org.joda.time.base.BasePartial.getValue(BasePartial.java:225)
	at org.joda.time.base.AbstractPartial.equals(AbstractPartial.java:64)
	at junit.framework.Assert.assertEquals(Assert.java:62)
	at junit.framework.Assert.assertEquals(Assert.java:71)
	at org.joda.time.TestMonthDay_Basics.testMinus_RP(TestMonthDay_Basics.java:574)

testMinusMonths_int(org.joda.time.TestMonthDay_Basics)  Time elapsed: 0 sec  <<< ERROR!
java.lang.ArrayIndexOutOfBoundsException: -1
	at org.joda.time.base.BasePartial.getValue(BasePartial.java:225)
	at org.joda.time.base.AbstractPartial.equals(AbstractPartial.java:64)
	at junit.framework.Assert.assertEquals(Assert.java:62)
	at junit.framework.Assert.assertEquals(Assert.java:71)
	at org.joda.time.TestMonthDay_Basics.testMinusMonths_int(TestMonthDay_Basics.java:584)

testMinusDays_int(org.joda.time.TestMonthDay_Basics)  Time elapsed: 0.001 sec  <<< ERROR!
java.lang.ArrayIndexOutOfBoundsException: -1
	at org.joda.time.base.BasePartial.getValue(BasePartial.java:225)
	at org.joda.time.base.AbstractPartial.equals(AbstractPartial.java:64)
	at junit.framework.Assert.assertEquals(Assert.java:62)
	at junit.framework.Assert.assertEquals(Assert.java:71)
	at org.joda.time.TestMonthDay_Basics.testMinusDays_int(TestMonthDay_Basics.java:640)

testWithFieldAdded(org.joda.time.TestMonthDay_Basics)  Time elapsed: 0.001 sec  <<< ERROR!
java.lang.ArrayIndexOutOfBoundsException: -1
	at org.joda.time.base.BasePartial.getValue(BasePartial.java:225)
	at org.joda.time.base.AbstractPartial.equals(AbstractPartial.java:64)
	at junit.framework.Assert.assertEquals(Assert.java:62)
	at junit.framework.Assert.assertEquals(Assert.java:71)
	at org.joda.time.TestMonthDay_Basics.testWithFieldAdded(TestMonthDay_Basics.java:399)

testWithField(org.joda.time.TestMonthDay_Basics)  Time elapsed: 0.001 sec  <<< ERROR!
java.lang.ArrayIndexOutOfBoundsException: -1
	at org.joda.time.base.BasePartial.getValue(BasePartial.java:225)
	at org.joda.time.base.AbstractPartial.equals(AbstractPartial.java:64)
	at junit.framework.Assert.assertEquals(Assert.java:62)
	at junit.framework.Assert.assertEquals(Assert.java:71)
	at org.joda.time.TestMonthDay_Basics.testWithField(TestMonthDay_Basics.java:367)

testWithField_same(org.joda.time.TestMonthDay_Basics)  Time elapsed: 0 sec  <<< ERROR!
java.lang.ArrayIndexOutOfBoundsException: -1
	at org.joda.time.base.BasePartial.getValue(BasePartial.java:225)
	at org.joda.time.base.AbstractPartial.equals(AbstractPartial.java:64)
	at junit.framework.Assert.assertEquals(Assert.java:62)
	at junit.framework.Assert.assertEquals(Assert.java:71)
	at org.joda.time.TestMonthDay_Basics.testWithField_same(TestMonthDay_Basics.java:390)

testPlusMonths_int_fromLeap(org.joda.time.TestMonthDay_Basics)  Time elapsed: 0.001 sec  <<< ERROR!
java.lang.ArrayIndexOutOfBoundsException: -1
	at org.joda.time.base.BasePartial.getValue(BasePartial.java:225)
	at org.joda.time.base.AbstractPartial.equals(AbstractPartial.java:64)
	at junit.framework.Assert.assertEquals(Assert.java:62)
	at junit.framework.Assert.assertEquals(Assert.java:71)
	at org.joda.time.TestMonthDay_Basics.testPlusMonths_int_fromLeap(TestMonthDay_Basics.java:455)

testPlusMonths_int_negativeFromLeap(org.joda.time.TestMonthDay_Basics)  Time elapsed: 0 sec  <<< ERROR!
java.lang.ArrayIndexOutOfBoundsException: -1
	at org.joda.time.base.BasePartial.getValue(BasePartial.java:225)
	at org.joda.time.base.AbstractPartial.equals(AbstractPartial.java:64)
	at junit.framework.Assert.assertEquals(Assert.java:62)
	at junit.framework.Assert.assertEquals(Assert.java:71)
	at org.joda.time.TestMonthDay_Basics.testPlusMonths_int_negativeFromLeap(TestMonthDay_Basics.java:462)

testPlusMonths_int_endOfMonthAdjust(org.joda.time.TestMonthDay_Basics)  Time elapsed: 0.001 sec  <<< ERROR!
java.lang.ArrayIndexOutOfBoundsException: -1
	at org.joda.time.base.BasePartial.getValue(BasePartial.java:225)
	at org.joda.time.base.AbstractPartial.equals(AbstractPartial.java:64)
	at junit.framework.Assert.assertEquals(Assert.java:62)
	at junit.framework.Assert.assertEquals(Assert.java:71)
	at org.joda.time.TestMonthDay_Basics.testPlusMonths_int_endOfMonthAdjust(TestMonthDay_Basics.java:469)

testPlusMonths_int_negativeEndOfMonthAdjust(org.joda.time.TestMonthDay_Basics)  Time elapsed: 0 sec  <<< ERROR!
java.lang.ArrayIndexOutOfBoundsException: -1
	at org.joda.time.base.BasePartial.getValue(BasePartial.java:225)
	at org.joda.time.base.AbstractPartial.equals(AbstractPartial.java:64)
	at junit.framework.Assert.assertEquals(Assert.java:62)
	at junit.framework.Assert.assertEquals(Assert.java:71)
	at org.joda.time.TestMonthDay_Basics.testPlusMonths_int_negativeEndOfMonthAdjust(TestMonthDay_Basics.java:476)

testPlusMonths_int_wrap(org.joda.time.TestMonthDay_Basics)  Time elapsed: 0.001 sec  <<< ERROR!
java.lang.ArrayIndexOutOfBoundsException: -1
	at org.joda.time.base.BasePartial.getValue(BasePartial.java:225)
	at org.joda.time.base.AbstractPartial.equals(AbstractPartial.java:64)
	at junit.framework.Assert.assertEquals(Assert.java:62)
	at junit.framework.Assert.assertEquals(Assert.java:71)
	at org.joda.time.TestMonthDay_Basics.testPlusMonths_int_wrap(TestMonthDay_Basics.java:489)

testPlusMonths_int_adjust(org.joda.time.TestMonthDay_Basics)  Time elapsed: 0 sec  <<< ERROR!
java.lang.ArrayIndexOutOfBoundsException: -1
	at org.joda.time.base.BasePartial.getValue(BasePartial.java:225)
	at org.joda.time.base.AbstractPartial.equals(AbstractPartial.java:64)
	at junit.framework.Assert.assertEquals(Assert.java:62)
	at junit.framework.Assert.assertEquals(Assert.java:71)
	at org.joda.time.TestMonthDay_Basics.testPlusMonths_int_adjust(TestMonthDay_Basics.java:496)

testPlusDays_int_wrapMonth(org.joda.time.TestMonthDay_Basics)  Time elapsed: 0.001 sec  <<< ERROR!
java.lang.ArrayIndexOutOfBoundsException: -1
	at org.joda.time.base.BasePartial.getValue(BasePartial.java:225)
	at org.joda.time.base.AbstractPartial.equals(AbstractPartial.java:64)
	at junit.framework.Assert.assertEquals(Assert.java:62)
	at junit.framework.Assert.assertEquals(Assert.java:71)
	at org.joda.time.TestMonthDay_Basics.testPlusDays_int_wrapMonth(TestMonthDay_Basics.java:511)

testPlusDays_int_wrapMonthTwice(org.joda.time.TestMonthDay_Basics)  Time elapsed: 0.001 sec  <<< ERROR!
java.lang.ArrayIndexOutOfBoundsException: -1
	at org.joda.time.base.BasePartial.getValue(BasePartial.java:225)
	at org.joda.time.base.AbstractPartial.equals(AbstractPartial.java:64)
	at junit.framework.Assert.assertEquals(Assert.java:62)
	at junit.framework.Assert.assertEquals(Assert.java:71)
	at org.joda.time.TestMonthDay_Basics.testPlusDays_int_wrapMonthTwice(TestMonthDay_Basics.java:518)

testPlusDays_int_wrapMonthIntoNextYear(org.joda.time.TestMonthDay_Basics)  Time elapsed: 0 sec  <<< ERROR!
java.lang.ArrayIndexOutOfBoundsException: -1
	at org.joda.time.base.BasePartial.getValue(BasePartial.java:225)
	at org.joda.time.base.AbstractPartial.equals(AbstractPartial.java:64)
	at junit.framework.Assert.assertEquals(Assert.java:62)
	at junit.framework.Assert.assertEquals(Assert.java:71)
	at org.joda.time.TestMonthDay_Basics.testPlusDays_int_wrapMonthIntoNextYear(TestMonthDay_Basics.java:525)

testPlusDays_int_wrapMonthTwiceIntoNextYear(org.joda.time.TestMonthDay_Basics)  Time elapsed: 0.001 sec  <<< ERROR!
java.lang.ArrayIndexOutOfBoundsException: -1
	at org.joda.time.base.BasePartial.getValue(BasePartial.java:225)
	at org.joda.time.base.AbstractPartial.equals(AbstractPartial.java:64)
	at junit.framework.Assert.assertEquals(Assert.java:62)
	at junit.framework.Assert.assertEquals(Assert.java:71)
	at org.joda.time.TestMonthDay_Basics.testPlusDays_int_wrapMonthTwiceIntoNextYear(TestMonthDay_Basics.java:532)

testPlusDays_int_wrap50(org.joda.time.TestMonthDay_Basics)  Time elapsed: 0.001 sec  <<< ERROR!
java.lang.ArrayIndexOutOfBoundsException: -1
	at org.joda.time.base.BasePartial.getValue(BasePartial.java:225)
	at org.joda.time.base.AbstractPartial.equals(AbstractPartial.java:64)
	at junit.framework.Assert.assertEquals(Assert.java:62)
	at junit.framework.Assert.assertEquals(Assert.java:71)
	at org.joda.time.TestMonthDay_Basics.testPlusDays_int_wrap50(TestMonthDay_Basics.java:539)

testPlusDays_int_toLeap(org.joda.time.TestMonthDay_Basics)  Time elapsed: 0.001 sec  <<< ERROR!
java.lang.ArrayIndexOutOfBoundsException: -1
	at org.joda.time.base.BasePartial.getValue(BasePartial.java:225)
	at org.joda.time.base.AbstractPartial.equals(AbstractPartial.java:64)
	at junit.framework.Assert.assertEquals(Assert.java:62)
	at junit.framework.Assert.assertEquals(Assert.java:71)
	at org.joda.time.TestMonthDay_Basics.testPlusDays_int_toLeap(TestMonthDay_Basics.java:546)

testPlusDays_int_fromLeap(org.joda.time.TestMonthDay_Basics)  Time elapsed: 0 sec  <<< ERROR!
java.lang.ArrayIndexOutOfBoundsException: -1
	at org.joda.time.base.BasePartial.getValue(BasePartial.java:225)
	at org.joda.time.base.AbstractPartial.equals(AbstractPartial.java:64)
	at junit.framework.Assert.assertEquals(Assert.java:62)
	at junit.framework.Assert.assertEquals(Assert.java:71)
	at org.joda.time.TestMonthDay_Basics.testPlusDays_int_fromLeap(TestMonthDay_Basics.java:553)

testPlusDays_int_negativeFromLeap(org.joda.time.TestMonthDay_Basics)  Time elapsed: 0.001 sec  <<< ERROR!
java.lang.ArrayIndexOutOfBoundsException: -1
	at org.joda.time.base.BasePartial.getValue(BasePartial.java:225)
	at org.joda.time.base.AbstractPartial.equals(AbstractPartial.java:64)
	at junit.framework.Assert.assertEquals(Assert.java:62)
	at junit.framework.Assert.assertEquals(Assert.java:71)
	at org.joda.time.TestMonthDay_Basics.testPlusDays_int_negativeFromLeap(TestMonthDay_Basics.java:560)

testMinusMonths_int_fromLeap(org.joda.time.TestMonthDay_Basics)  Time elapsed: 0.001 sec  <<< ERROR!
java.lang.ArrayIndexOutOfBoundsException: -1
	at org.joda.time.base.BasePartial.getValue(BasePartial.java:225)
	at org.joda.time.base.AbstractPartial.equals(AbstractPartial.java:64)
	at junit.framework.Assert.assertEquals(Assert.java:62)
	at junit.framework.Assert.assertEquals(Assert.java:71)
	at org.joda.time.TestMonthDay_Basics.testMinusMonths_int_fromLeap(TestMonthDay_Basics.java:591)

testMinusMonths_int_negativeFromLeap(org.joda.time.TestMonthDay_Basics)  Time elapsed: 0 sec  <<< ERROR!
java.lang.ArrayIndexOutOfBoundsException: -1
	at org.joda.time.base.BasePartial.getValue(BasePartial.java:225)
	at org.joda.time.base.AbstractPartial.equals(AbstractPartial.java:64)
	at junit.framework.Assert.assertEquals(Assert.java:62)
	at junit.framework.Assert.assertEquals(Assert.java:71)
	at org.joda.time.TestMonthDay_Basics.testMinusMonths_int_negativeFromLeap(TestMonthDay_Basics.java:598)

testMinusMonths_int_endOfMonthAdjust(org.joda.time.TestMonthDay_Basics)  Time elapsed: 0.001 sec  <<< ERROR!
java.lang.ArrayIndexOutOfBoundsException: -1
	at org.joda.time.base.BasePartial.getValue(BasePartial.java:225)
	at org.joda.time.base.AbstractPartial.equals(AbstractPartial.java:64)
	at junit.framework.Assert.assertEquals(Assert.java:62)
	at junit.framework.Assert.assertEquals(Assert.java:71)
	at org.joda.time.TestMonthDay_Basics.testMinusMonths_int_endOfMonthAdjust(TestMonthDay_Basics.java:605)

testMinusMonths_int_negativeEndOfMonthAdjust(org.joda.time.TestMonthDay_Basics)  Time elapsed: 0 sec  <<< ERROR!
java.lang.ArrayIndexOutOfBoundsException: -1
	at org.joda.time.base.BasePartial.getValue(BasePartial.java:225)
	at org.joda.time.base.AbstractPartial.equals(AbstractPartial.java:64)
	at junit.framework.Assert.assertEquals(Assert.java:62)
	at junit.framework.Assert.assertEquals(Assert.java:71)
	at org.joda.time.TestMonthDay_Basics.testMinusMonths_int_negativeEndOfMonthAdjust(TestMonthDay_Basics.java:612)

testMinusMonths_int_wrap(org.joda.time.TestMonthDay_Basics)  Time elapsed: 0.001 sec  <<< ERROR!
java.lang.ArrayIndexOutOfBoundsException: -1
	at org.joda.time.base.BasePartial.getValue(BasePartial.java:225)
	at org.joda.time.base.AbstractPartial.equals(AbstractPartial.java:64)
	at junit.framework.Assert.assertEquals(Assert.java:62)
	at junit.framework.Assert.assertEquals(Assert.java:71)
	at org.joda.time.TestMonthDay_Basics.testMinusMonths_int_wrap(TestMonthDay_Basics.java:625)

testMinusMonths_int_adjust(org.joda.time.TestMonthDay_Basics)  Time elapsed: 0 sec  <<< ERROR!
java.lang.ArrayIndexOutOfBoundsException: -1
	at org.joda.time.base.BasePartial.getValue(BasePartial.java:225)
	at org.joda.time.base.AbstractPartial.equals(AbstractPartial.java:64)
	at junit.framework.Assert.assertEquals(Assert.java:62)
	at junit.framework.Assert.assertEquals(Assert.java:71)
	at org.joda.time.TestMonthDay_Basics.testMinusMonths_int_adjust(TestMonthDay_Basics.java:632)

testMinusDays_int_wrapMonth(org.joda.time.TestMonthDay_Basics)  Time elapsed: 0.001 sec  <<< ERROR!
java.lang.ArrayIndexOutOfBoundsException: -1
	at org.joda.time.base.BasePartial.getValue(BasePartial.java:225)
	at org.joda.time.base.AbstractPartial.equals(AbstractPartial.java:64)
	at junit.framework.Assert.assertEquals(Assert.java:62)
	at junit.framework.Assert.assertEquals(Assert.java:71)
	at org.joda.time.TestMonthDay_Basics.testMinusDays_int_wrapMonth(TestMonthDay_Basics.java:647)

testMinusDays_int_wrapMonthTwice(org.joda.time.TestMonthDay_Basics)  Time elapsed: 0 sec  <<< ERROR!
java.lang.ArrayIndexOutOfBoundsException: -1
	at org.joda.time.base.BasePartial.getValue(BasePartial.java:225)
	at org.joda.time.base.AbstractPartial.equals(AbstractPartial.java:64)
	at junit.framework.Assert.assertEquals(Assert.java:62)
	at junit.framework.Assert.assertEquals(Assert.java:71)
	at org.joda.time.TestMonthDay_Basics.testMinusDays_int_wrapMonthTwice(TestMonthDay_Basics.java:654)

testMinusDays_int_wrapMonthIntoLastYear(org.joda.time.TestMonthDay_Basics)  Time elapsed: 0 sec  <<< ERROR!
java.lang.ArrayIndexOutOfBoundsException: -1
	at org.joda.time.base.BasePartial.getValue(BasePartial.java:225)
	at org.joda.time.base.AbstractPartial.equals(AbstractPartial.java:64)
	at junit.framework.Assert.assertEquals(Assert.java:62)
	at junit.framework.Assert.assertEquals(Assert.java:71)
	at org.joda.time.TestMonthDay_Basics.testMinusDays_int_wrapMonthIntoLastYear(TestMonthDay_Basics.java:661)

testMinusDays_int_wrapMonthTwiceIntoLastYear(org.joda.time.TestMonthDay_Basics)  Time elapsed: 0 sec  <<< ERROR!
java.lang.ArrayIndexOutOfBoundsException: -1
	at org.joda.time.base.BasePartial.getValue(BasePartial.java:225)
	at org.joda.time.base.AbstractPartial.equals(AbstractPartial.java:64)
	at junit.framework.Assert.assertEquals(Assert.java:62)
	at junit.framework.Assert.assertEquals(Assert.java:71)
	at org.joda.time.TestMonthDay_Basics.testMinusDays_int_wrapMonthTwiceIntoLastYear(TestMonthDay_Basics.java:668)

testMinusDays_int_toLeap(org.joda.time.TestMonthDay_Basics)  Time elapsed: 0.001 sec  <<< ERROR!
java.lang.ArrayIndexOutOfBoundsException: -1
	at org.joda.time.base.BasePartial.getValue(BasePartial.java:225)
	at org.joda.time.base.AbstractPartial.equals(AbstractPartial.java:64)
	at junit.framework.Assert.assertEquals(Assert.java:62)
	at junit.framework.Assert.assertEquals(Assert.java:71)
	at org.joda.time.TestMonthDay_Basics.testMinusDays_int_toLeap(TestMonthDay_Basics.java:675)

testMinusDays_int_fromLeap(org.joda.time.TestMonthDay_Basics)  Time elapsed: 0 sec  <<< ERROR!
java.lang.ArrayIndexOutOfBoundsException: -1
	at org.joda.time.base.BasePartial.getValue(BasePartial.java:225)
	at org.joda.time.base.AbstractPartial.equals(AbstractPartial.java:64)
	at junit.framework.Assert.assertEquals(Assert.java:62)
	at junit.framework.Assert.assertEquals(Assert.java:71)
	at org.joda.time.TestMonthDay_Basics.testMinusDays_int_fromLeap(TestMonthDay_Basics.java:682)

testMinusDays_int_negativeFromLeap(org.joda.time.TestMonthDay_Basics)  Time elapsed: 0.001 sec  <<< ERROR!
java.lang.ArrayIndexOutOfBoundsException: -1
	at org.joda.time.base.BasePartial.getValue(BasePartial.java:225)
	at org.joda.time.base.AbstractPartial.equals(AbstractPartial.java:64)
	at junit.framework.Assert.assertEquals(Assert.java:62)
	at junit.framework.Assert.assertEquals(Assert.java:71)
	at org.joda.time.TestMonthDay_Basics.testMinusDays_int_negativeFromLeap(TestMonthDay_Basics.java:689)

testConstructor(org.joda.time.TestMonthDay_Constructors)  Time elapsed: 0.001 sec  <<< ERROR!
java.lang.ArrayIndexOutOfBoundsException: -1
	at org.joda.time.base.BasePartial.getValue(BasePartial.java:225)
	at org.joda.time.base.AbstractPartial.equals(AbstractPartial.java:64)
	at junit.framework.Assert.assertEquals(Assert.java:62)
	at junit.framework.Assert.assertEquals(Assert.java:71)
	at org.joda.time.TestMonthDay_Constructors.testConstructor(TestMonthDay_Constructors.java:126)

testConstructor_DateTimeZone(org.joda.time.TestMonthDay_Constructors)  Time elapsed: 0 sec  <<< ERROR!
java.lang.ArrayIndexOutOfBoundsException: -1
	at org.joda.time.base.BasePartial.getValue(BasePartial.java:225)
	at org.joda.time.base.AbstractPartial.equals(AbstractPartial.java:64)
	at junit.framework.Assert.assertEquals(Assert.java:62)
	at junit.framework.Assert.assertEquals(Assert.java:71)
	at org.joda.time.TestMonthDay_Constructors.testConstructor_DateTimeZone(TestMonthDay_Constructors.java:141)

testConstructor_Chronology(org.joda.time.TestMonthDay_Constructors)  Time elapsed: 0 sec  <<< ERROR!
java.lang.ArrayIndexOutOfBoundsException: -1
	at org.joda.time.base.BasePartial.getValue(BasePartial.java:225)
	at org.joda.time.base.AbstractPartial.equals(AbstractPartial.java:64)
	at junit.framework.Assert.assertEquals(Assert.java:62)
	at junit.framework.Assert.assertEquals(Assert.java:71)
	at org.joda.time.TestMonthDay_Constructors.testConstructor_Chronology(TestMonthDay_Constructors.java:172)

testParse_noFormatter(org.joda.time.TestMonthDay_Constructors)  Time elapsed: 0 sec  <<< ERROR!
java.lang.ArrayIndexOutOfBoundsException: -1
	at org.joda.time.base.BasePartial.getValue(BasePartial.java:225)
	at org.joda.time.base.AbstractPartial.equals(AbstractPartial.java:64)
	at junit.framework.Assert.assertEquals(Assert.java:62)
	at junit.framework.Assert.assertEquals(Assert.java:71)
	at org.joda.time.TestMonthDay_Constructors.testParse_noFormatter(TestMonthDay_Constructors.java:82)

testParse_formatter(org.joda.time.TestMonthDay_Constructors)  Time elapsed: 0 sec  <<< ERROR!
java.lang.ArrayIndexOutOfBoundsException: -1
	at org.joda.time.base.BasePartial.getValue(BasePartial.java:225)
	at org.joda.time.base.AbstractPartial.equals(AbstractPartial.java:64)
	at junit.framework.Assert.assertEquals(Assert.java:62)
	at junit.framework.Assert.assertEquals(Assert.java:71)
	at org.joda.time.TestMonthDay_Constructors.testParse_formatter(TestMonthDay_Constructors.java:90)

testFactory_FromDateFields(org.joda.time.TestMonthDay_Constructors)  Time elapsed: 0 sec  <<< ERROR!
java.lang.ArrayIndexOutOfBoundsException: -1
	at org.joda.time.base.BasePartial.getValue(BasePartial.java:225)
	at org.joda.time.base.AbstractPartial.equals(AbstractPartial.java:64)
	at junit.framework.Assert.assertEquals(Assert.java:62)
	at junit.framework.Assert.assertEquals(Assert.java:71)
	at org.joda.time.TestMonthDay_Constructors.testFactory_FromDateFields(TestMonthDay_Constructors.java:110)

testFactory_FromCalendarFields(org.joda.time.TestMonthDay_Constructors)  Time elapsed: 0 sec  <<< ERROR!
java.lang.ArrayIndexOutOfBoundsException: -1
	at org.joda.time.base.BasePartial.getValue(BasePartial.java:225)
	at org.joda.time.base.AbstractPartial.equals(AbstractPartial.java:64)
	at junit.framework.Assert.assertEquals(Assert.java:62)
	at junit.framework.Assert.assertEquals(Assert.java:71)
	at org.joda.time.TestMonthDay_Constructors.testFactory_FromCalendarFields(TestMonthDay_Constructors.java:98)

testWithFieldAdded1(org.joda.time.TestPartial_Basics)  Time elapsed: 0 sec  <<< ERROR!
java.lang.ArrayIndexOutOfBoundsException: -1
	at org.joda.time.Partial.getValue(Partial.java:393)
	at org.joda.time.base.AbstractPartial.equals(AbstractPartial.java:64)
	at junit.framework.Assert.assertEquals(Assert.java:62)
	at junit.framework.Assert.assertEquals(Assert.java:71)
	at org.joda.time.TestPartial_Basics.testWithFieldAdded1(TestPartial_Basics.java:554)

testEqualsHashCode(org.joda.time.TestPartial_Basics)  Time elapsed: 0 sec  <<< ERROR!
java.lang.ArrayIndexOutOfBoundsException: -1
	at org.joda.time.Partial.getValue(Partial.java:393)
	at org.joda.time.base.AbstractPartial.equals(AbstractPartial.java:64)
	at org.joda.time.TestPartial_Basics.testEqualsHashCode(TestPartial_Basics.java:186)

testSerialization(org.joda.time.TestPartial_Basics)  Time elapsed: 0.003 sec  <<< ERROR!
java.lang.ArrayIndexOutOfBoundsException: -1
	at org.joda.time.Partial.getValue(Partial.java:393)
	at org.joda.time.base.AbstractPartial.equals(AbstractPartial.java:64)
	at junit.framework.Assert.assertEquals(Assert.java:62)
	at junit.framework.Assert.assertEquals(Assert.java:71)
	at org.joda.time.TestPartial_Basics.testSerialization(TestPartial_Basics.java:792)

testWithFieldAddWrapped1(org.joda.time.TestPartial_Basics)  Time elapsed: 0 sec  <<< ERROR!
java.lang.ArrayIndexOutOfBoundsException: -1
	at org.joda.time.Partial.getValue(Partial.java:393)
	at org.joda.time.base.AbstractPartial.equals(AbstractPartial.java:64)
	at junit.framework.Assert.assertEquals(Assert.java:62)
	at junit.framework.Assert.assertEquals(Assert.java:71)
	at org.joda.time.TestPartial_Basics.testWithFieldAddWrapped1(TestPartial_Basics.java:648)

testWithFieldAddWrapped6(org.joda.time.TestPartial_Basics)  Time elapsed: 0 sec  <<< ERROR!
java.lang.ArrayIndexOutOfBoundsException: -1
	at org.joda.time.Partial.getValue(Partial.java:393)
	at org.joda.time.base.AbstractPartial.equals(AbstractPartial.java:64)
	at junit.framework.Assert.assertEquals(Assert.java:62)
	at junit.framework.Assert.assertEquals(Assert.java:71)
	at org.joda.time.TestPartial_Basics.testWithFieldAddWrapped6(TestPartial_Basics.java:690)

testYearMonth(org.joda.time.TestStringConvert)  Time elapsed: 0.001 sec  <<< ERROR!
java.lang.ArrayIndexOutOfBoundsException: -1
	at org.joda.time.base.BasePartial.getValue(BasePartial.java:225)
	at org.joda.time.base.AbstractPartial.equals(AbstractPartial.java:64)
	at junit.framework.Assert.assertEquals(Assert.java:62)
	at junit.framework.Assert.assertEquals(Assert.java:71)
	at org.joda.time.TestStringConvert.testYearMonth(TestStringConvert.java:99)

testMonthDay(org.joda.time.TestStringConvert)  Time elapsed: 0.001 sec  <<< ERROR!
java.lang.ArrayIndexOutOfBoundsException: -1
	at org.joda.time.base.BasePartial.getValue(BasePartial.java:225)
	at org.joda.time.base.AbstractPartial.equals(AbstractPartial.java:64)
	at junit.framework.Assert.assertEquals(Assert.java:62)
	at junit.framework.Assert.assertEquals(Assert.java:71)
	at org.joda.time.TestStringConvert.testMonthDay(TestStringConvert.java:106)

testMonthDay_leapDay(org.joda.time.TestStringConvert)  Time elapsed: 0.001 sec  <<< ERROR!
java.lang.ArrayIndexOutOfBoundsException: -1
	at org.joda.time.base.BasePartial.getValue(BasePartial.java:225)
	at org.joda.time.base.AbstractPartial.equals(AbstractPartial.java:64)
	at junit.framework.Assert.assertEquals(Assert.java:62)
	at junit.framework.Assert.assertEquals(Assert.java:71)
	at org.joda.time.TestStringConvert.testMonthDay_leapDay(TestStringConvert.java:113)

testSerializedYearMonthDay(org.joda.time.TestSerialization)  Time elapsed: 0.001 sec  <<< ERROR!
java.lang.ArrayIndexOutOfBoundsException: -1
	at org.joda.time.base.BasePartial.getValue(BasePartial.java:225)
	at org.joda.time.base.AbstractPartial.equals(AbstractPartial.java:64)
	at junit.framework.Assert.assertEquals(Assert.java:62)
	at junit.framework.Assert.assertEquals(Assert.java:71)
	at org.joda.time.TestSerialization.loadAndCompare(TestSerialization.java:300)
	at org.joda.time.TestSerialization.testSerializedYearMonthDay(TestSerialization.java:199)

testSerializedTimeOfDay(org.joda.time.TestSerialization)  Time elapsed: 0.001 sec  <<< ERROR!
java.lang.ArrayIndexOutOfBoundsException: -1
	at org.joda.time.base.BasePartial.getValue(BasePartial.java:225)
	at org.joda.time.base.AbstractPartial.equals(AbstractPartial.java:64)
	at junit.framework.Assert.assertEquals(Assert.java:62)
	at junit.framework.Assert.assertEquals(Assert.java:71)
	at org.joda.time.TestSerialization.loadAndCompare(TestSerialization.java:300)
	at org.joda.time.TestSerialization.testSerializedTimeOfDay(TestSerialization.java:206)

testCutoverAddYears(org.joda.time.chrono.TestGJChronology)  Time elapsed: 0 sec  <<< ERROR!
java.lang.ArrayIndexOutOfBoundsException: -1
	at org.joda.time.base.BasePartial.getValue(BasePartial.java:225)
	at org.joda.time.base.AbstractPartial.equals(AbstractPartial.java:64)
	at junit.framework.Assert.assertEquals(Assert.java:62)
	at junit.framework.Assert.assertEquals(Assert.java:71)
	at org.joda.time.chrono.TestGJChronology.testAdd(TestGJChronology.java:496)
	at org.joda.time.chrono.TestGJChronology.testCutoverAddYears(TestGJChronology.java:381)

testCutoverAddMonths(org.joda.time.chrono.TestGJChronology)  Time elapsed: 0 sec  <<< ERROR!
java.lang.ArrayIndexOutOfBoundsException: -1
	at org.joda.time.base.BasePartial.getValue(BasePartial.java:225)
	at org.joda.time.base.AbstractPartial.equals(AbstractPartial.java:64)
	at junit.framework.Assert.assertEquals(Assert.java:62)
	at junit.framework.Assert.assertEquals(Assert.java:71)
	at org.joda.time.chrono.TestGJChronology.testAdd(TestGJChronology.java:496)
	at org.joda.time.chrono.TestGJChronology.testCutoverAddMonths(TestGJChronology.java:422)

testCutoverAddDays(org.joda.time.chrono.TestGJChronology)  Time elapsed: 0.001 sec  <<< ERROR!
java.lang.ArrayIndexOutOfBoundsException: -1
	at org.joda.time.base.BasePartial.getValue(BasePartial.java:225)
	at org.joda.time.base.AbstractPartial.equals(AbstractPartial.java:64)
	at junit.framework.Assert.assertEquals(Assert.java:62)
	at junit.framework.Assert.assertEquals(Assert.java:71)
	at org.joda.time.chrono.TestGJChronology.testAdd(TestGJChronology.java:496)
	at org.joda.time.chrono.TestGJChronology.testCutoverAddDays(TestGJChronology.java:452)

testYearEndAddDays(org.joda.time.chrono.TestGJChronology)  Time elapsed: 0 sec  <<< ERROR!
java.lang.ArrayIndexOutOfBoundsException: -1
	at org.joda.time.base.BasePartial.getValue(BasePartial.java:225)
	at org.joda.time.base.AbstractPartial.equals(AbstractPartial.java:64)
	at junit.framework.Assert.assertEquals(Assert.java:62)
	at junit.framework.Assert.assertEquals(Assert.java:71)
	at org.joda.time.chrono.TestGJChronology.testAdd(TestGJChronology.java:496)
	at org.joda.time.chrono.TestGJChronology.testYearEndAddDays(TestGJChronology.java:462)

testTimeOfDayAdd(org.joda.time.chrono.TestGJChronology)  Time elapsed: 0 sec  <<< ERROR!
java.lang.ArrayIndexOutOfBoundsException: -1
	at org.joda.time.base.BasePartial.getValue(BasePartial.java:225)
	at org.joda.time.base.AbstractPartial.equals(AbstractPartial.java:64)
	at junit.framework.Assert.assertEquals(Assert.java:62)
	at junit.framework.Assert.assertEquals(Assert.java:71)
	at org.joda.time.chrono.TestGJChronology.testTimeOfDayAdd(TestGJChronology.java:504)

testAddMonths(org.joda.time.chrono.TestISOChronology)  Time elapsed: 0 sec  <<< ERROR!
java.lang.ArrayIndexOutOfBoundsException

testCutoverAddYears(org.joda.time.chrono.TestISOChronology)  Time elapsed: 0.001 sec  <<< ERROR!
java.lang.ArrayIndexOutOfBoundsException

testPartialDayOfYearAdd(org.joda.time.chrono.TestISOChronology)  Time elapsed: 0.001 sec  <<< ERROR!
java.lang.ArrayIndexOutOfBoundsException: -1
	at org.joda.time.Partial.getValue(Partial.java:393)
	at org.joda.time.base.AbstractPartial.equals(AbstractPartial.java:64)
	at junit.framework.Assert.assertEquals(Assert.java:62)
	at junit.framework.Assert.assertEquals(Assert.java:71)
	at org.joda.time.chrono.TestISOChronology.testPartialDayOfYearAdd(TestISOChronology.java:442)

testTimeOfDayAdd(org.joda.time.chrono.TestISOChronology)  Time elapsed: 0 sec  <<< ERROR!
java.lang.ArrayIndexOutOfBoundsException


Results :

Tests in error: 
  org.joda.time.TestDateMidnight_Basics#testToYearMonthDay ArrayIndexOutOfBoundsException
  org.joda.time.TestDateTime_Basics#testToTimeOfDay ArrayIndexOutOfBoundsException
  org.joda.time.TestDateTime_Basics#testToYearMonthDay ArrayIndexOutOfBoundsException
  org.joda.time.TestLocalDateTime_Basics#testEqualsHashCode IndexOutOfBoundsException
  org.joda.time.TestLocalDateTime_Basics#testToDate_summer IndexOutOfBoundsException
  org.joda.time.TestLocalDateTime_Basics#testToDate_summer_Zone IndexOutOfBoundsException
  org.joda.time.TestLocalDateTime_Basics#testToDate_winter IndexOutOfBoundsException
  org.joda.time.TestLocalDateTime_Basics#testToDate_winter_Zone IndexOutOfBoundsException
  org.joda.time.TestLocalDate_Basics#testEqualsHashCode IndexOutOfBoundsException
  org.joda.time.TestLocalDate_Basics#testToDate_summer IndexOutOfBoundsException
  org.joda.time.TestLocalDate_Basics#testToDate_winter IndexOutOfBoundsException
  org.joda.time.TestLocalTime_Basics#testEqualsHashCode IndexOutOfBoundsException
  org.joda.time.TestMonthDay_Basics#testEqualsHashCode ArrayIndexOutOfBoundsException
  org.joda.time.TestMonthDay_Basics#testMinusDays_int ArrayIndexOutOfBoundsException
  org.joda.time.TestMonthDay_Basics#testMinusDays_int_fromLeap ArrayIndexOutOfBoundsException
  org.joda.time.TestMonthDay_Basics#testMinusDays_int_negativeFromLeap ArrayIndexOutOfBoundsException
  org.joda.time.TestMonthDay_Basics#testMinusDays_int_toLeap ArrayIndexOutOfBoundsException
  org.joda.time.TestMonthDay_Basics#testMinusDays_int_wrapMonth ArrayIndexOutOfBoundsException
  org.joda.time.TestMonthDay_Basics#testMinusDays_int_wrapMonthIntoLastYear ArrayIndexOutOfBoundsException
  org.joda.time.TestMonthDay_Basics#testMinusDays_int_wrapMonthTwice ArrayIndexOutOfBoundsException
  org.joda.time.TestMonthDay_Basics#testMinusDays_int_wrapMonthTwiceIntoLastYear ArrayIndexOutOfBoundsException
  org.joda.time.TestMonthDay_Basics#testMinusMonths_int ArrayIndexOutOfBoundsException
  org.joda.time.TestMonthDay_Basics#testMinusMonths_int_adjust ArrayIndexOutOfBoundsException
  org.joda.time.TestMonthDay_Basics#testMinusMonths_int_endOfMonthAdjust ArrayIndexOutOfBoundsException
  org.joda.time.TestMonthDay_Basics#testMinusMonths_int_fromLeap ArrayIndexOutOfBoundsException
  org.joda.time.TestMonthDay_Basics#testMinusMonths_int_negativeEndOfMonthAdjust ArrayIndexOutOfBoundsException
  org.joda.time.TestMonthDay_Basics#testMinusMonths_int_negativeFromLeap ArrayIndexOutOfBoundsException
  org.joda.time.TestMonthDay_Basics#testMinusMonths_int_wrap ArrayIndexOutOfBoundsException
  org.joda.time.TestMonthDay_Basics#testMinus_RP ArrayIndexOutOfBoundsException ...
  org.joda.time.TestMonthDay_Basics#testPlusDays_int ArrayIndexOutOfBoundsException
  org.joda.time.TestMonthDay_Basics#testPlusDays_int_fromLeap ArrayIndexOutOfBoundsException
  org.joda.time.TestMonthDay_Basics#testPlusDays_int_negativeFromLeap ArrayIndexOutOfBoundsException
  org.joda.time.TestMonthDay_Basics#testPlusDays_int_toLeap ArrayIndexOutOfBoundsException
  org.joda.time.TestMonthDay_Basics#testPlusDays_int_wrap50 ArrayIndexOutOfBoundsException
  org.joda.time.TestMonthDay_Basics#testPlusDays_int_wrapMonth ArrayIndexOutOfBoundsException
  org.joda.time.TestMonthDay_Basics#testPlusDays_int_wrapMonthIntoNextYear ArrayIndexOutOfBoundsException
  org.joda.time.TestMonthDay_Basics#testPlusDays_int_wrapMonthTwice ArrayIndexOutOfBoundsException
  org.joda.time.TestMonthDay_Basics#testPlusDays_int_wrapMonthTwiceIntoNextYear ArrayIndexOutOfBoundsException
  org.joda.time.TestMonthDay_Basics#testPlusMonths_int ArrayIndexOutOfBoundsException
  org.joda.time.TestMonthDay_Basics#testPlusMonths_int_adjust ArrayIndexOutOfBoundsException
  org.joda.time.TestMonthDay_Basics#testPlusMonths_int_endOfMonthAdjust ArrayIndexOutOfBoundsException
  org.joda.time.TestMonthDay_Basics#testPlusMonths_int_fromLeap ArrayIndexOutOfBoundsException
  org.joda.time.TestMonthDay_Basics#testPlusMonths_int_negativeEndOfMonthAdjust ArrayIndexOutOfBoundsException
  org.joda.time.TestMonthDay_Basics#testPlusMonths_int_negativeFromLeap ArrayIndexOutOfBoundsException
  org.joda.time.TestMonthDay_Basics#testPlusMonths_int_wrap ArrayIndexOutOfBoundsException
  org.joda.time.TestMonthDay_Basics#testPlus_RP ArrayIndexOutOfBoundsException -...
  org.joda.time.TestMonthDay_Basics#testSerialization ArrayIndexOutOfBoundsException
  org.joda.time.TestMonthDay_Basics#testWithField ArrayIndexOutOfBoundsException
  org.joda.time.TestMonthDay_Basics#testWithFieldAdded ArrayIndexOutOfBoundsException
  org.joda.time.TestMonthDay_Basics#testWithField_same ArrayIndexOutOfBoundsException
  org.joda.time.TestMonthDay_Constructors#testConstructor ArrayIndexOutOfBoundsException
  org.joda.time.TestMonthDay_Constructors#testConstructor_Chronology ArrayIndexOutOfBoundsException
  org.joda.time.TestMonthDay_Constructors#testConstructor_DateTimeZone ArrayIndexOutOfBoundsException
  org.joda.time.TestMonthDay_Constructors#testFactory_FromCalendarFields ArrayIndexOutOfBoundsException
  org.joda.time.TestMonthDay_Constructors#testFactory_FromDateFields ArrayIndexOutOfBoundsException
  org.joda.time.TestMonthDay_Constructors#testParse_formatter ArrayIndexOutOfBoundsException
  org.joda.time.TestMonthDay_Constructors#testParse_noFormatter ArrayIndexOutOfBoundsException
  org.joda.time.TestPartial_Basics#testEqualsHashCode ArrayIndexOutOfBoundsException
  org.joda.time.TestPartial_Basics#testSerialization ArrayIndexOutOfBoundsException
  org.joda.time.TestPartial_Basics#testWithFieldAddWrapped1 ArrayIndexOutOfBoundsException
  org.joda.time.TestPartial_Basics#testWithFieldAddWrapped6 ArrayIndexOutOfBoundsException
  org.joda.time.TestPartial_Basics#testWithFieldAdded1 ArrayIndexOutOfBoundsException
  org.joda.time.TestSerialization#testSerializedTimeOfDay ArrayIndexOutOfBoundsException
  org.joda.time.TestSerialization#testSerializedYearMonthDay ArrayIndexOutOfBoundsException
  org.joda.time.TestStringConvert#testMonthDay ArrayIndexOutOfBoundsException -1
  org.joda.time.TestStringConvert#testMonthDay_leapDay ArrayIndexOutOfBoundsException
  org.joda.time.TestStringConvert#testYearMonth ArrayIndexOutOfBoundsException -...
  org.joda.time.TestTimeOfDay_Basics#testEqualsHashCode ArrayIndexOutOfBoundsException
  org.joda.time.TestTimeOfDay_Basics#testMinusHours_int ArrayIndexOutOfBoundsException
  org.joda.time.TestTimeOfDay_Basics#testMinusMillis_int ArrayIndexOutOfBoundsException
  org.joda.time.TestTimeOfDay_Basics#testMinusMinutes_int ArrayIndexOutOfBoundsException
  org.joda.time.TestTimeOfDay_Basics#testMinusSeconds_int ArrayIndexOutOfBoundsException
  org.joda.time.TestTimeOfDay_Basics#testMinus_RP ArrayIndexOutOfBoundsException
  org.joda.time.TestTimeOfDay_Basics#testPlusHours_int ArrayIndexOutOfBoundsException
  org.joda.time.TestTimeOfDay_Basics#testPlusMillis_int ArrayIndexOutOfBoundsException
  org.joda.time.TestTimeOfDay_Basics#testPlusMinutes_int ArrayIndexOutOfBoundsException
  org.joda.time.TestTimeOfDay_Basics#testPlusSeconds_int ArrayIndexOutOfBoundsException
  org.joda.time.TestTimeOfDay_Basics#testPlus_RP ArrayIndexOutOfBoundsException ...
  org.joda.time.TestTimeOfDay_Basics#testSerialization ArrayIndexOutOfBoundsException
  org.joda.time.TestTimeOfDay_Basics#testWithField1 ArrayIndexOutOfBoundsException
  org.joda.time.TestTimeOfDay_Basics#testWithFieldAdded1 ArrayIndexOutOfBoundsException
  org.joda.time.TestTimeOfDay_Basics#testWithFieldAdded6 ArrayIndexOutOfBoundsException
  org.joda.time.TestTimeOfDay_Basics#testWithFieldAdded7 ArrayIndexOutOfBoundsException
  org.joda.time.TestTimeOfDay_Basics#testWithFieldAdded8 ArrayIndexOutOfBoundsException
  org.joda.time.TestTimeOfDay_Constructors#testFactory_FromCalendarFields ArrayIndexOutOfBoundsException
  org.joda.time.TestTimeOfDay_Constructors#testFactory_FromDateFields_after1970 ArrayIndexOutOfBoundsException
  org.joda.time.TestTimeOfDay_Constructors#testFactory_FromDateFields_before1970 ArrayIndexOutOfBoundsException
  org.joda.time.TestYearMonthDay_Basics#testEqualsHashCode ArrayIndexOutOfBoundsException
  org.joda.time.TestYearMonthDay_Basics#testMinusDays_int ArrayIndexOutOfBoundsException
  org.joda.time.TestYearMonthDay_Basics#testMinusMonths_int ArrayIndexOutOfBoundsException
  org.joda.time.TestYearMonthDay_Basics#testMinusYears_int ArrayIndexOutOfBoundsException
  org.joda.time.TestYearMonthDay_Basics#testMinus_RP ArrayIndexOutOfBoundsException
  org.joda.time.TestYearMonthDay_Basics#testPlusDays_int ArrayIndexOutOfBoundsException
  org.joda.time.TestYearMonthDay_Basics#testPlusMonths_int ArrayIndexOutOfBoundsException
  org.joda.time.TestYearMonthDay_Basics#testPlusYears_int ArrayIndexOutOfBoundsException
  org.joda.time.TestYearMonthDay_Basics#testPlus_RP ArrayIndexOutOfBoundsException
  org.joda.time.TestYearMonthDay_Basics#testSerialization ArrayIndexOutOfBoundsException
  org.joda.time.TestYearMonthDay_Basics#testWithField1 ArrayIndexOutOfBoundsException
  org.joda.time.TestYearMonthDay_Basics#testWithField4 ArrayIndexOutOfBoundsException
  org.joda.time.TestYearMonthDay_Basics#testWithFieldAdded1 ArrayIndexOutOfBoundsException
  org.joda.time.TestYearMonthDay_Constructors#testFactory_FromCalendarFields ArrayIndexOutOfBoundsException
  org.joda.time.TestYearMonthDay_Constructors#testFactory_FromDateFields ArrayIndexOutOfBoundsException
  org.joda.time.TestYearMonth_Basics#testEqualsHashCode ArrayIndexOutOfBoundsException
  org.joda.time.TestYearMonth_Basics#testMinusMonths_int ArrayIndexOutOfBoundsException
  org.joda.time.TestYearMonth_Basics#testMinusYears_int ArrayIndexOutOfBoundsException
  org.joda.time.TestYearMonth_Basics#testMinus_RP ArrayIndexOutOfBoundsException
  org.joda.time.TestYearMonth_Basics#testPlusMonths_int ArrayIndexOutOfBoundsException
  org.joda.time.TestYearMonth_Basics#testPlusYears_int ArrayIndexOutOfBoundsException
  org.joda.time.TestYearMonth_Basics#testPlus_RP ArrayIndexOutOfBoundsException ...
  org.joda.time.TestYearMonth_Basics#testSerialization ArrayIndexOutOfBoundsException
  org.joda.time.TestYearMonth_Basics#testWithField ArrayIndexOutOfBoundsException
  org.joda.time.TestYearMonth_Basics#testWithFieldAdded ArrayIndexOutOfBoundsException
  org.joda.time.TestYearMonth_Basics#testWithField_same ArrayIndexOutOfBoundsException
  org.joda.time.TestYearMonth_Constructors#testConstructor ArrayIndexOutOfBoundsException
  org.joda.time.TestYearMonth_Constructors#testConstructor_Chronology ArrayIndexOutOfBoundsException
  org.joda.time.TestYearMonth_Constructors#testConstructor_DateTimeZone ArrayIndexOutOfBoundsException
  org.joda.time.TestYearMonth_Constructors#testFactory_FromCalendarFields ArrayIndexOutOfBoundsException
  org.joda.time.TestYearMonth_Constructors#testFactory_FromDateFields ArrayIndexOutOfBoundsException
  org.joda.time.TestYearMonth_Constructors#testParse_formatter ArrayIndexOutOfBoundsException
  org.joda.time.TestYearMonth_Constructors#testParse_noFormatter ArrayIndexOutOfBoundsException
  org.joda.time.chrono.TestGJChronology#testCutoverAddDays ArrayIndexOutOfBoundsException
  org.joda.time.chrono.TestGJChronology#testCutoverAddMonths ArrayIndexOutOfBoundsException
  org.joda.time.chrono.TestGJChronology#testCutoverAddYears ArrayIndexOutOfBoundsException
  org.joda.time.chrono.TestGJChronology#testTimeOfDayAdd ArrayIndexOutOfBoundsException
  org.joda.time.chrono.TestGJChronology#testYearEndAddDays ArrayIndexOutOfBoundsException
  org.joda.time.chrono.TestISOChronology#testAddMonths ArrayIndexOutOfBoundsException
  org.joda.time.chrono.TestISOChronology#testCutoverAddYears ArrayIndexOutOfBoundsException
  org.joda.time.chrono.TestISOChronology#testPartialDayOfYearAdd ArrayIndexOutOfBoundsException
  org.joda.time.chrono.TestISOChronology#testTimeOfDayAdd ArrayIndexOutOfBoundsException

Tests run: 4157, Failures: 0, Errors: 129, Skipped: 0

[INFO] ------------------------------------------------------------------------
[INFO] BUILD FAILURE
[INFO] ------------------------------------------------------------------------
[INFO] Total time: 17.445s
[INFO] Finished at: Wed Aug 05 20:40:47 BST 2015
[INFO] Final Memory: 10M/338M
[INFO] ------------------------------------------------------------------------
[ERROR] Failed to execute goal org.apache.maven.plugins:maven-surefire-plugin:2.18.1:test (default-test) on project joda-time: There are test failures.
[ERROR] 
[ERROR] Please refer to /home/perham/Study/LittleDarwin/Cases/joda-time-2.8.1/target/surefire-reports for the individual test results.
[ERROR] -> [Help 1]
[ERROR] 
[ERROR] To see the full stack trace of the errors, re-run Maven with the -e switch.
[ERROR] Re-run Maven using the -X switch to enable full debug logging.
[ERROR] 
[ERROR] For more information about the errors and possible solutions, please read the following articles:
[ERROR] [Help 1] http://cwiki.apache.org/confluence/display/MAVEN/MojoFailureException
