[INFO] Scanning for projects...
[INFO]                                                                         
[INFO] ------------------------------------------------------------------------
[INFO] Building Joda-Time 2.8.1
[INFO] ------------------------------------------------------------------------
[INFO] 
[INFO] --- maven-resources-plugin:2.7:resources (default-resources) @ joda-time ---
[INFO] Using 'UTF-8' encoding to copy filtered resources.
[INFO] Copying 2 resources to META-INF
[INFO] Copying 10 resources
[INFO] 
[INFO] --- maven-compiler-plugin:3.3:compile (default-compile) @ joda-time ---
[INFO] Changes detected - recompiling the module!
[INFO] Compiling 166 source files to /home/perham/Study/LittleDarwin/Cases/joda-time-2.8.1/target/classes
[INFO] 
[INFO] --- exec-maven-plugin:1.4.0:java (compile-tzdb) @ joda-time ---
Writing zoneinfo files
Writing ZoneInfoMap
[INFO] 
[INFO] --- maven-resources-plugin:2.7:testResources (default-testResources) @ joda-time ---
[INFO] Using 'UTF-8' encoding to copy filtered resources.
[INFO] Copying 34 resources
[INFO] 
[INFO] --- maven-compiler-plugin:3.3:testCompile (default-testCompile) @ joda-time ---
[INFO] Nothing to compile - all classes are up to date
[INFO] 
[INFO] --- maven-surefire-plugin:2.18.1:test (default-test) @ joda-time ---
[INFO] Surefire report directory: /home/perham/Study/LittleDarwin/Cases/joda-time-2.8.1/target/surefire-reports

-------------------------------------------------------
 T E S T S
-------------------------------------------------------
Running org.joda.time.TestAllPackages

TestBuddhistChronology.testCalendar

TestCopticChronology.testCalendar

TestEthiopicChronology.testCalendar

TestIslamicChronology.testCalendar

Testing Gregorian chronology over 1000 iterations
100% complete (i=1000)

Testing Julian chronology over 1000 iterations
100% complete (i=1000)
Writing zoneinfo files
Writing ZoneInfoMap
Tests run: 4157, Failures: 0, Errors: 38, Skipped: 0, Time elapsed: 5.404 sec <<< FAILURE! - in org.joda.time.TestAllPackages
testCompareTo(org.joda.time.TestLocalDateTime_Basics)  Time elapsed: 0.003 sec  <<< ERROR!
java.lang.IndexOutOfBoundsException: Invalid index: -1
	at org.joda.time.LocalDateTime.getField(LocalDateTime.java:562)
	at org.joda.time.base.AbstractPartial.getFieldType(AbstractPartial.java:21)
	at org.joda.time.base.AbstractPartial.compareTo(AbstractPartial.java:77)
	at org.joda.time.LocalDateTime.compareTo(LocalDateTime.java:714)
	at org.joda.time.TestLocalDateTime_Basics.testCompareTo(TestLocalDateTime_Basics.java:344)

testToDate_summer(org.joda.time.TestLocalDateTime_Basics)  Time elapsed: 0.001 sec  <<< ERROR!
java.lang.IndexOutOfBoundsException: Invalid index: -1
	at org.joda.time.LocalDateTime.getField(LocalDateTime.java:562)
	at org.joda.time.base.AbstractPartial.getFieldType(AbstractPartial.java:21)
	at org.joda.time.base.AbstractPartial.compareTo(AbstractPartial.java:77)
	at org.joda.time.LocalDateTime.compareTo(LocalDateTime.java:714)
	at org.joda.time.base.AbstractPartial.isBefore(AbstractPartial.java:86)
	at org.joda.time.LocalDateTime.correctDstTransition(LocalDateTime.java:852)
	at org.joda.time.LocalDateTime.toDate(LocalDateTime.java:799)
	at org.joda.time.TestLocalDateTime_Basics.testToDate_summer(TestLocalDateTime_Basics.java:853)

testToDate_winter(org.joda.time.TestLocalDateTime_Basics)  Time elapsed: 0.001 sec  <<< ERROR!
java.lang.IndexOutOfBoundsException: Invalid index: -1
	at org.joda.time.LocalDateTime.getField(LocalDateTime.java:562)
	at org.joda.time.base.AbstractPartial.getFieldType(AbstractPartial.java:21)
	at org.joda.time.base.AbstractPartial.compareTo(AbstractPartial.java:77)
	at org.joda.time.LocalDateTime.compareTo(LocalDateTime.java:714)
	at org.joda.time.base.AbstractPartial.isBefore(AbstractPartial.java:86)
	at org.joda.time.LocalDateTime.correctDstTransition(LocalDateTime.java:852)
	at org.joda.time.LocalDateTime.toDate(LocalDateTime.java:799)
	at org.joda.time.TestLocalDateTime_Basics.testToDate_winter(TestLocalDateTime_Basics.java:871)

testToDate_summer_Zone(org.joda.time.TestLocalDateTime_Basics)  Time elapsed: 0.001 sec  <<< ERROR!
java.lang.IndexOutOfBoundsException: Invalid index: -1
	at org.joda.time.LocalDateTime.getField(LocalDateTime.java:562)
	at org.joda.time.base.AbstractPartial.getFieldType(AbstractPartial.java:21)
	at org.joda.time.base.AbstractPartial.compareTo(AbstractPartial.java:77)
	at org.joda.time.LocalDateTime.compareTo(LocalDateTime.java:714)
	at org.joda.time.base.AbstractPartial.isBefore(AbstractPartial.java:86)
	at org.joda.time.LocalDateTime.correctDstTransition(LocalDateTime.java:852)
	at org.joda.time.LocalDateTime.toDate(LocalDateTime.java:830)
	at org.joda.time.TestLocalDateTime_Basics.testToDate_summer_Zone(TestLocalDateTime_Basics.java:938)

testToDate_winter_Zone(org.joda.time.TestLocalDateTime_Basics)  Time elapsed: 0 sec  <<< ERROR!
java.lang.IndexOutOfBoundsException: Invalid index: -1
	at org.joda.time.LocalDateTime.getField(LocalDateTime.java:562)
	at org.joda.time.base.AbstractPartial.getFieldType(AbstractPartial.java:21)
	at org.joda.time.base.AbstractPartial.compareTo(AbstractPartial.java:77)
	at org.joda.time.LocalDateTime.compareTo(LocalDateTime.java:714)
	at org.joda.time.base.AbstractPartial.isBefore(AbstractPartial.java:86)
	at org.joda.time.LocalDateTime.correctDstTransition(LocalDateTime.java:852)
	at org.joda.time.LocalDateTime.toDate(LocalDateTime.java:830)
	at org.joda.time.TestLocalDateTime_Basics.testToDate_winter_Zone(TestLocalDateTime_Basics.java:956)

testIsEqual_LocalDateTime(org.joda.time.TestLocalDateTime_Basics)  Time elapsed: 0.001 sec  <<< ERROR!
java.lang.IndexOutOfBoundsException: Invalid index: -1
	at org.joda.time.LocalDateTime.getField(LocalDateTime.java:562)
	at org.joda.time.base.AbstractPartial.getFieldType(AbstractPartial.java:21)
	at org.joda.time.base.AbstractPartial.compareTo(AbstractPartial.java:77)
	at org.joda.time.LocalDateTime.compareTo(LocalDateTime.java:714)
	at org.joda.time.base.AbstractPartial.isEqual(AbstractPartial.java:88)
	at org.joda.time.TestLocalDateTime_Basics.testIsEqual_LocalDateTime(TestLocalDateTime_Basics.java:401)

testIsBefore_LocalDateTime(org.joda.time.TestLocalDateTime_Basics)  Time elapsed: 0 sec  <<< ERROR!
java.lang.IndexOutOfBoundsException: Invalid index: -1
	at org.joda.time.LocalDateTime.getField(LocalDateTime.java:562)
	at org.joda.time.base.AbstractPartial.getFieldType(AbstractPartial.java:21)
	at org.joda.time.base.AbstractPartial.compareTo(AbstractPartial.java:77)
	at org.joda.time.LocalDateTime.compareTo(LocalDateTime.java:714)
	at org.joda.time.base.AbstractPartial.isBefore(AbstractPartial.java:86)
	at org.joda.time.TestLocalDateTime_Basics.testIsBefore_LocalDateTime(TestLocalDateTime_Basics.java:425)

testIsAfter_LocalDateTime(org.joda.time.TestLocalDateTime_Basics)  Time elapsed: 0.001 sec  <<< ERROR!
java.lang.IndexOutOfBoundsException: Invalid index: -1
	at org.joda.time.LocalDateTime.getField(LocalDateTime.java:562)
	at org.joda.time.base.AbstractPartial.getFieldType(AbstractPartial.java:21)
	at org.joda.time.base.AbstractPartial.compareTo(AbstractPartial.java:77)
	at org.joda.time.LocalDateTime.compareTo(LocalDateTime.java:714)
	at org.joda.time.base.AbstractPartial.isAfter(AbstractPartial.java:84)
	at org.joda.time.TestLocalDateTime_Basics.testIsAfter_LocalDateTime(TestLocalDateTime_Basics.java:449)

testCompareTo(org.joda.time.TestLocalDate_Basics)  Time elapsed: 0.001 sec  <<< ERROR!
java.lang.IndexOutOfBoundsException: Invalid index: -1
	at org.joda.time.LocalDate.getField(LocalDate.java:507)
	at org.joda.time.base.AbstractPartial.getFieldType(AbstractPartial.java:21)
	at org.joda.time.base.AbstractPartial.compareTo(AbstractPartial.java:77)
	at org.joda.time.LocalDate.compareTo(LocalDate.java:687)
	at org.joda.time.TestLocalDate_Basics.testCompareTo(TestLocalDate_Basics.java:338)

testToDate_summer(org.joda.time.TestLocalDate_Basics)  Time elapsed: 0.001 sec  <<< ERROR!
java.lang.IndexOutOfBoundsException: Invalid index: -1
	at org.joda.time.LocalDate.getField(LocalDate.java:507)
	at org.joda.time.base.AbstractPartial.getFieldType(AbstractPartial.java:21)
	at org.joda.time.base.AbstractPartial.compareTo(AbstractPartial.java:77)
	at org.joda.time.LocalDate.compareTo(LocalDate.java:687)
	at org.joda.time.base.AbstractPartial.isBefore(AbstractPartial.java:86)
	at org.joda.time.LocalDate.toDate(LocalDate.java:1019)
	at org.joda.time.TestLocalDate_Basics.testToDate_summer(TestLocalDate_Basics.java:1005)

testToDate_winter(org.joda.time.TestLocalDate_Basics)  Time elapsed: 0 sec  <<< ERROR!
java.lang.IndexOutOfBoundsException: Invalid index: -1
	at org.joda.time.LocalDate.getField(LocalDate.java:507)
	at org.joda.time.base.AbstractPartial.getFieldType(AbstractPartial.java:21)
	at org.joda.time.base.AbstractPartial.compareTo(AbstractPartial.java:77)
	at org.joda.time.LocalDate.compareTo(LocalDate.java:687)
	at org.joda.time.base.AbstractPartial.isBefore(AbstractPartial.java:86)
	at org.joda.time.LocalDate.toDate(LocalDate.java:1019)
	at org.joda.time.TestLocalDate_Basics.testToDate_winter(TestLocalDate_Basics.java:1019)

testIsEqual_LocalDate(org.joda.time.TestLocalDate_Basics)  Time elapsed: 0.001 sec  <<< ERROR!
java.lang.IndexOutOfBoundsException: Invalid index: -1
	at org.joda.time.LocalDate.getField(LocalDate.java:507)
	at org.joda.time.base.AbstractPartial.getFieldType(AbstractPartial.java:21)
	at org.joda.time.base.AbstractPartial.compareTo(AbstractPartial.java:77)
	at org.joda.time.LocalDate.compareTo(LocalDate.java:687)
	at org.joda.time.base.AbstractPartial.isEqual(AbstractPartial.java:88)
	at org.joda.time.TestLocalDate_Basics.testIsEqual_LocalDate(TestLocalDate_Basics.java:387)

testIsBefore_LocalDate(org.joda.time.TestLocalDate_Basics)  Time elapsed: 0 sec  <<< ERROR!
java.lang.IndexOutOfBoundsException: Invalid index: -1
	at org.joda.time.LocalDate.getField(LocalDate.java:507)
	at org.joda.time.base.AbstractPartial.getFieldType(AbstractPartial.java:21)
	at org.joda.time.base.AbstractPartial.compareTo(AbstractPartial.java:77)
	at org.joda.time.LocalDate.compareTo(LocalDate.java:687)
	at org.joda.time.base.AbstractPartial.isBefore(AbstractPartial.java:86)
	at org.joda.time.TestLocalDate_Basics.testIsBefore_LocalDate(TestLocalDate_Basics.java:411)

testIsAfter_LocalDate(org.joda.time.TestLocalDate_Basics)  Time elapsed: 0 sec  <<< ERROR!
java.lang.IndexOutOfBoundsException: Invalid index: -1
	at org.joda.time.LocalDate.getField(LocalDate.java:507)
	at org.joda.time.base.AbstractPartial.getFieldType(AbstractPartial.java:21)
	at org.joda.time.base.AbstractPartial.compareTo(AbstractPartial.java:77)
	at org.joda.time.LocalDate.compareTo(LocalDate.java:687)
	at org.joda.time.base.AbstractPartial.isAfter(AbstractPartial.java:84)
	at org.joda.time.TestLocalDate_Basics.testIsAfter_LocalDate(TestLocalDate_Basics.java:435)

testCompareTo(org.joda.time.TestLocalTime_Basics)  Time elapsed: 0.001 sec  <<< ERROR!
java.lang.IndexOutOfBoundsException: Invalid index: -1
	at org.joda.time.LocalTime.getField(LocalTime.java:558)
	at org.joda.time.base.AbstractPartial.getFieldType(AbstractPartial.java:21)
	at org.joda.time.base.AbstractPartial.compareTo(AbstractPartial.java:77)
	at org.joda.time.LocalTime.compareTo(LocalTime.java:723)
	at org.joda.time.TestLocalTime_Basics.testCompareTo(TestLocalTime_Basics.java:327)

testIsEqual_LocalTime(org.joda.time.TestLocalTime_Basics)  Time elapsed: 0 sec  <<< ERROR!
java.lang.IndexOutOfBoundsException: Invalid index: -1
	at org.joda.time.LocalTime.getField(LocalTime.java:558)
	at org.joda.time.base.AbstractPartial.getFieldType(AbstractPartial.java:21)
	at org.joda.time.base.AbstractPartial.compareTo(AbstractPartial.java:77)
	at org.joda.time.LocalTime.compareTo(LocalTime.java:723)
	at org.joda.time.base.AbstractPartial.isEqual(AbstractPartial.java:88)
	at org.joda.time.TestLocalTime_Basics.testIsEqual_LocalTime(TestLocalTime_Basics.java:365)

testIsBefore_LocalTime(org.joda.time.TestLocalTime_Basics)  Time elapsed: 0.001 sec  <<< ERROR!
java.lang.IndexOutOfBoundsException: Invalid index: -1
	at org.joda.time.LocalTime.getField(LocalTime.java:558)
	at org.joda.time.base.AbstractPartial.getFieldType(AbstractPartial.java:21)
	at org.joda.time.base.AbstractPartial.compareTo(AbstractPartial.java:77)
	at org.joda.time.LocalTime.compareTo(LocalTime.java:723)
	at org.joda.time.base.AbstractPartial.isBefore(AbstractPartial.java:86)
	at org.joda.time.TestLocalTime_Basics.testIsBefore_LocalTime(TestLocalTime_Basics.java:389)

testIsAfter_LocalTime(org.joda.time.TestLocalTime_Basics)  Time elapsed: 0 sec  <<< ERROR!
java.lang.IndexOutOfBoundsException: Invalid index: -1
	at org.joda.time.LocalTime.getField(LocalTime.java:558)
	at org.joda.time.base.AbstractPartial.getFieldType(AbstractPartial.java:21)
	at org.joda.time.base.AbstractPartial.compareTo(AbstractPartial.java:77)
	at org.joda.time.LocalTime.compareTo(LocalTime.java:723)
	at org.joda.time.base.AbstractPartial.isAfter(AbstractPartial.java:84)
	at org.joda.time.TestLocalTime_Basics.testIsAfter_LocalTime(TestLocalTime_Basics.java:413)

testCompareTo(org.joda.time.TestTimeOfDay_Basics)  Time elapsed: 0.001 sec  <<< ERROR!
java.lang.ArrayIndexOutOfBoundsException: -1
	at org.joda.time.TimeOfDay.getFieldType(TimeOfDay.java:464)
	at org.joda.time.base.AbstractPartial.compareTo(AbstractPartial.java:77)
	at org.joda.time.TestTimeOfDay_Basics.testCompareTo(TestTimeOfDay_Basics.java:242)

testIsEqual_TOD(org.joda.time.TestTimeOfDay_Basics)  Time elapsed: 0.009 sec  <<< ERROR!
java.lang.ArrayIndexOutOfBoundsException: -1
	at org.joda.time.TimeOfDay.getFieldType(TimeOfDay.java:464)
	at org.joda.time.base.AbstractPartial.compareTo(AbstractPartial.java:77)
	at org.joda.time.base.AbstractPartial.isEqual(AbstractPartial.java:88)
	at org.joda.time.TestTimeOfDay_Basics.testIsEqual_TOD(TestTimeOfDay_Basics.java:279)

testIsBefore_TOD(org.joda.time.TestTimeOfDay_Basics)  Time elapsed: 0 sec  <<< ERROR!
java.lang.ArrayIndexOutOfBoundsException: -1
	at org.joda.time.TimeOfDay.getFieldType(TimeOfDay.java:464)
	at org.joda.time.base.AbstractPartial.compareTo(AbstractPartial.java:77)
	at org.joda.time.base.AbstractPartial.isBefore(AbstractPartial.java:86)
	at org.joda.time.TestTimeOfDay_Basics.testIsBefore_TOD(TestTimeOfDay_Basics.java:303)

testIsAfter_TOD(org.joda.time.TestTimeOfDay_Basics)  Time elapsed: 0.001 sec  <<< ERROR!
java.lang.ArrayIndexOutOfBoundsException: -1
	at org.joda.time.TimeOfDay.getFieldType(TimeOfDay.java:464)
	at org.joda.time.base.AbstractPartial.compareTo(AbstractPartial.java:77)
	at org.joda.time.base.AbstractPartial.isAfter(AbstractPartial.java:84)
	at org.joda.time.TestTimeOfDay_Basics.testIsAfter_TOD(TestTimeOfDay_Basics.java:327)

testCompareTo(org.joda.time.TestYearMonthDay_Basics)  Time elapsed: 0 sec  <<< ERROR!
java.lang.ArrayIndexOutOfBoundsException: -1
	at org.joda.time.YearMonthDay.getFieldType(YearMonthDay.java:351)
	at org.joda.time.base.AbstractPartial.compareTo(AbstractPartial.java:77)
	at org.joda.time.TestYearMonthDay_Basics.testCompareTo(TestYearMonthDay_Basics.java:222)

testIsEqual_YMD(org.joda.time.TestYearMonthDay_Basics)  Time elapsed: 0 sec  <<< ERROR!
java.lang.ArrayIndexOutOfBoundsException: -1
	at org.joda.time.YearMonthDay.getFieldType(YearMonthDay.java:351)
	at org.joda.time.base.AbstractPartial.compareTo(AbstractPartial.java:77)
	at org.joda.time.base.AbstractPartial.isEqual(AbstractPartial.java:88)
	at org.joda.time.TestYearMonthDay_Basics.testIsEqual_YMD(TestYearMonthDay_Basics.java:270)

testIsBefore_YMD(org.joda.time.TestYearMonthDay_Basics)  Time elapsed: 0.001 sec  <<< ERROR!
java.lang.ArrayIndexOutOfBoundsException: -1
	at org.joda.time.YearMonthDay.getFieldType(YearMonthDay.java:351)
	at org.joda.time.base.AbstractPartial.compareTo(AbstractPartial.java:77)
	at org.joda.time.base.AbstractPartial.isBefore(AbstractPartial.java:86)
	at org.joda.time.TestYearMonthDay_Basics.testIsBefore_YMD(TestYearMonthDay_Basics.java:294)

testIsAfter_YMD(org.joda.time.TestYearMonthDay_Basics)  Time elapsed: 0 sec  <<< ERROR!
java.lang.ArrayIndexOutOfBoundsException: -1
	at org.joda.time.YearMonthDay.getFieldType(YearMonthDay.java:351)
	at org.joda.time.base.AbstractPartial.compareTo(AbstractPartial.java:77)
	at org.joda.time.base.AbstractPartial.isAfter(AbstractPartial.java:84)
	at org.joda.time.TestYearMonthDay_Basics.testIsAfter_YMD(TestYearMonthDay_Basics.java:318)

testCompareTo(org.joda.time.TestYearMonth_Basics)  Time elapsed: 0 sec  <<< ERROR!
java.lang.ArrayIndexOutOfBoundsException: -1
	at org.joda.time.YearMonth.getFieldType(YearMonth.java:418)
	at org.joda.time.base.AbstractPartial.compareTo(AbstractPartial.java:77)
	at org.joda.time.TestYearMonth_Basics.testCompareTo(TestYearMonth_Basics.java:221)

testIsEqual_YM(org.joda.time.TestYearMonth_Basics)  Time elapsed: 0.001 sec  <<< ERROR!
java.lang.ArrayIndexOutOfBoundsException: -1
	at org.joda.time.YearMonth.getFieldType(YearMonth.java:418)
	at org.joda.time.base.AbstractPartial.compareTo(AbstractPartial.java:77)
	at org.joda.time.base.AbstractPartial.isEqual(AbstractPartial.java:88)
	at org.joda.time.TestYearMonth_Basics.testIsEqual_YM(TestYearMonth_Basics.java:264)

testIsBefore_YM(org.joda.time.TestYearMonth_Basics)  Time elapsed: 0 sec  <<< ERROR!
java.lang.ArrayIndexOutOfBoundsException: -1
	at org.joda.time.YearMonth.getFieldType(YearMonth.java:418)
	at org.joda.time.base.AbstractPartial.compareTo(AbstractPartial.java:77)
	at org.joda.time.base.AbstractPartial.isBefore(AbstractPartial.java:86)
	at org.joda.time.TestYearMonth_Basics.testIsBefore_YM(TestYearMonth_Basics.java:288)

testIsAfter_YM(org.joda.time.TestYearMonth_Basics)  Time elapsed: 0.001 sec  <<< ERROR!
java.lang.ArrayIndexOutOfBoundsException: -1
	at org.joda.time.YearMonth.getFieldType(YearMonth.java:418)
	at org.joda.time.base.AbstractPartial.compareTo(AbstractPartial.java:77)
	at org.joda.time.base.AbstractPartial.isAfter(AbstractPartial.java:84)
	at org.joda.time.TestYearMonth_Basics.testIsAfter_YM(TestYearMonth_Basics.java:312)

testCompareTo(org.joda.time.TestMonthDay_Basics)  Time elapsed: 0.001 sec  <<< ERROR!
java.lang.ArrayIndexOutOfBoundsException: -1
	at org.joda.time.MonthDay.getFieldType(MonthDay.java:426)
	at org.joda.time.base.AbstractPartial.compareTo(AbstractPartial.java:77)
	at org.joda.time.TestMonthDay_Basics.testCompareTo(TestMonthDay_Basics.java:226)

testIsEqual_MD(org.joda.time.TestMonthDay_Basics)  Time elapsed: 0.001 sec  <<< ERROR!
java.lang.ArrayIndexOutOfBoundsException: -1
	at org.joda.time.MonthDay.getFieldType(MonthDay.java:426)
	at org.joda.time.base.AbstractPartial.compareTo(AbstractPartial.java:77)
	at org.joda.time.base.AbstractPartial.isEqual(AbstractPartial.java:88)
	at org.joda.time.TestMonthDay_Basics.testIsEqual_MD(TestMonthDay_Basics.java:269)

testIsBefore_MD(org.joda.time.TestMonthDay_Basics)  Time elapsed: 0 sec  <<< ERROR!
java.lang.ArrayIndexOutOfBoundsException: -1
	at org.joda.time.MonthDay.getFieldType(MonthDay.java:426)
	at org.joda.time.base.AbstractPartial.compareTo(AbstractPartial.java:77)
	at org.joda.time.base.AbstractPartial.isBefore(AbstractPartial.java:86)
	at org.joda.time.TestMonthDay_Basics.testIsBefore_MD(TestMonthDay_Basics.java:293)

testIsAfter_MD(org.joda.time.TestMonthDay_Basics)  Time elapsed: 0.001 sec  <<< ERROR!
java.lang.ArrayIndexOutOfBoundsException: -1
	at org.joda.time.MonthDay.getFieldType(MonthDay.java:426)
	at org.joda.time.base.AbstractPartial.compareTo(AbstractPartial.java:77)
	at org.joda.time.base.AbstractPartial.isAfter(AbstractPartial.java:84)
	at org.joda.time.TestMonthDay_Basics.testIsAfter_MD(TestMonthDay_Basics.java:317)

testCompareTo(org.joda.time.TestPartial_Basics)  Time elapsed: 0 sec  <<< ERROR!
java.lang.ArrayIndexOutOfBoundsException: -1
	at org.joda.time.Partial.getFieldType(Partial.java:369)
	at org.joda.time.base.AbstractPartial.compareTo(AbstractPartial.java:77)
	at org.joda.time.TestPartial_Basics.testCompareTo(TestPartial_Basics.java:212)

testIsEqual_TOD(org.joda.time.TestPartial_Basics)  Time elapsed: 0.001 sec  <<< ERROR!
java.lang.ArrayIndexOutOfBoundsException: -1
	at org.joda.time.Partial.getFieldType(Partial.java:369)
	at org.joda.time.base.AbstractPartial.compareTo(AbstractPartial.java:77)
	at org.joda.time.base.AbstractPartial.isEqual(AbstractPartial.java:88)
	at org.joda.time.TestPartial_Basics.testIsEqual_TOD(TestPartial_Basics.java:250)

testIsBefore_TOD(org.joda.time.TestPartial_Basics)  Time elapsed: 0 sec  <<< ERROR!
java.lang.ArrayIndexOutOfBoundsException: -1
	at org.joda.time.Partial.getFieldType(Partial.java:369)
	at org.joda.time.base.AbstractPartial.compareTo(AbstractPartial.java:77)
	at org.joda.time.base.AbstractPartial.isBefore(AbstractPartial.java:86)
	at org.joda.time.TestPartial_Basics.testIsBefore_TOD(TestPartial_Basics.java:274)

testIsAfter_TOD(org.joda.time.TestPartial_Basics)  Time elapsed: 0.001 sec  <<< ERROR!
java.lang.ArrayIndexOutOfBoundsException: -1
	at org.joda.time.Partial.getFieldType(Partial.java:369)
	at org.joda.time.base.AbstractPartial.compareTo(AbstractPartial.java:77)
	at org.joda.time.base.AbstractPartial.isAfter(AbstractPartial.java:84)
	at org.joda.time.TestPartial_Basics.testIsAfter_TOD(TestPartial_Basics.java:298)


Results :

Tests in error: 
  org.joda.time.TestLocalDateTime_Basics#testCompareTo IndexOutOfBoundsException
  org.joda.time.TestLocalDateTime_Basics#testIsAfter_LocalDateTime IndexOutOfBoundsException
  org.joda.time.TestLocalDateTime_Basics#testIsBefore_LocalDateTime IndexOutOfBoundsException
  org.joda.time.TestLocalDateTime_Basics#testIsEqual_LocalDateTime IndexOutOfBoundsException
  org.joda.time.TestLocalDateTime_Basics#testToDate_summer IndexOutOfBoundsException
  org.joda.time.TestLocalDateTime_Basics#testToDate_summer_Zone IndexOutOfBoundsException
  org.joda.time.TestLocalDateTime_Basics#testToDate_winter IndexOutOfBoundsException
  org.joda.time.TestLocalDateTime_Basics#testToDate_winter_Zone IndexOutOfBoundsException
  org.joda.time.TestLocalDate_Basics#testCompareTo IndexOutOfBoundsException Inv...
  org.joda.time.TestLocalDate_Basics#testIsAfter_LocalDate IndexOutOfBoundsException
  org.joda.time.TestLocalDate_Basics#testIsBefore_LocalDate IndexOutOfBoundsException
  org.joda.time.TestLocalDate_Basics#testIsEqual_LocalDate IndexOutOfBoundsException
  org.joda.time.TestLocalDate_Basics#testToDate_summer IndexOutOfBoundsException
  org.joda.time.TestLocalDate_Basics#testToDate_winter IndexOutOfBoundsException
  org.joda.time.TestLocalTime_Basics#testCompareTo IndexOutOfBoundsException Inv...
  org.joda.time.TestLocalTime_Basics#testIsAfter_LocalTime IndexOutOfBoundsException
  org.joda.time.TestLocalTime_Basics#testIsBefore_LocalTime IndexOutOfBoundsException
  org.joda.time.TestLocalTime_Basics#testIsEqual_LocalTime IndexOutOfBoundsException
  org.joda.time.TestMonthDay_Basics#testCompareTo ArrayIndexOutOfBoundsException
  org.joda.time.TestMonthDay_Basics#testIsAfter_MD ArrayIndexOutOfBoundsException
  org.joda.time.TestMonthDay_Basics#testIsBefore_MD ArrayIndexOutOfBoundsException
  org.joda.time.TestMonthDay_Basics#testIsEqual_MD ArrayIndexOutOfBoundsException
  org.joda.time.TestPartial_Basics#testCompareTo ArrayIndexOutOfBoundsException ...
  org.joda.time.TestPartial_Basics#testIsAfter_TOD ArrayIndexOutOfBoundsException
  org.joda.time.TestPartial_Basics#testIsBefore_TOD ArrayIndexOutOfBoundsException
  org.joda.time.TestPartial_Basics#testIsEqual_TOD ArrayIndexOutOfBoundsException
  org.joda.time.TestTimeOfDay_Basics#testCompareTo ArrayIndexOutOfBoundsException
  org.joda.time.TestTimeOfDay_Basics#testIsAfter_TOD ArrayIndexOutOfBoundsException
  org.joda.time.TestTimeOfDay_Basics#testIsBefore_TOD ArrayIndexOutOfBoundsException
  org.joda.time.TestTimeOfDay_Basics#testIsEqual_TOD ArrayIndexOutOfBoundsException
  org.joda.time.TestYearMonthDay_Basics#testCompareTo ArrayIndexOutOfBoundsException
  org.joda.time.TestYearMonthDay_Basics#testIsAfter_YMD ArrayIndexOutOfBoundsException
  org.joda.time.TestYearMonthDay_Basics#testIsBefore_YMD ArrayIndexOutOfBoundsException
  org.joda.time.TestYearMonthDay_Basics#testIsEqual_YMD ArrayIndexOutOfBoundsException
  org.joda.time.TestYearMonth_Basics#testCompareTo ArrayIndexOutOfBoundsException
  org.joda.time.TestYearMonth_Basics#testIsAfter_YM ArrayIndexOutOfBoundsException
  org.joda.time.TestYearMonth_Basics#testIsBefore_YM ArrayIndexOutOfBoundsException
  org.joda.time.TestYearMonth_Basics#testIsEqual_YM ArrayIndexOutOfBoundsException

Tests run: 4157, Failures: 0, Errors: 38, Skipped: 0

[INFO] ------------------------------------------------------------------------
[INFO] BUILD FAILURE
[INFO] ------------------------------------------------------------------------
[INFO] Total time: 15.498s
[INFO] Finished at: Wed Aug 05 20:40:09 BST 2015
[INFO] Final Memory: 9M/213M
[INFO] ------------------------------------------------------------------------
[ERROR] Failed to execute goal org.apache.maven.plugins:maven-surefire-plugin:2.18.1:test (default-test) on project joda-time: There are test failures.
[ERROR] 
[ERROR] Please refer to /home/perham/Study/LittleDarwin/Cases/joda-time-2.8.1/target/surefire-reports for the individual test results.
[ERROR] -> [Help 1]
[ERROR] 
[ERROR] To see the full stack trace of the errors, re-run Maven with the -e switch.
[ERROR] Re-run Maven using the -X switch to enable full debug logging.
[ERROR] 
[ERROR] For more information about the errors and possible solutions, please read the following articles:
[ERROR] [Help 1] http://cwiki.apache.org/confluence/display/MAVEN/MojoFailureException
