[INFO] Scanning for projects...
[INFO]                                                                         
[INFO] ------------------------------------------------------------------------
[INFO] Building Joda-Time 2.8.1
[INFO] ------------------------------------------------------------------------
[INFO] 
[INFO] --- maven-resources-plugin:2.7:resources (default-resources) @ joda-time ---
[INFO] Using 'UTF-8' encoding to copy filtered resources.
[INFO] Copying 2 resources to META-INF
[INFO] Copying 10 resources
[INFO] 
[INFO] --- maven-compiler-plugin:3.3:compile (default-compile) @ joda-time ---
[INFO] Changes detected - recompiling the module!
[INFO] Compiling 166 source files to /home/perham/Study/LittleDarwin/Cases/joda-time-2.8.1/target/classes
[INFO] 
[INFO] --- exec-maven-plugin:1.4.0:java (compile-tzdb) @ joda-time ---
Writing zoneinfo files
Writing ZoneInfoMap
[INFO] 
[INFO] --- maven-resources-plugin:2.7:testResources (default-testResources) @ joda-time ---
[INFO] Using 'UTF-8' encoding to copy filtered resources.
[INFO] Copying 34 resources
[INFO] 
[INFO] --- maven-compiler-plugin:3.3:testCompile (default-testCompile) @ joda-time ---
[INFO] Nothing to compile - all classes are up to date
[INFO] 
[INFO] --- maven-surefire-plugin:2.18.1:test (default-test) @ joda-time ---
[INFO] Surefire report directory: /home/perham/Study/LittleDarwin/Cases/joda-time-2.8.1/target/surefire-reports

-------------------------------------------------------
 T E S T S
-------------------------------------------------------
Running org.joda.time.TestAllPackages

TestBuddhistChronology.testCalendar

TestCopticChronology.testCalendar

TestEthiopicChronology.testCalendar

TestIslamicChronology.testCalendar

Testing Gregorian chronology over 1000 iterations
100% complete (i=1000)

Testing Julian chronology over 1000 iterations
100% complete (i=1000)
Writing zoneinfo files
Writing ZoneInfoMap
Tests run: 4157, Failures: 6, Errors: 95, Skipped: 0, Time elapsed: 5.31 sec <<< FAILURE! - in org.joda.time.TestAllPackages
testWithFieldAdded1(org.joda.time.TestTimeOfDay_Basics)  Time elapsed: 0.004 sec  <<< ERROR!
java.lang.IllegalArgumentException: Field 'hours' is not supported
	at org.joda.time.base.AbstractPartial.indexOfSupported(AbstractPartial.java:52)
	at org.joda.time.TimeOfDay.withFieldAdded(TimeOfDay.java:553)
	at org.joda.time.TestTimeOfDay_Basics.testWithFieldAdded1(TestTimeOfDay_Basics.java:406)

testWithFieldAdded2(org.joda.time.TestTimeOfDay_Basics)  Time elapsed: 0 sec  <<< FAILURE!
junit.framework.AssertionFailedError
	at junit.framework.Assert.fail(Assert.java:47)
	at junit.framework.Assert.fail(Assert.java:53)
	at org.joda.time.TestTimeOfDay_Basics.testWithFieldAdded2(TestTimeOfDay_Basics.java:416)

testWithFieldAdded3(org.joda.time.TestTimeOfDay_Basics)  Time elapsed: 0.001 sec  <<< ERROR!
java.lang.IndexOutOfBoundsException: Invalid index: -1
	at org.joda.time.TimeOfDay.getField(TimeOfDay.java:452)
	at org.joda.time.base.AbstractPartial.getField(AbstractPartial.java:27)
	at org.joda.time.TimeOfDay.withFieldAdded(TimeOfDay.java:558)
	at org.joda.time.TestTimeOfDay_Basics.testWithFieldAdded3(TestTimeOfDay_Basics.java:423)

testWithFieldAdded4(org.joda.time.TestTimeOfDay_Basics)  Time elapsed: 0.001 sec  <<< ERROR!
java.lang.IllegalArgumentException: Field 'hours' is not supported
	at org.joda.time.base.AbstractPartial.indexOfSupported(AbstractPartial.java:52)
	at org.joda.time.TimeOfDay.withFieldAdded(TimeOfDay.java:553)
	at org.joda.time.TestTimeOfDay_Basics.testWithFieldAdded4(TestTimeOfDay_Basics.java:430)

testPlusHours_int(org.joda.time.TestTimeOfDay_Basics)  Time elapsed: 0.001 sec  <<< ERROR!
java.lang.IllegalArgumentException: Field 'hours' is not supported
	at org.joda.time.base.AbstractPartial.indexOfSupported(AbstractPartial.java:52)
	at org.joda.time.TimeOfDay.withFieldAdded(TimeOfDay.java:553)
	at org.joda.time.TimeOfDay.plusHours(TimeOfDay.java:632)
	at org.joda.time.TestTimeOfDay_Basics.testPlusHours_int(TestTimeOfDay_Basics.java:499)

testPlusMinutes_int(org.joda.time.TestTimeOfDay_Basics)  Time elapsed: 0.001 sec  <<< ERROR!
java.lang.IllegalArgumentException: Field 'minutes' is not supported
	at org.joda.time.base.AbstractPartial.indexOfSupported(AbstractPartial.java:52)
	at org.joda.time.TimeOfDay.withFieldAdded(TimeOfDay.java:553)
	at org.joda.time.TimeOfDay.plusMinutes(TimeOfDay.java:652)
	at org.joda.time.TestTimeOfDay_Basics.testPlusMinutes_int(TestTimeOfDay_Basics.java:509)

testPlusSeconds_int(org.joda.time.TestTimeOfDay_Basics)  Time elapsed: 0.001 sec  <<< ERROR!
java.lang.IllegalArgumentException: Field 'seconds' is not supported
	at org.joda.time.base.AbstractPartial.indexOfSupported(AbstractPartial.java:52)
	at org.joda.time.TimeOfDay.withFieldAdded(TimeOfDay.java:553)
	at org.joda.time.TimeOfDay.plusSeconds(TimeOfDay.java:672)
	at org.joda.time.TestTimeOfDay_Basics.testPlusSeconds_int(TestTimeOfDay_Basics.java:519)

testPlusMillis_int(org.joda.time.TestTimeOfDay_Basics)  Time elapsed: 0.001 sec  <<< ERROR!
java.lang.IllegalArgumentException: Field 'millis' is not supported
	at org.joda.time.base.AbstractPartial.indexOfSupported(AbstractPartial.java:52)
	at org.joda.time.TimeOfDay.withFieldAdded(TimeOfDay.java:553)
	at org.joda.time.TimeOfDay.plusMillis(TimeOfDay.java:692)
	at org.joda.time.TestTimeOfDay_Basics.testPlusMillis_int(TestTimeOfDay_Basics.java:529)

testMinusHours_int(org.joda.time.TestTimeOfDay_Basics)  Time elapsed: 0.001 sec  <<< ERROR!
java.lang.IllegalArgumentException: Field 'hours' is not supported
	at org.joda.time.base.AbstractPartial.indexOfSupported(AbstractPartial.java:52)
	at org.joda.time.TimeOfDay.withFieldAdded(TimeOfDay.java:553)
	at org.joda.time.TimeOfDay.minusHours(TimeOfDay.java:732)
	at org.joda.time.TestTimeOfDay_Basics.testMinusHours_int(TestTimeOfDay_Basics.java:550)

testMinusMinutes_int(org.joda.time.TestTimeOfDay_Basics)  Time elapsed: 0.001 sec  <<< ERROR!
java.lang.IllegalArgumentException: Field 'minutes' is not supported
	at org.joda.time.base.AbstractPartial.indexOfSupported(AbstractPartial.java:52)
	at org.joda.time.TimeOfDay.withFieldAdded(TimeOfDay.java:553)
	at org.joda.time.TimeOfDay.minusMinutes(TimeOfDay.java:752)
	at org.joda.time.TestTimeOfDay_Basics.testMinusMinutes_int(TestTimeOfDay_Basics.java:560)

testMinusSeconds_int(org.joda.time.TestTimeOfDay_Basics)  Time elapsed: 0.001 sec  <<< ERROR!
java.lang.IllegalArgumentException: Field 'seconds' is not supported
	at org.joda.time.base.AbstractPartial.indexOfSupported(AbstractPartial.java:52)
	at org.joda.time.TimeOfDay.withFieldAdded(TimeOfDay.java:553)
	at org.joda.time.TimeOfDay.minusSeconds(TimeOfDay.java:772)
	at org.joda.time.TestTimeOfDay_Basics.testMinusSeconds_int(TestTimeOfDay_Basics.java:570)

testMinusMillis_int(org.joda.time.TestTimeOfDay_Basics)  Time elapsed: 0 sec  <<< ERROR!
java.lang.IllegalArgumentException: Field 'millis' is not supported
	at org.joda.time.base.AbstractPartial.indexOfSupported(AbstractPartial.java:52)
	at org.joda.time.TimeOfDay.withFieldAdded(TimeOfDay.java:553)
	at org.joda.time.TimeOfDay.minusMillis(TimeOfDay.java:792)
	at org.joda.time.TestTimeOfDay_Basics.testMinusMillis_int(TestTimeOfDay_Basics.java:580)

testWithFieldAdded5(org.joda.time.TestTimeOfDay_Basics)  Time elapsed: 0 sec  <<< ERROR!
java.lang.IndexOutOfBoundsException: Invalid index: -1
	at org.joda.time.TimeOfDay.getField(TimeOfDay.java:452)
	at org.joda.time.base.AbstractPartial.getField(AbstractPartial.java:27)
	at org.joda.time.TimeOfDay.withFieldAdded(TimeOfDay.java:558)
	at org.joda.time.TestTimeOfDay_Basics.testWithFieldAdded5(TestTimeOfDay_Basics.java:437)

testWithFieldAdded6(org.joda.time.TestTimeOfDay_Basics)  Time elapsed: 0.001 sec  <<< ERROR!
java.lang.IllegalArgumentException: Field 'hours' is not supported
	at org.joda.time.base.AbstractPartial.indexOfSupported(AbstractPartial.java:52)
	at org.joda.time.TimeOfDay.withFieldAdded(TimeOfDay.java:553)
	at org.joda.time.TestTimeOfDay_Basics.testWithFieldAdded6(TestTimeOfDay_Basics.java:444)

testWithFieldAdded7(org.joda.time.TestTimeOfDay_Basics)  Time elapsed: 0 sec  <<< ERROR!
java.lang.IllegalArgumentException: Field 'millis' is not supported
	at org.joda.time.base.AbstractPartial.indexOfSupported(AbstractPartial.java:52)
	at org.joda.time.TimeOfDay.withFieldAdded(TimeOfDay.java:553)
	at org.joda.time.TestTimeOfDay_Basics.testWithFieldAdded7(TestTimeOfDay_Basics.java:452)

testWithFieldAdded8(org.joda.time.TestTimeOfDay_Basics)  Time elapsed: 0.001 sec  <<< ERROR!
java.lang.IllegalArgumentException: Field 'millis' is not supported
	at org.joda.time.base.AbstractPartial.indexOfSupported(AbstractPartial.java:52)
	at org.joda.time.TimeOfDay.withFieldAdded(TimeOfDay.java:553)
	at org.joda.time.TestTimeOfDay_Basics.testWithFieldAdded8(TestTimeOfDay_Basics.java:470)

testWithFieldAdded1(org.joda.time.TestYearMonthDay_Basics)  Time elapsed: 0 sec  <<< ERROR!
java.lang.IllegalArgumentException: Field 'years' is not supported
	at org.joda.time.base.AbstractPartial.indexOfSupported(AbstractPartial.java:52)
	at org.joda.time.YearMonthDay.withFieldAdded(YearMonthDay.java:439)
	at org.joda.time.TestYearMonthDay_Basics.testWithFieldAdded1(TestYearMonthDay_Basics.java:408)

testWithFieldAdded2(org.joda.time.TestYearMonthDay_Basics)  Time elapsed: 0.001 sec  <<< FAILURE!
junit.framework.AssertionFailedError
	at junit.framework.Assert.fail(Assert.java:47)
	at junit.framework.Assert.fail(Assert.java:53)
	at org.joda.time.TestYearMonthDay_Basics.testWithFieldAdded2(TestYearMonthDay_Basics.java:418)

testWithFieldAdded3(org.joda.time.TestYearMonthDay_Basics)  Time elapsed: 0 sec  <<< ERROR!
java.lang.IndexOutOfBoundsException: Invalid index: -1
	at org.joda.time.YearMonthDay.getField(YearMonthDay.java:339)
	at org.joda.time.base.AbstractPartial.getField(AbstractPartial.java:27)
	at org.joda.time.YearMonthDay.withFieldAdded(YearMonthDay.java:444)
	at org.joda.time.TestYearMonthDay_Basics.testWithFieldAdded3(TestYearMonthDay_Basics.java:425)

testWithFieldAdded4(org.joda.time.TestYearMonthDay_Basics)  Time elapsed: 0.001 sec  <<< ERROR!
java.lang.IllegalArgumentException: Field 'years' is not supported
	at org.joda.time.base.AbstractPartial.indexOfSupported(AbstractPartial.java:52)
	at org.joda.time.YearMonthDay.withFieldAdded(YearMonthDay.java:439)
	at org.joda.time.TestYearMonthDay_Basics.testWithFieldAdded4(TestYearMonthDay_Basics.java:432)

testPlusYears_int(org.joda.time.TestYearMonthDay_Basics)  Time elapsed: 0 sec  <<< ERROR!
java.lang.IllegalArgumentException: Field 'years' is not supported
	at org.joda.time.base.AbstractPartial.indexOfSupported(AbstractPartial.java:52)
	at org.joda.time.YearMonthDay.withFieldAdded(YearMonthDay.java:439)
	at org.joda.time.YearMonthDay.plusYears(YearMonthDay.java:516)
	at org.joda.time.TestYearMonthDay_Basics.testPlusYears_int(TestYearMonthDay_Basics.java:457)

testPlusMonths_int(org.joda.time.TestYearMonthDay_Basics)  Time elapsed: 0 sec  <<< ERROR!
java.lang.IllegalArgumentException: Field 'months' is not supported
	at org.joda.time.base.AbstractPartial.indexOfSupported(AbstractPartial.java:52)
	at org.joda.time.YearMonthDay.withFieldAdded(YearMonthDay.java:439)
	at org.joda.time.YearMonthDay.plusMonths(YearMonthDay.java:536)
	at org.joda.time.TestYearMonthDay_Basics.testPlusMonths_int(TestYearMonthDay_Basics.java:467)

testPlusDays_int(org.joda.time.TestYearMonthDay_Basics)  Time elapsed: 0 sec  <<< ERROR!
java.lang.IllegalArgumentException: Field 'days' is not supported
	at org.joda.time.base.AbstractPartial.indexOfSupported(AbstractPartial.java:52)
	at org.joda.time.YearMonthDay.withFieldAdded(YearMonthDay.java:439)
	at org.joda.time.YearMonthDay.plusDays(YearMonthDay.java:556)
	at org.joda.time.TestYearMonthDay_Basics.testPlusDays_int(TestYearMonthDay_Basics.java:477)

testMinusYears_int(org.joda.time.TestYearMonthDay_Basics)  Time elapsed: 0 sec  <<< ERROR!
java.lang.IllegalArgumentException: Field 'years' is not supported
	at org.joda.time.base.AbstractPartial.indexOfSupported(AbstractPartial.java:52)
	at org.joda.time.YearMonthDay.withFieldAdded(YearMonthDay.java:439)
	at org.joda.time.YearMonthDay.minusYears(YearMonthDay.java:595)
	at org.joda.time.TestYearMonthDay_Basics.testMinusYears_int(TestYearMonthDay_Basics.java:498)

testMinusMonths_int(org.joda.time.TestYearMonthDay_Basics)  Time elapsed: 0.001 sec  <<< ERROR!
java.lang.IllegalArgumentException: Field 'months' is not supported
	at org.joda.time.base.AbstractPartial.indexOfSupported(AbstractPartial.java:52)
	at org.joda.time.YearMonthDay.withFieldAdded(YearMonthDay.java:439)
	at org.joda.time.YearMonthDay.minusMonths(YearMonthDay.java:615)
	at org.joda.time.TestYearMonthDay_Basics.testMinusMonths_int(TestYearMonthDay_Basics.java:508)

testMinusDays_int(org.joda.time.TestYearMonthDay_Basics)  Time elapsed: 0 sec  <<< ERROR!
java.lang.IllegalArgumentException: Field 'days' is not supported
	at org.joda.time.base.AbstractPartial.indexOfSupported(AbstractPartial.java:52)
	at org.joda.time.YearMonthDay.withFieldAdded(YearMonthDay.java:439)
	at org.joda.time.YearMonthDay.minusDays(YearMonthDay.java:635)
	at org.joda.time.TestYearMonthDay_Basics.testMinusDays_int(TestYearMonthDay_Basics.java:518)

testWithFieldAdded5(org.joda.time.TestYearMonthDay_Basics)  Time elapsed: 0.001 sec  <<< ERROR!
java.lang.IndexOutOfBoundsException: Invalid index: -1
	at org.joda.time.YearMonthDay.getField(YearMonthDay.java:339)
	at org.joda.time.base.AbstractPartial.getField(AbstractPartial.java:27)
	at org.joda.time.YearMonthDay.withFieldAdded(YearMonthDay.java:444)
	at org.joda.time.TestYearMonthDay_Basics.testWithFieldAdded5(TestYearMonthDay_Basics.java:439)

testPlusYears_int(org.joda.time.TestYearMonth_Basics)  Time elapsed: 0 sec  <<< ERROR!
java.lang.IllegalArgumentException: Field 'years' is not supported
	at org.joda.time.base.AbstractPartial.indexOfSupported(AbstractPartial.java:52)
	at org.joda.time.YearMonth.withFieldAdded(YearMonth.java:506)
	at org.joda.time.YearMonth.plusYears(YearMonth.java:582)
	at org.joda.time.TestYearMonth_Basics.testPlusYears_int(TestYearMonth_Basics.java:451)

testPlusMonths_int(org.joda.time.TestYearMonth_Basics)  Time elapsed: 0.001 sec  <<< ERROR!
java.lang.IllegalArgumentException: Field 'months' is not supported
	at org.joda.time.base.AbstractPartial.indexOfSupported(AbstractPartial.java:52)
	at org.joda.time.YearMonth.withFieldAdded(YearMonth.java:506)
	at org.joda.time.YearMonth.plusMonths(YearMonth.java:601)
	at org.joda.time.TestYearMonth_Basics.testPlusMonths_int(TestYearMonth_Basics.java:461)

testMinusYears_int(org.joda.time.TestYearMonth_Basics)  Time elapsed: 0.001 sec  <<< ERROR!
java.lang.IllegalArgumentException: Field 'years' is not supported
	at org.joda.time.base.AbstractPartial.indexOfSupported(AbstractPartial.java:52)
	at org.joda.time.YearMonth.withFieldAdded(YearMonth.java:506)
	at org.joda.time.YearMonth.minusYears(YearMonth.java:639)
	at org.joda.time.TestYearMonth_Basics.testMinusYears_int(TestYearMonth_Basics.java:482)

testMinusMonths_int(org.joda.time.TestYearMonth_Basics)  Time elapsed: 0 sec  <<< ERROR!
java.lang.IllegalArgumentException: Field 'months' is not supported
	at org.joda.time.base.AbstractPartial.indexOfSupported(AbstractPartial.java:52)
	at org.joda.time.YearMonth.withFieldAdded(YearMonth.java:506)
	at org.joda.time.YearMonth.minusMonths(YearMonth.java:658)
	at org.joda.time.TestYearMonth_Basics.testMinusMonths_int(TestYearMonth_Basics.java:492)

testToInterval(org.joda.time.TestYearMonth_Basics)  Time elapsed: 0 sec  <<< ERROR!
java.lang.IllegalArgumentException: Field 'months' is not supported
	at org.joda.time.base.AbstractPartial.indexOfSupported(AbstractPartial.java:52)
	at org.joda.time.YearMonth.withFieldAdded(YearMonth.java:506)
	at org.joda.time.YearMonth.plusMonths(YearMonth.java:601)
	at org.joda.time.YearMonth.toInterval(YearMonth.java:699)
	at org.joda.time.YearMonth.toInterval(YearMonth.java:683)
	at org.joda.time.TestYearMonth_Basics.testToInterval(TestYearMonth_Basics.java:540)

testToInterval_Zone(org.joda.time.TestYearMonth_Basics)  Time elapsed: 0.001 sec  <<< ERROR!
java.lang.IllegalArgumentException: Field 'months' is not supported
	at org.joda.time.base.AbstractPartial.indexOfSupported(AbstractPartial.java:52)
	at org.joda.time.YearMonth.withFieldAdded(YearMonth.java:506)
	at org.joda.time.YearMonth.plusMonths(YearMonth.java:601)
	at org.joda.time.YearMonth.toInterval(YearMonth.java:699)
	at org.joda.time.TestYearMonth_Basics.testToInterval_Zone(TestYearMonth_Basics.java:551)

testToInterval_nullZone(org.joda.time.TestYearMonth_Basics)  Time elapsed: 0 sec  <<< ERROR!
java.lang.IllegalArgumentException: Field 'months' is not supported
	at org.joda.time.base.AbstractPartial.indexOfSupported(AbstractPartial.java:52)
	at org.joda.time.YearMonth.withFieldAdded(YearMonth.java:506)
	at org.joda.time.YearMonth.plusMonths(YearMonth.java:601)
	at org.joda.time.YearMonth.toInterval(YearMonth.java:699)
	at org.joda.time.TestYearMonth_Basics.testToInterval_nullZone(TestYearMonth_Basics.java:561)

testWithFieldAdded(org.joda.time.TestYearMonth_Basics)  Time elapsed: 0 sec  <<< ERROR!
java.lang.IllegalArgumentException: Field 'years' is not supported
	at org.joda.time.base.AbstractPartial.indexOfSupported(AbstractPartial.java:52)
	at org.joda.time.YearMonth.withFieldAdded(YearMonth.java:506)
	at org.joda.time.TestYearMonth_Basics.testWithFieldAdded(TestYearMonth_Basics.java:402)

testWithFieldAdded_nullField_zero(org.joda.time.TestYearMonth_Basics)  Time elapsed: 0.001 sec  <<< FAILURE!
junit.framework.AssertionFailedError
	at junit.framework.Assert.fail(Assert.java:47)
	at junit.framework.Assert.fail(Assert.java:53)
	at org.joda.time.TestYearMonth_Basics.testWithFieldAdded_nullField_zero(TestYearMonth_Basics.java:412)

testWithFieldAdded_nullField_nonZero(org.joda.time.TestYearMonth_Basics)  Time elapsed: 0 sec  <<< ERROR!
java.lang.IndexOutOfBoundsException: Invalid index: -1
	at org.joda.time.YearMonth.getField(YearMonth.java:406)
	at org.joda.time.base.AbstractPartial.getField(AbstractPartial.java:27)
	at org.joda.time.YearMonth.withFieldAdded(YearMonth.java:511)
	at org.joda.time.TestYearMonth_Basics.testWithFieldAdded_nullField_nonZero(TestYearMonth_Basics.java:419)

testWithFieldAdded_zero(org.joda.time.TestYearMonth_Basics)  Time elapsed: 0.001 sec  <<< ERROR!
java.lang.IllegalArgumentException: Field 'years' is not supported
	at org.joda.time.base.AbstractPartial.indexOfSupported(AbstractPartial.java:52)
	at org.joda.time.YearMonth.withFieldAdded(YearMonth.java:506)
	at org.joda.time.TestYearMonth_Basics.testWithFieldAdded_zero(TestYearMonth_Basics.java:426)

testWithFieldAdded_unknownField(org.joda.time.TestYearMonth_Basics)  Time elapsed: 0 sec  <<< ERROR!
java.lang.IndexOutOfBoundsException: Invalid index: -1
	at org.joda.time.YearMonth.getField(YearMonth.java:406)
	at org.joda.time.base.AbstractPartial.getField(AbstractPartial.java:27)
	at org.joda.time.YearMonth.withFieldAdded(YearMonth.java:511)
	at org.joda.time.TestYearMonth_Basics.testWithFieldAdded_unknownField(TestYearMonth_Basics.java:433)

testPlusMonths_int(org.joda.time.TestMonthDay_Basics)  Time elapsed: 0 sec  <<< ERROR!
java.lang.IllegalArgumentException: Field 'months' is not supported
	at org.joda.time.base.AbstractPartial.indexOfSupported(AbstractPartial.java:52)
	at org.joda.time.MonthDay.withFieldAdded(MonthDay.java:514)
	at org.joda.time.MonthDay.plusMonths(MonthDay.java:592)
	at org.joda.time.TestMonthDay_Basics.testPlusMonths_int(TestMonthDay_Basics.java:446)

testPlusDays_int(org.joda.time.TestMonthDay_Basics)  Time elapsed: 0.001 sec  <<< ERROR!
java.lang.IllegalArgumentException: Field 'days' is not supported
	at org.joda.time.base.AbstractPartial.indexOfSupported(AbstractPartial.java:52)
	at org.joda.time.MonthDay.withFieldAdded(MonthDay.java:514)
	at org.joda.time.MonthDay.plusDays(MonthDay.java:615)
	at org.joda.time.TestMonthDay_Basics.testPlusDays_int(TestMonthDay_Basics.java:502)

testMinusMonths_int(org.joda.time.TestMonthDay_Basics)  Time elapsed: 0 sec  <<< ERROR!
java.lang.IllegalArgumentException: Field 'months' is not supported
	at org.joda.time.base.AbstractPartial.indexOfSupported(AbstractPartial.java:52)
	at org.joda.time.MonthDay.withFieldAdded(MonthDay.java:514)
	at org.joda.time.MonthDay.minusMonths(MonthDay.java:655)
	at org.joda.time.TestMonthDay_Basics.testMinusMonths_int(TestMonthDay_Basics.java:582)

testMinusDays_int(org.joda.time.TestMonthDay_Basics)  Time elapsed: 0.001 sec  <<< ERROR!
java.lang.IllegalArgumentException: Field 'days' is not supported
	at org.joda.time.base.AbstractPartial.indexOfSupported(AbstractPartial.java:52)
	at org.joda.time.MonthDay.withFieldAdded(MonthDay.java:514)
	at org.joda.time.MonthDay.minusDays(MonthDay.java:675)
	at org.joda.time.TestMonthDay_Basics.testMinusDays_int(TestMonthDay_Basics.java:638)

testWithFieldAdded(org.joda.time.TestMonthDay_Basics)  Time elapsed: 0 sec  <<< ERROR!
java.lang.IllegalArgumentException: Field 'months' is not supported
	at org.joda.time.base.AbstractPartial.indexOfSupported(AbstractPartial.java:52)
	at org.joda.time.MonthDay.withFieldAdded(MonthDay.java:514)
	at org.joda.time.TestMonthDay_Basics.testWithFieldAdded(TestMonthDay_Basics.java:397)

testWithFieldAdded_nullField_zero(org.joda.time.TestMonthDay_Basics)  Time elapsed: 0.001 sec  <<< FAILURE!
junit.framework.AssertionFailedError
	at junit.framework.Assert.fail(Assert.java:47)
	at junit.framework.Assert.fail(Assert.java:53)
	at org.joda.time.TestMonthDay_Basics.testWithFieldAdded_nullField_zero(TestMonthDay_Basics.java:407)

testWithFieldAdded_nullField_nonZero(org.joda.time.TestMonthDay_Basics)  Time elapsed: 0 sec  <<< ERROR!
java.lang.IndexOutOfBoundsException: Invalid index: -1
	at org.joda.time.MonthDay.getField(MonthDay.java:414)
	at org.joda.time.base.AbstractPartial.getField(AbstractPartial.java:27)
	at org.joda.time.MonthDay.withFieldAdded(MonthDay.java:519)
	at org.joda.time.TestMonthDay_Basics.testWithFieldAdded_nullField_nonZero(TestMonthDay_Basics.java:414)

testWithFieldAdded_zero(org.joda.time.TestMonthDay_Basics)  Time elapsed: 0.001 sec  <<< ERROR!
java.lang.IllegalArgumentException: Field 'months' is not supported
	at org.joda.time.base.AbstractPartial.indexOfSupported(AbstractPartial.java:52)
	at org.joda.time.MonthDay.withFieldAdded(MonthDay.java:514)
	at org.joda.time.TestMonthDay_Basics.testWithFieldAdded_zero(TestMonthDay_Basics.java:421)

testWithFieldAdded_unknownField(org.joda.time.TestMonthDay_Basics)  Time elapsed: 0 sec  <<< ERROR!
java.lang.IndexOutOfBoundsException: Invalid index: -1
	at org.joda.time.MonthDay.getField(MonthDay.java:414)
	at org.joda.time.base.AbstractPartial.getField(AbstractPartial.java:27)
	at org.joda.time.MonthDay.withFieldAdded(MonthDay.java:519)
	at org.joda.time.TestMonthDay_Basics.testWithFieldAdded_unknownField(TestMonthDay_Basics.java:428)

testPlusMonths_int_fromLeap(org.joda.time.TestMonthDay_Basics)  Time elapsed: 0 sec  <<< ERROR!
java.lang.IllegalArgumentException: Field 'months' is not supported
	at org.joda.time.base.AbstractPartial.indexOfSupported(AbstractPartial.java:52)
	at org.joda.time.MonthDay.withFieldAdded(MonthDay.java:514)
	at org.joda.time.MonthDay.plusMonths(MonthDay.java:592)
	at org.joda.time.TestMonthDay_Basics.testPlusMonths_int_fromLeap(TestMonthDay_Basics.java:453)

testPlusMonths_int_negativeFromLeap(org.joda.time.TestMonthDay_Basics)  Time elapsed: 0.001 sec  <<< ERROR!
java.lang.IllegalArgumentException: Field 'months' is not supported
	at org.joda.time.base.AbstractPartial.indexOfSupported(AbstractPartial.java:52)
	at org.joda.time.MonthDay.withFieldAdded(MonthDay.java:514)
	at org.joda.time.MonthDay.plusMonths(MonthDay.java:592)
	at org.joda.time.TestMonthDay_Basics.testPlusMonths_int_negativeFromLeap(TestMonthDay_Basics.java:460)

testPlusMonths_int_endOfMonthAdjust(org.joda.time.TestMonthDay_Basics)  Time elapsed: 0 sec  <<< ERROR!
java.lang.IllegalArgumentException: Field 'months' is not supported
	at org.joda.time.base.AbstractPartial.indexOfSupported(AbstractPartial.java:52)
	at org.joda.time.MonthDay.withFieldAdded(MonthDay.java:514)
	at org.joda.time.MonthDay.plusMonths(MonthDay.java:592)
	at org.joda.time.TestMonthDay_Basics.testPlusMonths_int_endOfMonthAdjust(TestMonthDay_Basics.java:467)

testPlusMonths_int_negativeEndOfMonthAdjust(org.joda.time.TestMonthDay_Basics)  Time elapsed: 0.001 sec  <<< ERROR!
java.lang.IllegalArgumentException: Field 'months' is not supported
	at org.joda.time.base.AbstractPartial.indexOfSupported(AbstractPartial.java:52)
	at org.joda.time.MonthDay.withFieldAdded(MonthDay.java:514)
	at org.joda.time.MonthDay.plusMonths(MonthDay.java:592)
	at org.joda.time.TestMonthDay_Basics.testPlusMonths_int_negativeEndOfMonthAdjust(TestMonthDay_Basics.java:474)

testPlusMonths_int_same(org.joda.time.TestMonthDay_Basics)  Time elapsed: 0 sec  <<< ERROR!
java.lang.IllegalArgumentException: Field 'months' is not supported
	at org.joda.time.base.AbstractPartial.indexOfSupported(AbstractPartial.java:52)
	at org.joda.time.MonthDay.withFieldAdded(MonthDay.java:514)
	at org.joda.time.MonthDay.plusMonths(MonthDay.java:592)
	at org.joda.time.TestMonthDay_Basics.testPlusMonths_int_same(TestMonthDay_Basics.java:481)

testPlusMonths_int_wrap(org.joda.time.TestMonthDay_Basics)  Time elapsed: 0.001 sec  <<< ERROR!
java.lang.IllegalArgumentException: Field 'months' is not supported
	at org.joda.time.base.AbstractPartial.indexOfSupported(AbstractPartial.java:52)
	at org.joda.time.MonthDay.withFieldAdded(MonthDay.java:514)
	at org.joda.time.MonthDay.plusMonths(MonthDay.java:592)
	at org.joda.time.TestMonthDay_Basics.testPlusMonths_int_wrap(TestMonthDay_Basics.java:487)

testPlusMonths_int_adjust(org.joda.time.TestMonthDay_Basics)  Time elapsed: 0 sec  <<< ERROR!
java.lang.IllegalArgumentException: Field 'months' is not supported
	at org.joda.time.base.AbstractPartial.indexOfSupported(AbstractPartial.java:52)
	at org.joda.time.MonthDay.withFieldAdded(MonthDay.java:514)
	at org.joda.time.MonthDay.plusMonths(MonthDay.java:592)
	at org.joda.time.TestMonthDay_Basics.testPlusMonths_int_adjust(TestMonthDay_Basics.java:494)

testPlusDays_int_wrapMonth(org.joda.time.TestMonthDay_Basics)  Time elapsed: 0.001 sec  <<< ERROR!
java.lang.IllegalArgumentException: Field 'days' is not supported
	at org.joda.time.base.AbstractPartial.indexOfSupported(AbstractPartial.java:52)
	at org.joda.time.MonthDay.withFieldAdded(MonthDay.java:514)
	at org.joda.time.MonthDay.plusDays(MonthDay.java:615)
	at org.joda.time.TestMonthDay_Basics.testPlusDays_int_wrapMonth(TestMonthDay_Basics.java:509)

testPlusDays_int_wrapMonthTwice(org.joda.time.TestMonthDay_Basics)  Time elapsed: 0 sec  <<< ERROR!
java.lang.IllegalArgumentException: Field 'days' is not supported
	at org.joda.time.base.AbstractPartial.indexOfSupported(AbstractPartial.java:52)
	at org.joda.time.MonthDay.withFieldAdded(MonthDay.java:514)
	at org.joda.time.MonthDay.plusDays(MonthDay.java:615)
	at org.joda.time.TestMonthDay_Basics.testPlusDays_int_wrapMonthTwice(TestMonthDay_Basics.java:516)

testPlusDays_int_wrapMonthIntoNextYear(org.joda.time.TestMonthDay_Basics)  Time elapsed: 0.001 sec  <<< ERROR!
java.lang.IllegalArgumentException: Field 'days' is not supported
	at org.joda.time.base.AbstractPartial.indexOfSupported(AbstractPartial.java:52)
	at org.joda.time.MonthDay.withFieldAdded(MonthDay.java:514)
	at org.joda.time.MonthDay.plusDays(MonthDay.java:615)
	at org.joda.time.TestMonthDay_Basics.testPlusDays_int_wrapMonthIntoNextYear(TestMonthDay_Basics.java:523)

testPlusDays_int_wrapMonthTwiceIntoNextYear(org.joda.time.TestMonthDay_Basics)  Time elapsed: 0.001 sec  <<< ERROR!
java.lang.IllegalArgumentException: Field 'days' is not supported
	at org.joda.time.base.AbstractPartial.indexOfSupported(AbstractPartial.java:52)
	at org.joda.time.MonthDay.withFieldAdded(MonthDay.java:514)
	at org.joda.time.MonthDay.plusDays(MonthDay.java:615)
	at org.joda.time.TestMonthDay_Basics.testPlusDays_int_wrapMonthTwiceIntoNextYear(TestMonthDay_Basics.java:530)

testPlusDays_int_wrap50(org.joda.time.TestMonthDay_Basics)  Time elapsed: 0 sec  <<< ERROR!
java.lang.IllegalArgumentException: Field 'days' is not supported
	at org.joda.time.base.AbstractPartial.indexOfSupported(AbstractPartial.java:52)
	at org.joda.time.MonthDay.withFieldAdded(MonthDay.java:514)
	at org.joda.time.MonthDay.plusDays(MonthDay.java:615)
	at org.joda.time.TestMonthDay_Basics.testPlusDays_int_wrap50(TestMonthDay_Basics.java:537)

testPlusDays_int_toLeap(org.joda.time.TestMonthDay_Basics)  Time elapsed: 0.002 sec  <<< ERROR!
java.lang.IllegalArgumentException: Field 'days' is not supported
	at org.joda.time.base.AbstractPartial.indexOfSupported(AbstractPartial.java:52)
	at org.joda.time.MonthDay.withFieldAdded(MonthDay.java:514)
	at org.joda.time.MonthDay.plusDays(MonthDay.java:615)
	at org.joda.time.TestMonthDay_Basics.testPlusDays_int_toLeap(TestMonthDay_Basics.java:544)

testPlusDays_int_fromLeap(org.joda.time.TestMonthDay_Basics)  Time elapsed: 0 sec  <<< ERROR!
java.lang.IllegalArgumentException: Field 'days' is not supported
	at org.joda.time.base.AbstractPartial.indexOfSupported(AbstractPartial.java:52)
	at org.joda.time.MonthDay.withFieldAdded(MonthDay.java:514)
	at org.joda.time.MonthDay.plusDays(MonthDay.java:615)
	at org.joda.time.TestMonthDay_Basics.testPlusDays_int_fromLeap(TestMonthDay_Basics.java:551)

testPlusDays_int_negativeFromLeap(org.joda.time.TestMonthDay_Basics)  Time elapsed: 0 sec  <<< ERROR!
java.lang.IllegalArgumentException: Field 'days' is not supported
	at org.joda.time.base.AbstractPartial.indexOfSupported(AbstractPartial.java:52)
	at org.joda.time.MonthDay.withFieldAdded(MonthDay.java:514)
	at org.joda.time.MonthDay.plusDays(MonthDay.java:615)
	at org.joda.time.TestMonthDay_Basics.testPlusDays_int_negativeFromLeap(TestMonthDay_Basics.java:558)

testPlusDays_same(org.joda.time.TestMonthDay_Basics)  Time elapsed: 0 sec  <<< ERROR!
java.lang.IllegalArgumentException: Field 'days' is not supported
	at org.joda.time.base.AbstractPartial.indexOfSupported(AbstractPartial.java:52)
	at org.joda.time.MonthDay.withFieldAdded(MonthDay.java:514)
	at org.joda.time.MonthDay.plusDays(MonthDay.java:615)
	at org.joda.time.TestMonthDay_Basics.testPlusDays_same(TestMonthDay_Basics.java:565)

testMinusMonths_int_fromLeap(org.joda.time.TestMonthDay_Basics)  Time elapsed: 0.006 sec  <<< ERROR!
java.lang.IllegalArgumentException: Field 'months' is not supported
	at org.joda.time.base.AbstractPartial.indexOfSupported(AbstractPartial.java:52)
	at org.joda.time.MonthDay.withFieldAdded(MonthDay.java:514)
	at org.joda.time.MonthDay.minusMonths(MonthDay.java:655)
	at org.joda.time.TestMonthDay_Basics.testMinusMonths_int_fromLeap(TestMonthDay_Basics.java:589)

testMinusMonths_int_negativeFromLeap(org.joda.time.TestMonthDay_Basics)  Time elapsed: 0 sec  <<< ERROR!
java.lang.IllegalArgumentException: Field 'months' is not supported
	at org.joda.time.base.AbstractPartial.indexOfSupported(AbstractPartial.java:52)
	at org.joda.time.MonthDay.withFieldAdded(MonthDay.java:514)
	at org.joda.time.MonthDay.minusMonths(MonthDay.java:655)
	at org.joda.time.TestMonthDay_Basics.testMinusMonths_int_negativeFromLeap(TestMonthDay_Basics.java:596)

testMinusMonths_int_endOfMonthAdjust(org.joda.time.TestMonthDay_Basics)  Time elapsed: 0 sec  <<< ERROR!
java.lang.IllegalArgumentException: Field 'months' is not supported
	at org.joda.time.base.AbstractPartial.indexOfSupported(AbstractPartial.java:52)
	at org.joda.time.MonthDay.withFieldAdded(MonthDay.java:514)
	at org.joda.time.MonthDay.minusMonths(MonthDay.java:655)
	at org.joda.time.TestMonthDay_Basics.testMinusMonths_int_endOfMonthAdjust(TestMonthDay_Basics.java:603)

testMinusMonths_int_same(org.joda.time.TestMonthDay_Basics)  Time elapsed: 0 sec  <<< ERROR!
java.lang.IllegalArgumentException: Field 'months' is not supported
	at org.joda.time.base.AbstractPartial.indexOfSupported(AbstractPartial.java:52)
	at org.joda.time.MonthDay.withFieldAdded(MonthDay.java:514)
	at org.joda.time.MonthDay.minusMonths(MonthDay.java:655)
	at org.joda.time.TestMonthDay_Basics.testMinusMonths_int_same(TestMonthDay_Basics.java:617)

testMinusMonths_int_negativeEndOfMonthAdjust(org.joda.time.TestMonthDay_Basics)  Time elapsed: 0 sec  <<< ERROR!
java.lang.IllegalArgumentException: Field 'months' is not supported
	at org.joda.time.base.AbstractPartial.indexOfSupported(AbstractPartial.java:52)
	at org.joda.time.MonthDay.withFieldAdded(MonthDay.java:514)
	at org.joda.time.MonthDay.minusMonths(MonthDay.java:655)
	at org.joda.time.TestMonthDay_Basics.testMinusMonths_int_negativeEndOfMonthAdjust(TestMonthDay_Basics.java:610)

testMinusMonths_int_wrap(org.joda.time.TestMonthDay_Basics)  Time elapsed: 0 sec  <<< ERROR!
java.lang.IllegalArgumentException: Field 'months' is not supported
	at org.joda.time.base.AbstractPartial.indexOfSupported(AbstractPartial.java:52)
	at org.joda.time.MonthDay.withFieldAdded(MonthDay.java:514)
	at org.joda.time.MonthDay.minusMonths(MonthDay.java:655)
	at org.joda.time.TestMonthDay_Basics.testMinusMonths_int_wrap(TestMonthDay_Basics.java:623)

testMinusMonths_int_adjust(org.joda.time.TestMonthDay_Basics)  Time elapsed: 0 sec  <<< ERROR!
java.lang.IllegalArgumentException: Field 'months' is not supported
	at org.joda.time.base.AbstractPartial.indexOfSupported(AbstractPartial.java:52)
	at org.joda.time.MonthDay.withFieldAdded(MonthDay.java:514)
	at org.joda.time.MonthDay.minusMonths(MonthDay.java:655)
	at org.joda.time.TestMonthDay_Basics.testMinusMonths_int_adjust(TestMonthDay_Basics.java:630)

testMinusDays_int_wrapMonth(org.joda.time.TestMonthDay_Basics)  Time elapsed: 0 sec  <<< ERROR!
java.lang.IllegalArgumentException: Field 'days' is not supported
	at org.joda.time.base.AbstractPartial.indexOfSupported(AbstractPartial.java:52)
	at org.joda.time.MonthDay.withFieldAdded(MonthDay.java:514)
	at org.joda.time.MonthDay.minusDays(MonthDay.java:675)
	at org.joda.time.TestMonthDay_Basics.testMinusDays_int_wrapMonth(TestMonthDay_Basics.java:645)

testMinusDays_int_wrapMonthTwice(org.joda.time.TestMonthDay_Basics)  Time elapsed: 0 sec  <<< ERROR!
java.lang.IllegalArgumentException: Field 'days' is not supported
	at org.joda.time.base.AbstractPartial.indexOfSupported(AbstractPartial.java:52)
	at org.joda.time.MonthDay.withFieldAdded(MonthDay.java:514)
	at org.joda.time.MonthDay.minusDays(MonthDay.java:675)
	at org.joda.time.TestMonthDay_Basics.testMinusDays_int_wrapMonthTwice(TestMonthDay_Basics.java:652)

testMinusDays_int_wrapMonthIntoLastYear(org.joda.time.TestMonthDay_Basics)  Time elapsed: 0.001 sec  <<< ERROR!
java.lang.IllegalArgumentException: Field 'days' is not supported
	at org.joda.time.base.AbstractPartial.indexOfSupported(AbstractPartial.java:52)
	at org.joda.time.MonthDay.withFieldAdded(MonthDay.java:514)
	at org.joda.time.MonthDay.minusDays(MonthDay.java:675)
	at org.joda.time.TestMonthDay_Basics.testMinusDays_int_wrapMonthIntoLastYear(TestMonthDay_Basics.java:659)

testMinusDays_int_wrapMonthTwiceIntoLastYear(org.joda.time.TestMonthDay_Basics)  Time elapsed: 0 sec  <<< ERROR!
java.lang.IllegalArgumentException: Field 'days' is not supported
	at org.joda.time.base.AbstractPartial.indexOfSupported(AbstractPartial.java:52)
	at org.joda.time.MonthDay.withFieldAdded(MonthDay.java:514)
	at org.joda.time.MonthDay.minusDays(MonthDay.java:675)
	at org.joda.time.TestMonthDay_Basics.testMinusDays_int_wrapMonthTwiceIntoLastYear(TestMonthDay_Basics.java:666)

testMinusDays_int_toLeap(org.joda.time.TestMonthDay_Basics)  Time elapsed: 0.001 sec  <<< ERROR!
java.lang.IllegalArgumentException: Field 'days' is not supported
	at org.joda.time.base.AbstractPartial.indexOfSupported(AbstractPartial.java:52)
	at org.joda.time.MonthDay.withFieldAdded(MonthDay.java:514)
	at org.joda.time.MonthDay.minusDays(MonthDay.java:675)
	at org.joda.time.TestMonthDay_Basics.testMinusDays_int_toLeap(TestMonthDay_Basics.java:673)

testMinusDays_int_fromLeap(org.joda.time.TestMonthDay_Basics)  Time elapsed: 0.001 sec  <<< ERROR!
java.lang.IllegalArgumentException: Field 'days' is not supported
	at org.joda.time.base.AbstractPartial.indexOfSupported(AbstractPartial.java:52)
	at org.joda.time.MonthDay.withFieldAdded(MonthDay.java:514)
	at org.joda.time.MonthDay.minusDays(MonthDay.java:675)
	at org.joda.time.TestMonthDay_Basics.testMinusDays_int_fromLeap(TestMonthDay_Basics.java:680)

testMinusDays_int_negativeFromLeap(org.joda.time.TestMonthDay_Basics)  Time elapsed: 0 sec  <<< ERROR!
java.lang.IllegalArgumentException: Field 'days' is not supported
	at org.joda.time.base.AbstractPartial.indexOfSupported(AbstractPartial.java:52)
	at org.joda.time.MonthDay.withFieldAdded(MonthDay.java:514)
	at org.joda.time.MonthDay.minusDays(MonthDay.java:675)
	at org.joda.time.TestMonthDay_Basics.testMinusDays_int_negativeFromLeap(TestMonthDay_Basics.java:687)

testMinusDays_same(org.joda.time.TestMonthDay_Basics)  Time elapsed: 0.001 sec  <<< ERROR!
java.lang.IllegalArgumentException: Field 'days' is not supported
	at org.joda.time.base.AbstractPartial.indexOfSupported(AbstractPartial.java:52)
	at org.joda.time.MonthDay.withFieldAdded(MonthDay.java:514)
	at org.joda.time.MonthDay.minusDays(MonthDay.java:675)
	at org.joda.time.TestMonthDay_Basics.testMinusDays_same(TestMonthDay_Basics.java:694)

testWithFieldAdded1(org.joda.time.TestPartial_Basics)  Time elapsed: 0.001 sec  <<< ERROR!
java.lang.IllegalArgumentException: Field 'hours' is not supported
	at org.joda.time.base.AbstractPartial.indexOfSupported(AbstractPartial.java:52)
	at org.joda.time.Partial.withFieldAdded(Partial.java:571)
	at org.joda.time.TestPartial_Basics.testWithFieldAdded1(TestPartial_Basics.java:552)

testWithFieldAdded2(org.joda.time.TestPartial_Basics)  Time elapsed: 0 sec  <<< FAILURE!
junit.framework.AssertionFailedError
	at junit.framework.Assert.fail(Assert.java:47)
	at junit.framework.Assert.fail(Assert.java:53)
	at org.joda.time.TestPartial_Basics.testWithFieldAdded2(TestPartial_Basics.java:563)

testWithFieldAdded3(org.joda.time.TestPartial_Basics)  Time elapsed: 0.001 sec  <<< ERROR!
java.lang.ArrayIndexOutOfBoundsException: -1
	at org.joda.time.Partial.getField(Partial.java:358)
	at org.joda.time.base.AbstractPartial.getField(AbstractPartial.java:27)
	at org.joda.time.Partial.withFieldAdded(Partial.java:576)
	at org.joda.time.TestPartial_Basics.testWithFieldAdded3(TestPartial_Basics.java:571)

testWithFieldAdded4(org.joda.time.TestPartial_Basics)  Time elapsed: 0.001 sec  <<< ERROR!
java.lang.IllegalArgumentException: Field 'hours' is not supported
	at org.joda.time.base.AbstractPartial.indexOfSupported(AbstractPartial.java:52)
	at org.joda.time.Partial.withFieldAdded(Partial.java:571)
	at org.joda.time.TestPartial_Basics.testWithFieldAdded4(TestPartial_Basics.java:579)

testWithFieldAdded5(org.joda.time.TestPartial_Basics)  Time elapsed: 0.001 sec  <<< ERROR!
java.lang.ArrayIndexOutOfBoundsException: -1
	at org.joda.time.Partial.getField(Partial.java:358)
	at org.joda.time.base.AbstractPartial.getField(AbstractPartial.java:27)
	at org.joda.time.Partial.withFieldAdded(Partial.java:576)
	at org.joda.time.TestPartial_Basics.testWithFieldAdded5(TestPartial_Basics.java:586)

testWithFieldAddWrapped1(org.joda.time.TestPartial_Basics)  Time elapsed: 0.002 sec  <<< ERROR!
java.lang.IllegalArgumentException: Field 'hours' is not supported
	at org.joda.time.base.AbstractPartial.indexOfSupported(AbstractPartial.java:52)
	at org.joda.time.Partial.withFieldAddWrapped(Partial.java:595)
	at org.joda.time.TestPartial_Basics.testWithFieldAddWrapped1(TestPartial_Basics.java:646)

testWithFieldAddWrapped2(org.joda.time.TestPartial_Basics)  Time elapsed: 0 sec  <<< FAILURE!
junit.framework.AssertionFailedError
	at junit.framework.Assert.fail(Assert.java:47)
	at junit.framework.Assert.fail(Assert.java:53)
	at org.joda.time.TestPartial_Basics.testWithFieldAddWrapped2(TestPartial_Basics.java:657)

testWithFieldAddWrapped3(org.joda.time.TestPartial_Basics)  Time elapsed: 0.001 sec  <<< ERROR!
java.lang.ArrayIndexOutOfBoundsException: -1
	at org.joda.time.Partial.getField(Partial.java:358)
	at org.joda.time.base.AbstractPartial.getField(AbstractPartial.java:27)
	at org.joda.time.Partial.withFieldAddWrapped(Partial.java:600)
	at org.joda.time.TestPartial_Basics.testWithFieldAddWrapped3(TestPartial_Basics.java:665)

testWithFieldAddWrapped4(org.joda.time.TestPartial_Basics)  Time elapsed: 0 sec  <<< ERROR!
java.lang.IllegalArgumentException: Field 'hours' is not supported
	at org.joda.time.base.AbstractPartial.indexOfSupported(AbstractPartial.java:52)
	at org.joda.time.Partial.withFieldAddWrapped(Partial.java:595)
	at org.joda.time.TestPartial_Basics.testWithFieldAddWrapped4(TestPartial_Basics.java:673)

testWithFieldAddWrapped5(org.joda.time.TestPartial_Basics)  Time elapsed: 0.001 sec  <<< ERROR!
java.lang.ArrayIndexOutOfBoundsException: -1
	at org.joda.time.Partial.getField(Partial.java:358)
	at org.joda.time.base.AbstractPartial.getField(AbstractPartial.java:27)
	at org.joda.time.Partial.withFieldAddWrapped(Partial.java:600)
	at org.joda.time.TestPartial_Basics.testWithFieldAddWrapped5(TestPartial_Basics.java:680)

testWithFieldAddWrapped6(org.joda.time.TestPartial_Basics)  Time elapsed: 0 sec  <<< ERROR!
java.lang.IllegalArgumentException: Field 'hours' is not supported
	at org.joda.time.base.AbstractPartial.indexOfSupported(AbstractPartial.java:52)
	at org.joda.time.Partial.withFieldAddWrapped(Partial.java:595)
	at org.joda.time.TestPartial_Basics.testWithFieldAddWrapped6(TestPartial_Basics.java:688)

testWithFieldAddWrapped7(org.joda.time.TestPartial_Basics)  Time elapsed: 0.001 sec  <<< ERROR!
java.lang.IllegalArgumentException: Field 'minutes' is not supported
	at org.joda.time.base.AbstractPartial.indexOfSupported(AbstractPartial.java:52)
	at org.joda.time.Partial.withFieldAddWrapped(Partial.java:595)
	at org.joda.time.TestPartial_Basics.testWithFieldAddWrapped7(TestPartial_Basics.java:697)

testWithFieldAddWrapped8(org.joda.time.TestPartial_Basics)  Time elapsed: 0 sec  <<< ERROR!
java.lang.IllegalArgumentException: Field 'minutes' is not supported
	at org.joda.time.base.AbstractPartial.indexOfSupported(AbstractPartial.java:52)
	at org.joda.time.Partial.withFieldAddWrapped(Partial.java:595)
	at org.joda.time.TestPartial_Basics.testWithFieldAddWrapped8(TestPartial_Basics.java:709)

testCutoverAddYears(org.joda.time.chrono.TestGJChronology)  Time elapsed: 0.001 sec  <<< ERROR!
java.lang.IllegalArgumentException: Field 'years' is not supported
	at org.joda.time.base.AbstractPartial.indexOfSupported(AbstractPartial.java:52)
	at org.joda.time.YearMonthDay.withFieldAdded(YearMonthDay.java:439)
	at org.joda.time.chrono.TestGJChronology.testAdd(TestGJChronology.java:496)
	at org.joda.time.chrono.TestGJChronology.testCutoverAddYears(TestGJChronology.java:381)

testCutoverAddMonths(org.joda.time.chrono.TestGJChronology)  Time elapsed: 0 sec  <<< ERROR!
java.lang.IllegalArgumentException: Field 'months' is not supported
	at org.joda.time.base.AbstractPartial.indexOfSupported(AbstractPartial.java:52)
	at org.joda.time.YearMonthDay.withFieldAdded(YearMonthDay.java:439)
	at org.joda.time.chrono.TestGJChronology.testAdd(TestGJChronology.java:496)
	at org.joda.time.chrono.TestGJChronology.testCutoverAddMonths(TestGJChronology.java:422)

testCutoverAddDays(org.joda.time.chrono.TestGJChronology)  Time elapsed: 0.001 sec  <<< ERROR!
java.lang.IllegalArgumentException: Field 'days' is not supported
	at org.joda.time.base.AbstractPartial.indexOfSupported(AbstractPartial.java:52)
	at org.joda.time.YearMonthDay.withFieldAdded(YearMonthDay.java:439)
	at org.joda.time.chrono.TestGJChronology.testAdd(TestGJChronology.java:496)
	at org.joda.time.chrono.TestGJChronology.testCutoverAddDays(TestGJChronology.java:452)

testYearEndAddDays(org.joda.time.chrono.TestGJChronology)  Time elapsed: 0 sec  <<< ERROR!
java.lang.IllegalArgumentException: Field 'days' is not supported
	at org.joda.time.base.AbstractPartial.indexOfSupported(AbstractPartial.java:52)
	at org.joda.time.YearMonthDay.withFieldAdded(YearMonthDay.java:439)
	at org.joda.time.chrono.TestGJChronology.testAdd(TestGJChronology.java:496)
	at org.joda.time.chrono.TestGJChronology.testYearEndAddDays(TestGJChronology.java:462)

testTimeOfDayAdd(org.joda.time.chrono.TestGJChronology)  Time elapsed: 0.001 sec  <<< ERROR!
java.lang.IllegalArgumentException: Field 'hours' is not supported
	at org.joda.time.base.AbstractPartial.indexOfSupported(AbstractPartial.java:52)
	at org.joda.time.TimeOfDay.withFieldAdded(TimeOfDay.java:553)
	at org.joda.time.TimeOfDay.plusHours(TimeOfDay.java:632)
	at org.joda.time.chrono.TestGJChronology.testTimeOfDayAdd(TestGJChronology.java:504)

testAddMonths(org.joda.time.chrono.TestISOChronology)  Time elapsed: 0.001 sec  <<< ERROR!
java.lang.IllegalArgumentException: Field 'months' is not supported
	at org.joda.time.base.AbstractPartial.indexOfSupported(AbstractPartial.java:52)
	at org.joda.time.YearMonthDay.withFieldAdded(YearMonthDay.java:439)
	at org.joda.time.chrono.TestISOChronology.testAdd(TestISOChronology.java:425)
	at org.joda.time.chrono.TestISOChronology.testAddMonths(TestISOChronology.java:394)

testCutoverAddYears(org.joda.time.chrono.TestISOChronology)  Time elapsed: 0.001 sec  <<< ERROR!
java.lang.IllegalArgumentException: Field 'years' is not supported
	at org.joda.time.base.AbstractPartial.indexOfSupported(AbstractPartial.java:52)
	at org.joda.time.YearMonthDay.withFieldAdded(YearMonthDay.java:439)
	at org.joda.time.chrono.TestISOChronology.testAdd(TestISOChronology.java:425)
	at org.joda.time.chrono.TestISOChronology.testCutoverAddYears(TestISOChronology.java:376)

testTimeOfDayAdd(org.joda.time.chrono.TestISOChronology)  Time elapsed: 0 sec  <<< ERROR!
java.lang.IllegalArgumentException: Field 'hours' is not supported
	at org.joda.time.base.AbstractPartial.indexOfSupported(AbstractPartial.java:52)
	at org.joda.time.TimeOfDay.withFieldAdded(TimeOfDay.java:553)
	at org.joda.time.TimeOfDay.plusHours(TimeOfDay.java:632)
	at org.joda.time.chrono.TestISOChronology.testTimeOfDayAdd(TestISOChronology.java:433)

testPartialDayOfYearAdd(org.joda.time.chrono.TestISOChronology)  Time elapsed: 0.001 sec  <<< ERROR!
java.lang.IllegalArgumentException: Field 'days' is not supported
	at org.joda.time.base.AbstractPartial.indexOfSupported(AbstractPartial.java:52)
	at org.joda.time.Partial.withFieldAdded(Partial.java:571)
	at org.joda.time.chrono.TestISOChronology.testPartialDayOfYearAdd(TestISOChronology.java:442)


Results :

Failed tests: 
  org.joda.time.TestMonthDay_Basics#testWithFieldAdded_nullField_zero AssertionFailedError
  org.joda.time.TestPartial_Basics#testWithFieldAddWrapped2 AssertionFailedError
  org.joda.time.TestPartial_Basics#testWithFieldAdded2 AssertionFailedError
  org.joda.time.TestTimeOfDay_Basics#testWithFieldAdded2 AssertionFailedError
  org.joda.time.TestYearMonthDay_Basics#testWithFieldAdded2 AssertionFailedError
  org.joda.time.TestYearMonth_Basics#testWithFieldAdded_nullField_zero AssertionFailedError
Tests in error: 
  org.joda.time.TestMonthDay_Basics#testMinusDays_int IllegalArgumentException F...
  org.joda.time.TestMonthDay_Basics#testMinusDays_int_fromLeap IllegalArgumentException
  org.joda.time.TestMonthDay_Basics#testMinusDays_int_negativeFromLeap IllegalArgumentException
  org.joda.time.TestMonthDay_Basics#testMinusDays_int_toLeap IllegalArgumentException
  org.joda.time.TestMonthDay_Basics#testMinusDays_int_wrapMonth IllegalArgumentException
  org.joda.time.TestMonthDay_Basics#testMinusDays_int_wrapMonthIntoLastYear IllegalArgumentException
  org.joda.time.TestMonthDay_Basics#testMinusDays_int_wrapMonthTwice IllegalArgumentException
  org.joda.time.TestMonthDay_Basics#testMinusDays_int_wrapMonthTwiceIntoLastYear IllegalArgumentException
  org.joda.time.TestMonthDay_Basics#testMinusDays_same IllegalArgumentException ...
  org.joda.time.TestMonthDay_Basics#testMinusMonths_int IllegalArgumentException
  org.joda.time.TestMonthDay_Basics#testMinusMonths_int_adjust IllegalArgumentException
  org.joda.time.TestMonthDay_Basics#testMinusMonths_int_endOfMonthAdjust IllegalArgumentException
  org.joda.time.TestMonthDay_Basics#testMinusMonths_int_fromLeap IllegalArgumentException
  org.joda.time.TestMonthDay_Basics#testMinusMonths_int_negativeEndOfMonthAdjust IllegalArgumentException
  org.joda.time.TestMonthDay_Basics#testMinusMonths_int_negativeFromLeap IllegalArgumentException
  org.joda.time.TestMonthDay_Basics#testMinusMonths_int_same IllegalArgumentException
  org.joda.time.TestMonthDay_Basics#testMinusMonths_int_wrap IllegalArgumentException
  org.joda.time.TestMonthDay_Basics#testPlusDays_int IllegalArgumentException Fi...
  org.joda.time.TestMonthDay_Basics#testPlusDays_int_fromLeap IllegalArgumentException
  org.joda.time.TestMonthDay_Basics#testPlusDays_int_negativeFromLeap IllegalArgumentException
  org.joda.time.TestMonthDay_Basics#testPlusDays_int_toLeap IllegalArgumentException
  org.joda.time.TestMonthDay_Basics#testPlusDays_int_wrap50 IllegalArgumentException
  org.joda.time.TestMonthDay_Basics#testPlusDays_int_wrapMonth IllegalArgumentException
  org.joda.time.TestMonthDay_Basics#testPlusDays_int_wrapMonthIntoNextYear IllegalArgumentException
  org.joda.time.TestMonthDay_Basics#testPlusDays_int_wrapMonthTwice IllegalArgumentException
  org.joda.time.TestMonthDay_Basics#testPlusDays_int_wrapMonthTwiceIntoNextYear IllegalArgumentException
  org.joda.time.TestMonthDay_Basics#testPlusDays_same IllegalArgumentException F...
  org.joda.time.TestMonthDay_Basics#testPlusMonths_int IllegalArgumentException ...
  org.joda.time.TestMonthDay_Basics#testPlusMonths_int_adjust IllegalArgumentException
  org.joda.time.TestMonthDay_Basics#testPlusMonths_int_endOfMonthAdjust IllegalArgumentException
  org.joda.time.TestMonthDay_Basics#testPlusMonths_int_fromLeap IllegalArgumentException
  org.joda.time.TestMonthDay_Basics#testPlusMonths_int_negativeEndOfMonthAdjust IllegalArgumentException
  org.joda.time.TestMonthDay_Basics#testPlusMonths_int_negativeFromLeap IllegalArgumentException
  org.joda.time.TestMonthDay_Basics#testPlusMonths_int_same IllegalArgumentException
  org.joda.time.TestMonthDay_Basics#testPlusMonths_int_wrap IllegalArgumentException
  org.joda.time.TestMonthDay_Basics#testWithFieldAdded IllegalArgumentException ...
  org.joda.time.TestMonthDay_Basics#testWithFieldAdded_nullField_nonZero IndexOutOfBoundsException
  org.joda.time.TestMonthDay_Basics#testWithFieldAdded_unknownField IndexOutOfBoundsException
  org.joda.time.TestMonthDay_Basics#testWithFieldAdded_zero IllegalArgumentException
  org.joda.time.TestPartial_Basics#testWithFieldAddWrapped1 IllegalArgumentException
  org.joda.time.TestPartial_Basics#testWithFieldAddWrapped3 ArrayIndexOutOfBoundsException
  org.joda.time.TestPartial_Basics#testWithFieldAddWrapped4 IllegalArgumentException
  org.joda.time.TestPartial_Basics#testWithFieldAddWrapped5 ArrayIndexOutOfBoundsException
  org.joda.time.TestPartial_Basics#testWithFieldAddWrapped6 IllegalArgumentException
  org.joda.time.TestPartial_Basics#testWithFieldAddWrapped7 IllegalArgumentException
  org.joda.time.TestPartial_Basics#testWithFieldAddWrapped8 IllegalArgumentException
  org.joda.time.TestPartial_Basics#testWithFieldAdded1 IllegalArgumentException ...
  org.joda.time.TestPartial_Basics#testWithFieldAdded3 ArrayIndexOutOfBoundsException
  org.joda.time.TestPartial_Basics#testWithFieldAdded4 IllegalArgumentException ...
  org.joda.time.TestPartial_Basics#testWithFieldAdded5 ArrayIndexOutOfBoundsException
  org.joda.time.TestTimeOfDay_Basics#testMinusHours_int IllegalArgumentException
  org.joda.time.TestTimeOfDay_Basics#testMinusMillis_int IllegalArgumentException
  org.joda.time.TestTimeOfDay_Basics#testMinusMinutes_int IllegalArgumentException
  org.joda.time.TestTimeOfDay_Basics#testMinusSeconds_int IllegalArgumentException
  org.joda.time.TestTimeOfDay_Basics#testPlusHours_int IllegalArgumentException ...
  org.joda.time.TestTimeOfDay_Basics#testPlusMillis_int IllegalArgumentException
  org.joda.time.TestTimeOfDay_Basics#testPlusMinutes_int IllegalArgumentException
  org.joda.time.TestTimeOfDay_Basics#testPlusSeconds_int IllegalArgumentException
  org.joda.time.TestTimeOfDay_Basics#testWithFieldAdded1 IllegalArgumentException
  org.joda.time.TestTimeOfDay_Basics#testWithFieldAdded3 IndexOutOfBoundsException
  org.joda.time.TestTimeOfDay_Basics#testWithFieldAdded4 IllegalArgumentException
  org.joda.time.TestTimeOfDay_Basics#testWithFieldAdded5 IndexOutOfBoundsException
  org.joda.time.TestTimeOfDay_Basics#testWithFieldAdded6 IllegalArgumentException
  org.joda.time.TestTimeOfDay_Basics#testWithFieldAdded7 IllegalArgumentException
  org.joda.time.TestTimeOfDay_Basics#testWithFieldAdded8 IllegalArgumentException
  org.joda.time.TestYearMonthDay_Basics#testMinusDays_int IllegalArgumentException
  org.joda.time.TestYearMonthDay_Basics#testMinusMonths_int IllegalArgumentException
  org.joda.time.TestYearMonthDay_Basics#testMinusYears_int IllegalArgumentException
  org.joda.time.TestYearMonthDay_Basics#testPlusDays_int IllegalArgumentException
  org.joda.time.TestYearMonthDay_Basics#testPlusMonths_int IllegalArgumentException
  org.joda.time.TestYearMonthDay_Basics#testPlusYears_int IllegalArgumentException
  org.joda.time.TestYearMonthDay_Basics#testWithFieldAdded1 IllegalArgumentException
  org.joda.time.TestYearMonthDay_Basics#testWithFieldAdded3 IndexOutOfBoundsException
  org.joda.time.TestYearMonthDay_Basics#testWithFieldAdded4 IllegalArgumentException
  org.joda.time.TestYearMonthDay_Basics#testWithFieldAdded5 IndexOutOfBoundsException
  org.joda.time.TestYearMonth_Basics#testMinusMonths_int IllegalArgumentException
  org.joda.time.TestYearMonth_Basics#testMinusYears_int IllegalArgumentException
  org.joda.time.TestYearMonth_Basics#testPlusMonths_int IllegalArgumentException
  org.joda.time.TestYearMonth_Basics#testPlusYears_int IllegalArgumentException ...
  org.joda.time.TestYearMonth_Basics#testToInterval IllegalArgumentException Fie...
  org.joda.time.TestYearMonth_Basics#testToInterval_Zone IllegalArgumentException
  org.joda.time.TestYearMonth_Basics#testToInterval_nullZone IllegalArgumentException
  org.joda.time.TestYearMonth_Basics#testWithFieldAdded IllegalArgumentException
  org.joda.time.TestYearMonth_Basics#testWithFieldAdded_nullField_nonZero IndexOutOfBoundsException
  org.joda.time.TestYearMonth_Basics#testWithFieldAdded_unknownField IndexOutOfBoundsException
  org.joda.time.TestYearMonth_Basics#testWithFieldAdded_zero IllegalArgumentException
  org.joda.time.chrono.TestGJChronology#testCutoverAddDays IllegalArgumentException
  org.joda.time.chrono.TestGJChronology#testCutoverAddMonths IllegalArgumentException
  org.joda.time.chrono.TestGJChronology#testCutoverAddYears IllegalArgumentException
  org.joda.time.chrono.TestGJChronology#testTimeOfDayAdd IllegalArgumentException
  org.joda.time.chrono.TestGJChronology#testYearEndAddDays IllegalArgumentException
  org.joda.time.chrono.TestISOChronology#testAddMonths IllegalArgumentException ...
  org.joda.time.chrono.TestISOChronology#testCutoverAddYears IllegalArgumentException
  org.joda.time.chrono.TestISOChronology#testPartialDayOfYearAdd IllegalArgumentException
  org.joda.time.chrono.TestISOChronology#testTimeOfDayAdd IllegalArgumentException

Tests run: 4157, Failures: 6, Errors: 95, Skipped: 0

[INFO] ------------------------------------------------------------------------
[INFO] BUILD FAILURE
[INFO] ------------------------------------------------------------------------
[INFO] Total time: 16.200s
[INFO] Finished at: Wed Aug 05 20:52:06 BST 2015
[INFO] Final Memory: 9M/214M
[INFO] ------------------------------------------------------------------------
[ERROR] Failed to execute goal org.apache.maven.plugins:maven-surefire-plugin:2.18.1:test (default-test) on project joda-time: There are test failures.
[ERROR] 
[ERROR] Please refer to /home/perham/Study/LittleDarwin/Cases/joda-time-2.8.1/target/surefire-reports for the individual test results.
[ERROR] -> [Help 1]
[ERROR] 
[ERROR] To see the full stack trace of the errors, re-run Maven with the -e switch.
[ERROR] Re-run Maven using the -X switch to enable full debug logging.
[ERROR] 
[ERROR] For more information about the errors and possible solutions, please read the following articles:
[ERROR] [Help 1] http://cwiki.apache.org/confluence/display/MAVEN/MojoFailureException
