[INFO] Scanning for projects...
[INFO]                                                                         
[INFO] ------------------------------------------------------------------------
[INFO] Building Joda-Time 2.8.1
[INFO] ------------------------------------------------------------------------
[INFO] 
[INFO] --- maven-resources-plugin:2.7:resources (default-resources) @ joda-time ---
[INFO] Using 'UTF-8' encoding to copy filtered resources.
[INFO] Copying 2 resources to META-INF
[INFO] Copying 10 resources
[INFO] 
[INFO] --- maven-compiler-plugin:3.3:compile (default-compile) @ joda-time ---
[INFO] Changes detected - recompiling the module!
[INFO] Compiling 166 source files to /home/perham/Study/LittleDarwin/Cases/joda-time-2.8.1/target/classes
[INFO] 
[INFO] --- exec-maven-plugin:1.4.0:java (compile-tzdb) @ joda-time ---
Writing zoneinfo files
Writing ZoneInfoMap
[INFO] 
[INFO] --- maven-resources-plugin:2.7:testResources (default-testResources) @ joda-time ---
[INFO] Using 'UTF-8' encoding to copy filtered resources.
[INFO] Copying 34 resources
[INFO] 
[INFO] --- maven-compiler-plugin:3.3:testCompile (default-testCompile) @ joda-time ---
[INFO] Nothing to compile - all classes are up to date
[INFO] 
[INFO] --- maven-surefire-plugin:2.18.1:test (default-test) @ joda-time ---
[INFO] Surefire report directory: /home/perham/Study/LittleDarwin/Cases/joda-time-2.8.1/target/surefire-reports

-------------------------------------------------------
 T E S T S
-------------------------------------------------------
Running org.joda.time.TestAllPackages

TestBuddhistChronology.testCalendar

TestCopticChronology.testCalendar

TestEthiopicChronology.testCalendar

TestIslamicChronology.testCalendar

Testing Gregorian chronology over 1000 iterations
100% complete (i=1000)

Testing Julian chronology over 1000 iterations
100% complete (i=1000)
Writing zoneinfo files
Writing ZoneInfoMap
Tests run: 4157, Failures: 0, Errors: 23, Skipped: 0, Time elapsed: 5.552 sec <<< FAILURE! - in org.joda.time.TestAllPackages
testIsBefore_LocalDateTime(org.joda.time.TestLocalDateTime_Basics)  Time elapsed: 0.005 sec  <<< ERROR!
java.lang.IllegalArgumentException: Partial cannot be null
	at org.joda.time.base.AbstractPartial.isBefore(AbstractPartial.java:85)
	at org.joda.time.TestLocalDateTime_Basics.testIsBefore_LocalDateTime(TestLocalDateTime_Basics.java:415)

testToDate_summer(org.joda.time.TestLocalDateTime_Basics)  Time elapsed: 0.001 sec  <<< ERROR!
java.lang.IllegalArgumentException: Partial cannot be null
	at org.joda.time.base.AbstractPartial.isBefore(AbstractPartial.java:85)
	at org.joda.time.LocalDateTime.correctDstTransition(LocalDateTime.java:852)
	at org.joda.time.LocalDateTime.toDate(LocalDateTime.java:799)
	at org.joda.time.TestLocalDateTime_Basics.testToDate_summer(TestLocalDateTime_Basics.java:853)

testToDate_winter(org.joda.time.TestLocalDateTime_Basics)  Time elapsed: 0.001 sec  <<< ERROR!
java.lang.IllegalArgumentException: Partial cannot be null
	at org.joda.time.base.AbstractPartial.isBefore(AbstractPartial.java:85)
	at org.joda.time.LocalDateTime.correctDstTransition(LocalDateTime.java:852)
	at org.joda.time.LocalDateTime.toDate(LocalDateTime.java:799)
	at org.joda.time.TestLocalDateTime_Basics.testToDate_winter(TestLocalDateTime_Basics.java:871)

testToDate_springDST(org.joda.time.TestLocalDateTime_Basics)  Time elapsed: 0.001 sec  <<< ERROR!
java.lang.IllegalArgumentException: Partial cannot be null
	at org.joda.time.base.AbstractPartial.isBefore(AbstractPartial.java:85)
	at org.joda.time.LocalDateTime.correctDstTransition(LocalDateTime.java:852)
	at org.joda.time.LocalDateTime.toDate(LocalDateTime.java:799)
	at org.joda.time.TestLocalDateTime_Basics.testToDate_springDST(TestLocalDateTime_Basics.java:894)

testToDate_springDST_2Hour40Savings(org.joda.time.TestLocalDateTime_Basics)  Time elapsed: 0.001 sec  <<< ERROR!
java.lang.IllegalArgumentException: Partial cannot be null
	at org.joda.time.base.AbstractPartial.isBefore(AbstractPartial.java:85)
	at org.joda.time.LocalDateTime.correctDstTransition(LocalDateTime.java:852)
	at org.joda.time.LocalDateTime.toDate(LocalDateTime.java:799)
	at org.joda.time.TestLocalDateTime_Basics.testToDate_springDST_2Hour40Savings(TestLocalDateTime_Basics.java:910)

testToDate_autumnDST(org.joda.time.TestLocalDateTime_Basics)  Time elapsed: 0.001 sec  <<< ERROR!
java.lang.IllegalArgumentException: Partial cannot be null
	at org.joda.time.base.AbstractPartial.isBefore(AbstractPartial.java:85)
	at org.joda.time.LocalDateTime.correctDstTransition(LocalDateTime.java:852)
	at org.joda.time.LocalDateTime.toDate(LocalDateTime.java:799)
	at org.joda.time.TestLocalDateTime_Basics.testToDate_autumnDST(TestLocalDateTime_Basics.java:926)

testToDate_summer_Zone(org.joda.time.TestLocalDateTime_Basics)  Time elapsed: 0.001 sec  <<< ERROR!
java.lang.IllegalArgumentException: Partial cannot be null
	at org.joda.time.base.AbstractPartial.isBefore(AbstractPartial.java:85)
	at org.joda.time.LocalDateTime.correctDstTransition(LocalDateTime.java:852)
	at org.joda.time.LocalDateTime.toDate(LocalDateTime.java:830)
	at org.joda.time.TestLocalDateTime_Basics.testToDate_summer_Zone(TestLocalDateTime_Basics.java:938)

testToDate_winter_Zone(org.joda.time.TestLocalDateTime_Basics)  Time elapsed: 0.001 sec  <<< ERROR!
java.lang.IllegalArgumentException: Partial cannot be null
	at org.joda.time.base.AbstractPartial.isBefore(AbstractPartial.java:85)
	at org.joda.time.LocalDateTime.correctDstTransition(LocalDateTime.java:852)
	at org.joda.time.LocalDateTime.toDate(LocalDateTime.java:830)
	at org.joda.time.TestLocalDateTime_Basics.testToDate_winter_Zone(TestLocalDateTime_Basics.java:956)

testToDate_springDST_Zone(org.joda.time.TestLocalDateTime_Basics)  Time elapsed: 0.001 sec  <<< ERROR!
java.lang.IllegalArgumentException: Partial cannot be null
	at org.joda.time.base.AbstractPartial.isBefore(AbstractPartial.java:85)
	at org.joda.time.LocalDateTime.correctDstTransition(LocalDateTime.java:852)
	at org.joda.time.LocalDateTime.toDate(LocalDateTime.java:830)
	at org.joda.time.TestLocalDateTime_Basics.testToDate_springDST_Zone(TestLocalDateTime_Basics.java:979)

testToDate_springDST_2Hour40Savings_Zone(org.joda.time.TestLocalDateTime_Basics)  Time elapsed: 0 sec  <<< ERROR!
java.lang.IllegalArgumentException: Partial cannot be null
	at org.joda.time.base.AbstractPartial.isBefore(AbstractPartial.java:85)
	at org.joda.time.LocalDateTime.correctDstTransition(LocalDateTime.java:852)
	at org.joda.time.LocalDateTime.toDate(LocalDateTime.java:830)
	at org.joda.time.TestLocalDateTime_Basics.testToDate_springDST_2Hour40Savings_Zone(TestLocalDateTime_Basics.java:995)

testToDate_autumnDST_Zone(org.joda.time.TestLocalDateTime_Basics)  Time elapsed: 0 sec  <<< ERROR!
java.lang.IllegalArgumentException: Partial cannot be null
	at org.joda.time.base.AbstractPartial.isBefore(AbstractPartial.java:85)
	at org.joda.time.LocalDateTime.correctDstTransition(LocalDateTime.java:852)
	at org.joda.time.LocalDateTime.toDate(LocalDateTime.java:830)
	at org.joda.time.TestLocalDateTime_Basics.testToDate_autumnDST_Zone(TestLocalDateTime_Basics.java:1011)

testToDate_summer(org.joda.time.TestLocalDate_Basics)  Time elapsed: 0 sec  <<< ERROR!
java.lang.IllegalArgumentException: Partial cannot be null
	at org.joda.time.base.AbstractPartial.isBefore(AbstractPartial.java:85)
	at org.joda.time.LocalDate.toDate(LocalDate.java:1019)
	at org.joda.time.TestLocalDate_Basics.testToDate_summer(TestLocalDate_Basics.java:1005)

testToDate_winter(org.joda.time.TestLocalDate_Basics)  Time elapsed: 0.001 sec  <<< ERROR!
java.lang.IllegalArgumentException: Partial cannot be null
	at org.joda.time.base.AbstractPartial.isBefore(AbstractPartial.java:85)
	at org.joda.time.LocalDate.toDate(LocalDate.java:1019)
	at org.joda.time.TestLocalDate_Basics.testToDate_winter(TestLocalDate_Basics.java:1019)

testToDate_springDST(org.joda.time.TestLocalDate_Basics)  Time elapsed: 0.001 sec  <<< ERROR!
java.lang.IllegalArgumentException: Partial cannot be null
	at org.joda.time.base.AbstractPartial.isBefore(AbstractPartial.java:85)
	at org.joda.time.LocalDate.toDate(LocalDate.java:1019)
	at org.joda.time.TestLocalDate_Basics.testToDate_springDST(TestLocalDate_Basics.java:1038)

testToDate_springDST_2Hour40Savings(org.joda.time.TestLocalDate_Basics)  Time elapsed: 0 sec  <<< ERROR!
java.lang.IllegalArgumentException: Partial cannot be null
	at org.joda.time.base.AbstractPartial.isBefore(AbstractPartial.java:85)
	at org.joda.time.LocalDate.toDate(LocalDate.java:1019)
	at org.joda.time.TestLocalDate_Basics.testToDate_springDST_2Hour40Savings(TestLocalDate_Basics.java:1054)

testToDate_autumnDST(org.joda.time.TestLocalDate_Basics)  Time elapsed: 0.002 sec  <<< ERROR!
java.lang.IllegalArgumentException: Partial cannot be null
	at org.joda.time.base.AbstractPartial.isBefore(AbstractPartial.java:85)
	at org.joda.time.LocalDate.toDate(LocalDate.java:1019)
	at org.joda.time.TestLocalDate_Basics.testToDate_autumnDST(TestLocalDate_Basics.java:1070)

testIsBefore_LocalDate(org.joda.time.TestLocalDate_Basics)  Time elapsed: 0.004 sec  <<< ERROR!
java.lang.IllegalArgumentException: Partial cannot be null
	at org.joda.time.base.AbstractPartial.isBefore(AbstractPartial.java:85)
	at org.joda.time.TestLocalDate_Basics.testIsBefore_LocalDate(TestLocalDate_Basics.java:401)

testIsBefore_LocalTime(org.joda.time.TestLocalTime_Basics)  Time elapsed: 0 sec  <<< ERROR!
java.lang.IllegalArgumentException: Partial cannot be null
	at org.joda.time.base.AbstractPartial.isBefore(AbstractPartial.java:85)
	at org.joda.time.TestLocalTime_Basics.testIsBefore_LocalTime(TestLocalTime_Basics.java:379)

testIsBefore_TOD(org.joda.time.TestTimeOfDay_Basics)  Time elapsed: 0 sec  <<< ERROR!
java.lang.IllegalArgumentException: Partial cannot be null
	at org.joda.time.base.AbstractPartial.isBefore(AbstractPartial.java:85)
	at org.joda.time.TestTimeOfDay_Basics.testIsBefore_TOD(TestTimeOfDay_Basics.java:303)

testIsBefore_YMD(org.joda.time.TestYearMonthDay_Basics)  Time elapsed: 0.001 sec  <<< ERROR!
java.lang.IllegalArgumentException: Partial cannot be null
	at org.joda.time.base.AbstractPartial.isBefore(AbstractPartial.java:85)
	at org.joda.time.TestYearMonthDay_Basics.testIsBefore_YMD(TestYearMonthDay_Basics.java:294)

testIsBefore_YM(org.joda.time.TestYearMonth_Basics)  Time elapsed: 0 sec  <<< ERROR!
java.lang.IllegalArgumentException: Partial cannot be null
	at org.joda.time.base.AbstractPartial.isBefore(AbstractPartial.java:85)
	at org.joda.time.TestYearMonth_Basics.testIsBefore_YM(TestYearMonth_Basics.java:288)

testIsBefore_MD(org.joda.time.TestMonthDay_Basics)  Time elapsed: 0.001 sec  <<< ERROR!
java.lang.IllegalArgumentException: Partial cannot be null
	at org.joda.time.base.AbstractPartial.isBefore(AbstractPartial.java:85)
	at org.joda.time.TestMonthDay_Basics.testIsBefore_MD(TestMonthDay_Basics.java:293)

testIsBefore_TOD(org.joda.time.TestPartial_Basics)  Time elapsed: 0.001 sec  <<< ERROR!
java.lang.IllegalArgumentException: Partial cannot be null
	at org.joda.time.base.AbstractPartial.isBefore(AbstractPartial.java:85)
	at org.joda.time.TestPartial_Basics.testIsBefore_TOD(TestPartial_Basics.java:274)


Results :

Tests in error: 
  org.joda.time.TestLocalDateTime_Basics#testIsBefore_LocalDateTime IllegalArgumentException
  org.joda.time.TestLocalDateTime_Basics#testToDate_autumnDST IllegalArgumentException
  org.joda.time.TestLocalDateTime_Basics#testToDate_autumnDST_Zone IllegalArgumentException
  org.joda.time.TestLocalDateTime_Basics#testToDate_springDST IllegalArgumentException
  org.joda.time.TestLocalDateTime_Basics#testToDate_springDST_2Hour40Savings IllegalArgumentException
  org.joda.time.TestLocalDateTime_Basics#testToDate_springDST_2Hour40Savings_Zone IllegalArgumentException
  org.joda.time.TestLocalDateTime_Basics#testToDate_springDST_Zone IllegalArgumentException
  org.joda.time.TestLocalDateTime_Basics#testToDate_summer IllegalArgumentException
  org.joda.time.TestLocalDateTime_Basics#testToDate_summer_Zone IllegalArgumentException
  org.joda.time.TestLocalDateTime_Basics#testToDate_winter IllegalArgumentException
  org.joda.time.TestLocalDateTime_Basics#testToDate_winter_Zone IllegalArgumentException
  org.joda.time.TestLocalDate_Basics#testIsBefore_LocalDate IllegalArgumentException
  org.joda.time.TestLocalDate_Basics#testToDate_autumnDST IllegalArgumentException
  org.joda.time.TestLocalDate_Basics#testToDate_springDST IllegalArgumentException
  org.joda.time.TestLocalDate_Basics#testToDate_springDST_2Hour40Savings IllegalArgumentException
  org.joda.time.TestLocalDate_Basics#testToDate_summer IllegalArgumentException ...
  org.joda.time.TestLocalDate_Basics#testToDate_winter IllegalArgumentException ...
  org.joda.time.TestLocalTime_Basics#testIsBefore_LocalTime IllegalArgumentException
  org.joda.time.TestMonthDay_Basics#testIsBefore_MD IllegalArgumentException Par...
  org.joda.time.TestPartial_Basics#testIsBefore_TOD IllegalArgumentException Par...
  org.joda.time.TestTimeOfDay_Basics#testIsBefore_TOD IllegalArgumentException P...
  org.joda.time.TestYearMonthDay_Basics#testIsBefore_YMD IllegalArgumentException
  org.joda.time.TestYearMonth_Basics#testIsBefore_YM IllegalArgumentException Pa...

Tests run: 4157, Failures: 0, Errors: 23, Skipped: 0

[INFO] ------------------------------------------------------------------------
[INFO] BUILD FAILURE
[INFO] ------------------------------------------------------------------------
[INFO] Total time: 17.905s
[INFO] Finished at: Wed Aug 05 20:46:24 BST 2015
[INFO] Final Memory: 8M/211M
[INFO] ------------------------------------------------------------------------
[ERROR] Failed to execute goal org.apache.maven.plugins:maven-surefire-plugin:2.18.1:test (default-test) on project joda-time: There are test failures.
[ERROR] 
[ERROR] Please refer to /home/perham/Study/LittleDarwin/Cases/joda-time-2.8.1/target/surefire-reports for the individual test results.
[ERROR] -> [Help 1]
[ERROR] 
[ERROR] To see the full stack trace of the errors, re-run Maven with the -e switch.
[ERROR] Re-run Maven using the -X switch to enable full debug logging.
[ERROR] 
[ERROR] For more information about the errors and possible solutions, please read the following articles:
[ERROR] [Help 1] http://cwiki.apache.org/confluence/display/MAVEN/MojoFailureException
