[INFO] Scanning for projects...
[INFO]                                                                         
[INFO] ------------------------------------------------------------------------
[INFO] Building Joda-Time 2.8.1
[INFO] ------------------------------------------------------------------------
[INFO] 
[INFO] --- maven-resources-plugin:2.7:resources (default-resources) @ joda-time ---
[INFO] Using 'UTF-8' encoding to copy filtered resources.
[INFO] Copying 2 resources to META-INF
[INFO] Copying 10 resources
[INFO] 
[INFO] --- maven-compiler-plugin:3.3:compile (default-compile) @ joda-time ---
[INFO] Changes detected - recompiling the module!
[INFO] Compiling 166 source files to /home/perham/Study/LittleDarwin/Cases/joda-time-2.8.1/target/classes
[INFO] 
[INFO] --- exec-maven-plugin:1.4.0:java (compile-tzdb) @ joda-time ---
Writing zoneinfo files
Writing ZoneInfoMap
[INFO] 
[INFO] --- maven-resources-plugin:2.7:testResources (default-testResources) @ joda-time ---
[INFO] Using 'UTF-8' encoding to copy filtered resources.
[INFO] Copying 34 resources
[INFO] 
[INFO] --- maven-compiler-plugin:3.3:testCompile (default-testCompile) @ joda-time ---
[INFO] Nothing to compile - all classes are up to date
[INFO] 
[INFO] --- maven-surefire-plugin:2.18.1:test (default-test) @ joda-time ---
[INFO] Surefire report directory: /home/perham/Study/LittleDarwin/Cases/joda-time-2.8.1/target/surefire-reports

-------------------------------------------------------
 T E S T S
-------------------------------------------------------
Running org.joda.time.TestAllPackages

TestBuddhistChronology.testCalendar

TestCopticChronology.testCalendar

TestEthiopicChronology.testCalendar

TestIslamicChronology.testCalendar

Testing Gregorian chronology over 1000 iterations
100% complete (i=1000)

Testing Julian chronology over 1000 iterations
100% complete (i=1000)
Writing zoneinfo files
Writing ZoneInfoMap
Tests run: 4157, Failures: 74, Errors: 4, Skipped: 0, Time elapsed: 6.223 sec <<< FAILURE! - in org.joda.time.TestAllPackages
testToString(org.joda.time.TestTimeOfDay_Basics)  Time elapsed: 0.005 sec  <<< FAILURE!
junit.framework.ComparisonFailure: expected:<T10:[20]:30.040> but was:<T10:[��]:30.040>
	at junit.framework.Assert.assertEquals(Assert.java:81)
	at junit.framework.Assert.assertEquals(Assert.java:87)
	at org.joda.time.TestTimeOfDay_Basics.testToString(TestTimeOfDay_Basics.java:873)

testToString_String(org.joda.time.TestTimeOfDay_Basics)  Time elapsed: 0.001 sec  <<< FAILURE!
junit.framework.ComparisonFailure: expected:<T10:[20]:30.040> but was:<T10:[��]:30.040>
	at junit.framework.Assert.assertEquals(Assert.java:81)
	at junit.framework.Assert.assertEquals(Assert.java:87)
	at org.joda.time.TestTimeOfDay_Basics.testToString_String(TestTimeOfDay_Basics.java:880)

testToString_String_Locale(org.joda.time.TestTimeOfDay_Basics)  Time elapsed: 0 sec  <<< FAILURE!
junit.framework.ComparisonFailure: expected:<10 [20]> but was:<10 [�]>
	at junit.framework.Assert.assertEquals(Assert.java:81)
	at junit.framework.Assert.assertEquals(Assert.java:87)
	at org.joda.time.TestTimeOfDay_Basics.testToString_String_Locale(TestTimeOfDay_Basics.java:886)

testToString_DTFormatter(org.joda.time.TestTimeOfDay_Basics)  Time elapsed: 0 sec  <<< FAILURE!
junit.framework.ComparisonFailure: expected:<T10:[20]:30.040> but was:<T10:[��]:30.040>
	at junit.framework.Assert.assertEquals(Assert.java:81)
	at junit.framework.Assert.assertEquals(Assert.java:87)
	at org.joda.time.TestTimeOfDay_Basics.testToString_DTFormatter(TestTimeOfDay_Basics.java:896)

testIsSupported(org.joda.time.TestTimeOfDay_Basics)  Time elapsed: 0.001 sec  <<< FAILURE!
junit.framework.AssertionFailedError: expected:<true> but was:<false>
	at junit.framework.Assert.fail(Assert.java:47)
	at junit.framework.Assert.failNotEquals(Assert.java:280)
	at junit.framework.Assert.assertEquals(Assert.java:64)
	at junit.framework.Assert.assertEquals(Assert.java:146)
	at junit.framework.Assert.assertEquals(Assert.java:152)
	at org.joda.time.TestTimeOfDay_Basics.testIsSupported(TestTimeOfDay_Basics.java:191)

testToString(org.joda.time.TestYearMonthDay_Basics)  Time elapsed: 0.001 sec  <<< FAILURE!
junit.framework.ComparisonFailure: expected:<2002-[06]-09> but was:<2002-[��]-09>
	at junit.framework.Assert.assertEquals(Assert.java:81)
	at junit.framework.Assert.assertEquals(Assert.java:87)
	at org.joda.time.TestYearMonthDay_Basics.testToString(TestYearMonthDay_Basics.java:799)

testToString_String(org.joda.time.TestYearMonthDay_Basics)  Time elapsed: 0 sec  <<< FAILURE!
junit.framework.ComparisonFailure: expected:<2002-[06]-09> but was:<2002-[��]-09>
	at junit.framework.Assert.assertEquals(Assert.java:81)
	at junit.framework.Assert.assertEquals(Assert.java:87)
	at org.joda.time.TestYearMonthDay_Basics.testToString_String(TestYearMonthDay_Basics.java:806)

testToString_String_Locale(org.joda.time.TestYearMonthDay_Basics)  Time elapsed: 0 sec  <<< FAILURE!
junit.framework.ComparisonFailure: expected:<� 9/[6]> but was:<� 9/[�]>
	at junit.framework.Assert.assertEquals(Assert.java:81)
	at junit.framework.Assert.assertEquals(Assert.java:87)
	at org.joda.time.TestYearMonthDay_Basics.testToString_String_Locale(TestYearMonthDay_Basics.java:812)

testToString_DTFormatter(org.joda.time.TestYearMonthDay_Basics)  Time elapsed: 0.001 sec  <<< FAILURE!
junit.framework.ComparisonFailure: expected:<2002-[06]-09> but was:<2002-[��]-09>
	at junit.framework.Assert.assertEquals(Assert.java:81)
	at junit.framework.Assert.assertEquals(Assert.java:87)
	at org.joda.time.TestYearMonthDay_Basics.testToString_DTFormatter(TestYearMonthDay_Basics.java:823)

testIsSupported(org.joda.time.TestYearMonthDay_Basics)  Time elapsed: 0 sec  <<< FAILURE!
junit.framework.AssertionFailedError: expected:<true> but was:<false>
	at junit.framework.Assert.fail(Assert.java:47)
	at junit.framework.Assert.failNotEquals(Assert.java:280)
	at junit.framework.Assert.assertEquals(Assert.java:64)
	at junit.framework.Assert.assertEquals(Assert.java:146)
	at junit.framework.Assert.assertEquals(Assert.java:152)
	at org.joda.time.TestYearMonthDay_Basics.testIsSupported(TestYearMonthDay_Basics.java:173)

testPropertyWithMaximumValueDayOfMonth(org.joda.time.TestYearMonthDay_Properties)  Time elapsed: 0.001 sec  <<< ERROR!
org.joda.time.IllegalFieldValueException: Value 31 for dayOfMonth must be in the range [1,30]
	at org.joda.time.field.FieldUtils.verifyValueBounds(FieldUtils.java:234)
	at org.joda.time.field.BaseDateTimeField.set(BaseDateTimeField.java:585)
	at org.joda.time.YearMonthDay$Property.setCopy(YearMonthDay.java:1052)
	at org.joda.time.YearMonthDay$Property.withMaximumValue(YearMonthDay.java:1104)
	at org.joda.time.TestYearMonthDay_Properties.testPropertyWithMaximumValueDayOfMonth(TestYearMonthDay_Properties.java:461)

testPropertyGetMaxMinValuesDay(org.joda.time.TestYearMonthDay_Properties)  Time elapsed: 0.001 sec  <<< FAILURE!
junit.framework.AssertionFailedError: expected:<30> but was:<31>
	at junit.framework.Assert.fail(Assert.java:47)
	at junit.framework.Assert.failNotEquals(Assert.java:280)
	at junit.framework.Assert.assertEquals(Assert.java:64)
	at junit.framework.Assert.assertEquals(Assert.java:198)
	at junit.framework.Assert.assertEquals(Assert.java:204)
	at org.joda.time.TestYearMonthDay_Properties.testPropertyGetMaxMinValuesDay(TestYearMonthDay_Properties.java:363)

testPropertyAddWrapFieldDay(org.joda.time.TestYearMonthDay_Properties)  Time elapsed: 0.001 sec  <<< ERROR!
org.joda.time.IllegalFieldValueException: Value 31 for dayOfMonth must be in the range [1,30]
	at org.joda.time.field.FieldUtils.verifyValueBounds(FieldUtils.java:234)
	at org.joda.time.field.BaseDateTimeField.set(BaseDateTimeField.java:585)
	at org.joda.time.field.BaseDateTimeField.addWrapField(BaseDateTimeField.java:498)
	at org.joda.time.YearMonthDay$Property.addWrapFieldToCopy(YearMonthDay.java:1035)
	at org.joda.time.TestYearMonthDay_Properties.testPropertyAddWrapFieldDay(TestYearMonthDay_Properties.java:416)

testToString(org.joda.time.TestYearMonth_Basics)  Time elapsed: 0 sec  <<< FAILURE!
junit.framework.ComparisonFailure: expected:<2002-[06]> but was:<2002-[��]>
	at junit.framework.Assert.assertEquals(Assert.java:81)
	at junit.framework.Assert.assertEquals(Assert.java:87)
	at org.joda.time.TestYearMonth_Basics.testToString(TestYearMonth_Basics.java:623)

testToString_String(org.joda.time.TestYearMonth_Basics)  Time elapsed: 0.001 sec  <<< FAILURE!
junit.framework.ComparisonFailure: expected:<2002-[06]> but was:<2002-[��]>
	at junit.framework.Assert.assertEquals(Assert.java:81)
	at junit.framework.Assert.assertEquals(Assert.java:87)
	at org.joda.time.TestYearMonth_Basics.testToString_String(TestYearMonth_Basics.java:630)

testToString_String_Locale(org.joda.time.TestYearMonth_Basics)  Time elapsed: 0.001 sec  <<< FAILURE!
junit.framework.ComparisonFailure: expected:<� �/[6]> but was:<� �/[�]>
	at junit.framework.Assert.assertEquals(Assert.java:81)
	at junit.framework.Assert.assertEquals(Assert.java:87)
	at org.joda.time.TestYearMonth_Basics.testToString_String_Locale(TestYearMonth_Basics.java:636)

testToString_DTFormatter(org.joda.time.TestYearMonth_Basics)  Time elapsed: 0 sec  <<< FAILURE!
junit.framework.ComparisonFailure: expected:<2002-[06]> but was:<2002-[��]>
	at junit.framework.Assert.assertEquals(Assert.java:81)
	at junit.framework.Assert.assertEquals(Assert.java:87)
	at org.joda.time.TestYearMonth_Basics.testToString_DTFormatter(TestYearMonth_Basics.java:647)

testIsSupported(org.joda.time.TestYearMonth_Basics)  Time elapsed: 0.001 sec  <<< FAILURE!
junit.framework.AssertionFailedError: expected:<true> but was:<false>
	at junit.framework.Assert.fail(Assert.java:47)
	at junit.framework.Assert.failNotEquals(Assert.java:280)
	at junit.framework.Assert.assertEquals(Assert.java:64)
	at junit.framework.Assert.assertEquals(Assert.java:146)
	at junit.framework.Assert.assertEquals(Assert.java:152)
	at org.joda.time.TestYearMonth_Basics.testIsSupported(TestYearMonth_Basics.java:173)

testToString(org.joda.time.TestMonthDay_Basics)  Time elapsed: 0.001 sec  <<< FAILURE!
junit.framework.ComparisonFailure: expected:<--05-[06]> but was:<--05-[��]>
	at junit.framework.Assert.assertEquals(Assert.java:81)
	at junit.framework.Assert.assertEquals(Assert.java:87)
	at org.joda.time.TestMonthDay_Basics.testToString(TestMonthDay_Basics.java:789)

testToString_String(org.joda.time.TestMonthDay_Basics)  Time elapsed: 0.001 sec  <<< FAILURE!
junit.framework.ComparisonFailure: expected:<--05-[06]> but was:<--05-[��]>
	at junit.framework.Assert.assertEquals(Assert.java:81)
	at junit.framework.Assert.assertEquals(Assert.java:87)
	at org.joda.time.TestMonthDay_Basics.testToString_String(TestMonthDay_Basics.java:796)

testToString_String_Locale(org.joda.time.TestMonthDay_Basics)  Time elapsed: 0.001 sec  <<< FAILURE!
junit.framework.ComparisonFailure: expected:<� [6]/5> but was:<� [�]/5>
	at junit.framework.Assert.assertEquals(Assert.java:81)
	at junit.framework.Assert.assertEquals(Assert.java:87)
	at org.joda.time.TestMonthDay_Basics.testToString_String_Locale(TestMonthDay_Basics.java:802)

testToString_DTFormatter(org.joda.time.TestMonthDay_Basics)  Time elapsed: 0.002 sec  <<< FAILURE!
junit.framework.ComparisonFailure: expected:<--05-[06]> but was:<--05-[��]>
	at junit.framework.Assert.assertEquals(Assert.java:81)
	at junit.framework.Assert.assertEquals(Assert.java:87)
	at org.joda.time.TestMonthDay_Basics.testToString_DTFormatter(TestMonthDay_Basics.java:813)

testIsSupported(org.joda.time.TestMonthDay_Basics)  Time elapsed: 0.001 sec  <<< FAILURE!
junit.framework.AssertionFailedError: expected:<false> but was:<true>
	at junit.framework.Assert.fail(Assert.java:47)
	at junit.framework.Assert.failNotEquals(Assert.java:280)
	at junit.framework.Assert.assertEquals(Assert.java:64)
	at junit.framework.Assert.assertEquals(Assert.java:146)
	at junit.framework.Assert.assertEquals(Assert.java:152)
	at org.joda.time.TestMonthDay_Basics.testIsSupported(TestMonthDay_Basics.java:171)

testPropertyGetMaxMinValuesDayOfMonth(org.joda.time.TestMonthDay_Properties)  Time elapsed: 0.001 sec  <<< ERROR!
java.lang.IllegalArgumentException: Field 'year' is not supported
	at org.joda.time.base.AbstractPartial.indexOfSupported(AbstractPartial.java:45)
	at org.joda.time.base.AbstractPartial.get(AbstractPartial.java:38)
	at org.joda.time.chrono.BasicDayOfMonthDateTimeField.getMaximumValue(BasicDayOfMonthDateTimeField.java:71)
	at org.joda.time.field.AbstractPartialFieldProperty.getMaximumValue(AbstractPartialFieldProperty.java:230)
	at org.joda.time.TestMonthDay_Properties.testPropertyGetMaxMinValuesDayOfMonth(TestMonthDay_Properties.java:202)

testPropertyAddWrapFieldDayOfMonth(org.joda.time.TestMonthDay_Properties)  Time elapsed: 0.001 sec  <<< ERROR!
java.lang.IllegalArgumentException: Field 'year' is not supported
	at org.joda.time.base.AbstractPartial.indexOfSupported(AbstractPartial.java:45)
	at org.joda.time.base.AbstractPartial.get(AbstractPartial.java:38)
	at org.joda.time.chrono.BasicDayOfMonthDateTimeField.getMaximumValue(BasicDayOfMonthDateTimeField.java:71)
	at org.joda.time.field.BaseDateTimeField.addWrapField(BaseDateTimeField.java:496)
	at org.joda.time.MonthDay$Property.addWrapFieldToCopy(MonthDay.java:924)
	at org.joda.time.TestMonthDay_Properties.testPropertyAddWrapFieldDayOfMonth(TestMonthDay_Properties.java:224)

testToString_String(org.joda.time.TestPartial_Basics)  Time elapsed: 0.001 sec  <<< FAILURE!
junit.framework.ComparisonFailure: expected:<10:[20]> but was:<10:[��]>
	at junit.framework.Assert.assertEquals(Assert.java:81)
	at junit.framework.Assert.assertEquals(Assert.java:87)
	at org.joda.time.TestPartial_Basics.testToString_String(TestPartial_Basics.java:878)

testToString_String_Locale(org.joda.time.TestPartial_Basics)  Time elapsed: 0 sec  <<< FAILURE!
junit.framework.ComparisonFailure: expected:<10 [20]> but was:<10 [�]>
	at junit.framework.Assert.assertEquals(Assert.java:81)
	at junit.framework.Assert.assertEquals(Assert.java:87)
	at org.joda.time.TestPartial_Basics.testToString_String_Locale(TestPartial_Basics.java:884)

testToString_DTFormatter(org.joda.time.TestPartial_Basics)  Time elapsed: 0 sec  <<< FAILURE!
junit.framework.ComparisonFailure: expected:<10:[20]> but was:<10:[��]>
	at junit.framework.Assert.assertEquals(Assert.java:81)
	at junit.framework.Assert.assertEquals(Assert.java:87)
	at org.joda.time.TestPartial_Basics.testToString_DTFormatter(TestPartial_Basics.java:894)

testIsSupported(org.joda.time.TestPartial_Basics)  Time elapsed: 0.001 sec  <<< FAILURE!
junit.framework.AssertionFailedError: expected:<true> but was:<false>
	at junit.framework.Assert.fail(Assert.java:47)
	at junit.framework.Assert.failNotEquals(Assert.java:280)
	at junit.framework.Assert.assertEquals(Assert.java:64)
	at junit.framework.Assert.assertEquals(Assert.java:146)
	at junit.framework.Assert.assertEquals(Assert.java:152)
	at org.joda.time.TestPartial_Basics.testIsSupported(TestPartial_Basics.java:176)

testWith3a(org.joda.time.TestPartial_Basics)  Time elapsed: 0.001 sec  <<< FAILURE!
junit.framework.AssertionFailedError: expected:<true> but was:<false>
	at junit.framework.Assert.fail(Assert.java:47)
	at junit.framework.Assert.failNotEquals(Assert.java:280)
	at junit.framework.Assert.assertEquals(Assert.java:64)
	at junit.framework.Assert.assertEquals(Assert.java:146)
	at junit.framework.Assert.assertEquals(Assert.java:152)
	at org.joda.time.TestPartial_Basics.testWith3a(TestPartial_Basics.java:375)

testWith3b(org.joda.time.TestPartial_Basics)  Time elapsed: 0.001 sec  <<< FAILURE!
junit.framework.AssertionFailedError: expected:<true> but was:<false>
	at junit.framework.Assert.fail(Assert.java:47)
	at junit.framework.Assert.failNotEquals(Assert.java:280)
	at junit.framework.Assert.assertEquals(Assert.java:64)
	at junit.framework.Assert.assertEquals(Assert.java:146)
	at junit.framework.Assert.assertEquals(Assert.java:152)
	at org.joda.time.TestPartial_Basics.testWith3b(TestPartial_Basics.java:391)

testWith3c(org.joda.time.TestPartial_Basics)  Time elapsed: 0 sec  <<< FAILURE!
junit.framework.AssertionFailedError: expected:<true> but was:<false>
	at junit.framework.Assert.fail(Assert.java:47)
	at junit.framework.Assert.failNotEquals(Assert.java:280)
	at junit.framework.Assert.assertEquals(Assert.java:64)
	at junit.framework.Assert.assertEquals(Assert.java:146)
	at junit.framework.Assert.assertEquals(Assert.java:152)
	at org.joda.time.TestPartial_Basics.testWith3c(TestPartial_Basics.java:407)

testGetFormatter1(org.joda.time.TestPartial_Basics)  Time elapsed: 0.001 sec  <<< FAILURE!
junit.framework.ComparisonFailure: expected:<2005-[06]> but was:<2005-[��]>
	at junit.framework.Assert.assertEquals(Assert.java:81)
	at junit.framework.Assert.assertEquals(Assert.java:87)
	at org.joda.time.TestPartial_Basics.testGetFormatter1(TestPartial_Basics.java:804)

testWithout3(org.joda.time.TestPartial_Basics)  Time elapsed: 0 sec  <<< FAILURE!
junit.framework.AssertionFailedError: expected:<false> but was:<true>
	at junit.framework.Assert.fail(Assert.java:47)
	at junit.framework.Assert.failNotEquals(Assert.java:280)
	at junit.framework.Assert.assertEquals(Assert.java:64)
	at junit.framework.Assert.assertEquals(Assert.java:146)
	at junit.framework.Assert.assertEquals(Assert.java:152)
	at org.joda.time.TestPartial_Basics.testWithout3(TestPartial_Basics.java:495)

testWithout4(org.joda.time.TestPartial_Basics)  Time elapsed: 0 sec  <<< FAILURE!
junit.framework.AssertionFailedError: expected:<false> but was:<true>
	at junit.framework.Assert.fail(Assert.java:47)
	at junit.framework.Assert.failNotEquals(Assert.java:280)
	at junit.framework.Assert.assertEquals(Assert.java:64)
	at junit.framework.Assert.assertEquals(Assert.java:146)
	at junit.framework.Assert.assertEquals(Assert.java:152)
	at org.joda.time.TestPartial_Basics.testWithout4(TestPartial_Basics.java:506)

testWithout5(org.joda.time.TestPartial_Basics)  Time elapsed: 0 sec  <<< FAILURE!
junit.framework.AssertionFailedError: expected:<false> but was:<true>
	at junit.framework.Assert.fail(Assert.java:47)
	at junit.framework.Assert.failNotEquals(Assert.java:280)
	at junit.framework.Assert.assertEquals(Assert.java:64)
	at junit.framework.Assert.assertEquals(Assert.java:146)
	at junit.framework.Assert.assertEquals(Assert.java:152)
	at org.joda.time.TestPartial_Basics.testWithout5(TestPartial_Basics.java:514)

testToString1(org.joda.time.TestPartial_Basics)  Time elapsed: 0 sec  <<< FAILURE!
junit.framework.ComparisonFailure: expected:<10:[20]> but was:<10:[��]>
	at junit.framework.Assert.assertEquals(Assert.java:81)
	at junit.framework.Assert.assertEquals(Assert.java:87)
	at org.joda.time.TestPartial_Basics.testToString1(TestPartial_Basics.java:836)

testToString3(org.joda.time.TestPartial_Basics)  Time elapsed: 0 sec  <<< FAILURE!
junit.framework.ComparisonFailure: expected:<2005-[06]> but was:<2005-[��]>
	at junit.framework.Assert.assertEquals(Assert.java:81)
	at junit.framework.Assert.assertEquals(Assert.java:87)
	at org.joda.time.TestPartial_Basics.testToString3(TestPartial_Basics.java:849)

testConstructor_TypeArray_intArray(org.joda.time.TestPartial_Constructors)  Time elapsed: 0.001 sec  <<< FAILURE!
junit.framework.AssertionFailedError: expected:<true> but was:<false>
	at junit.framework.Assert.fail(Assert.java:47)
	at junit.framework.Assert.failNotEquals(Assert.java:280)
	at junit.framework.Assert.assertEquals(Assert.java:64)
	at junit.framework.Assert.assertEquals(Assert.java:146)
	at junit.framework.Assert.assertEquals(Assert.java:152)
	at org.joda.time.TestPartial_Constructors.testConstructor_TypeArray_intArray(TestPartial_Constructors.java:187)

testConstructor_TypeArray_intArray_year_weekyear(org.joda.time.TestPartial_Constructors)  Time elapsed: 0.001 sec  <<< FAILURE!
junit.framework.AssertionFailedError: expected:<true> but was:<false>
	at junit.framework.Assert.fail(Assert.java:47)
	at junit.framework.Assert.failNotEquals(Assert.java:280)
	at junit.framework.Assert.assertEquals(Assert.java:64)
	at junit.framework.Assert.assertEquals(Assert.java:146)
	at junit.framework.Assert.assertEquals(Assert.java:152)
	at org.joda.time.TestPartial_Constructors.testConstructor_TypeArray_intArray_year_weekyear(TestPartial_Constructors.java:209)

testConstructor_TypeArray_intArray_Chrono(org.joda.time.TestPartial_Constructors)  Time elapsed: 0 sec  <<< FAILURE!
junit.framework.AssertionFailedError: expected:<true> but was:<false>
	at junit.framework.Assert.fail(Assert.java:47)
	at junit.framework.Assert.failNotEquals(Assert.java:280)
	at junit.framework.Assert.assertEquals(Assert.java:64)
	at junit.framework.Assert.assertEquals(Assert.java:146)
	at junit.framework.Assert.assertEquals(Assert.java:152)
	at org.joda.time.TestPartial_Constructors.testConstructor_TypeArray_intArray_Chrono(TestPartial_Constructors.java:432)

testConstructor_Partial(org.joda.time.TestPartial_Constructors)  Time elapsed: 0.001 sec  <<< FAILURE!
junit.framework.AssertionFailedError: expected:<true> but was:<false>
	at junit.framework.Assert.fail(Assert.java:47)
	at junit.framework.Assert.failNotEquals(Assert.java:280)
	at junit.framework.Assert.assertEquals(Assert.java:64)
	at junit.framework.Assert.assertEquals(Assert.java:146)
	at junit.framework.Assert.assertEquals(Assert.java:152)
	at org.joda.time.TestPartial_Constructors.testConstructor_Partial(TestPartial_Constructors.java:452)

testYearMonth(org.joda.time.TestStringConvert)  Time elapsed: 0.001 sec  <<< FAILURE!
junit.framework.ComparisonFailure: expected:<2010-[06]> but was:<2010-[��]>
	at junit.framework.Assert.assertEquals(Assert.java:81)
	at junit.framework.Assert.assertEquals(Assert.java:87)
	at org.joda.time.TestStringConvert.testYearMonth(TestStringConvert.java:98)

testMonthDay(org.joda.time.TestStringConvert)  Time elapsed: 0.002 sec  <<< FAILURE!
junit.framework.ComparisonFailure: expected:<--06-[30]> but was:<--06-[��]>
	at junit.framework.Assert.assertEquals(Assert.java:81)
	at junit.framework.Assert.assertEquals(Assert.java:87)
	at org.joda.time.TestStringConvert.testMonthDay(TestStringConvert.java:105)

testMonthDay_leapDay(org.joda.time.TestStringConvert)  Time elapsed: 0.001 sec  <<< FAILURE!
junit.framework.ComparisonFailure: expected:<--02-[29]> but was:<--02-[��]>
	at junit.framework.Assert.assertEquals(Assert.java:81)
	at junit.framework.Assert.assertEquals(Assert.java:87)
	at org.joda.time.TestStringConvert.testMonthDay_leapDay(TestStringConvert.java:112)

testMaximumValue(org.joda.time.chrono.TestGregorianChronology)  Time elapsed: 0 sec  <<< FAILURE!
junit.framework.AssertionFailedError: expected:<28> but was:<31>
	at junit.framework.Assert.fail(Assert.java:47)
	at junit.framework.Assert.failNotEquals(Assert.java:280)
	at junit.framework.Assert.assertEquals(Assert.java:64)
	at junit.framework.Assert.assertEquals(Assert.java:198)
	at junit.framework.Assert.assertEquals(Assert.java:204)
	at org.joda.time.chrono.TestGregorianChronology.testMaximumValue(TestGregorianChronology.java:309)

testMaximumValue(org.joda.time.chrono.TestISOChronology)  Time elapsed: 0.001 sec  <<< FAILURE!
junit.framework.AssertionFailedError: expected:<28> but was:<31>
	at junit.framework.Assert.fail(Assert.java:47)
	at junit.framework.Assert.failNotEquals(Assert.java:280)
	at junit.framework.Assert.assertEquals(Assert.java:64)
	at junit.framework.Assert.assertEquals(Assert.java:198)
	at junit.framework.Assert.assertEquals(Assert.java:204)
	at org.joda.time.chrono.TestISOChronology.testMaximumValue(TestISOChronology.java:453)

testPrint_bufferMethods(org.joda.time.format.TestDateTimeFormatter)  Time elapsed: 0.001 sec  <<< FAILURE!
junit.framework.ComparisonFailure: expected:<2004-[06]-09> but was:<2004-[��]-09>
	at junit.framework.Assert.assertEquals(Assert.java:81)
	at junit.framework.Assert.assertEquals(Assert.java:87)
	at org.joda.time.format.TestDateTimeFormatter.testPrint_bufferMethods(TestDateTimeFormatter.java:172)

testPrint_writerMethods(org.joda.time.format.TestDateTimeFormatter)  Time elapsed: 0.024 sec  <<< FAILURE!
junit.framework.ComparisonFailure: expected:<2004-[06]-09> but was:<2004-[��]-09>
	at junit.framework.Assert.assertEquals(Assert.java:81)
	at junit.framework.Assert.assertEquals(Assert.java:87)
	at org.joda.time.format.TestDateTimeFormatter.testPrint_writerMethods(TestDateTimeFormatter.java:194)

testFormat_time_partial(org.joda.time.format.TestISODateTimeFormat)  Time elapsed: 0 sec  <<< FAILURE!
junit.framework.ComparisonFailure: expected:<10:[20]:30.040> but was:<10:[��]:30.040>
	at junit.framework.Assert.assertEquals(Assert.java:81)
	at junit.framework.Assert.assertEquals(Assert.java:87)
	at org.joda.time.format.TestISODateTimeFormat.testFormat_time_partial(TestISODateTimeFormat.java:130)

testFormat_timeNoMillis_partial(org.joda.time.format.TestISODateTimeFormat)  Time elapsed: 0.001 sec  <<< FAILURE!
junit.framework.ComparisonFailure: expected:<10:[20]:30> but was:<10:[��]:30>
	at junit.framework.Assert.assertEquals(Assert.java:81)
	at junit.framework.Assert.assertEquals(Assert.java:87)
	at org.joda.time.format.TestISODateTimeFormat.testFormat_timeNoMillis_partial(TestISODateTimeFormat.java:149)

testFormat_date_partial(org.joda.time.format.TestISODateTimeFormat)  Time elapsed: 0.001 sec  <<< FAILURE!
junit.framework.ComparisonFailure: expected:<2004-[06]-09> but was:<2004-[��]-09>
	at junit.framework.Assert.assertEquals(Assert.java:81)
	at junit.framework.Assert.assertEquals(Assert.java:87)
	at org.joda.time.format.TestISODateTimeFormat.testFormat_date_partial(TestISODateTimeFormat.java:111)

testForFields_weekBased_YW(org.joda.time.format.TestISODateTimeFormat_Fields)  Time elapsed: 0 sec  <<< FAILURE!
junit.framework.ComparisonFailure: expected:<2005-W[08]> but was:<2005-W[��]>
	at junit.framework.Assert.assertEquals(Assert.java:81)
	at junit.framework.Assert.assertEquals(Assert.java:87)
	at org.joda.time.format.TestISODateTimeFormat_Fields.testForFields_weekBased_YW(TestISODateTimeFormat_Fields.java:434)

testForFields_weekBased_WD(org.joda.time.format.TestISODateTimeFormat_Fields)  Time elapsed: 0.001 sec  <<< FAILURE!
junit.framework.ComparisonFailure: expected:<-W08-[5]> but was:<-W08-[�]>
	at junit.framework.Assert.assertEquals(Assert.java:81)
	at junit.framework.Assert.assertEquals(Assert.java:87)
	at org.joda.time.format.TestISODateTimeFormat_Fields.testForFields_weekBased_WD(TestISODateTimeFormat_Fields.java:462)

testForFields_weekBased_YD(org.joda.time.format.TestISODateTimeFormat_Fields)  Time elapsed: 0.001 sec  <<< FAILURE!
junit.framework.ComparisonFailure: expected:<2005-W-[5]> but was:<2005-W-[�]>
	at junit.framework.Assert.assertEquals(Assert.java:81)
	at junit.framework.Assert.assertEquals(Assert.java:87)
	at org.joda.time.format.TestISODateTimeFormat_Fields.testForFields_weekBased_YD(TestISODateTimeFormat_Fields.java:490)

testForFields_ordinalBased_YD(org.joda.time.format.TestISODateTimeFormat_Fields)  Time elapsed: 0.001 sec  <<< FAILURE!
junit.framework.ComparisonFailure: expected:<2005-[177]> but was:<2005-[���]>
	at junit.framework.Assert.assertEquals(Assert.java:81)
	at junit.framework.Assert.assertEquals(Assert.java:87)
	at org.joda.time.format.TestISODateTimeFormat_Fields.testForFields_ordinalBased_YD(TestISODateTimeFormat_Fields.java:522)

testForFields_time_HMSm(org.joda.time.format.TestISODateTimeFormat_Fields)  Time elapsed: 0.001 sec  <<< FAILURE!
junit.framework.ComparisonFailure: expected:<10:[20]:30.040> but was:<10:[��]:30.040>
	at junit.framework.Assert.assertEquals(Assert.java:81)
	at junit.framework.Assert.assertEquals(Assert.java:87)
	at org.joda.time.format.TestISODateTimeFormat_Fields.testForFields_time_HMSm(TestISODateTimeFormat_Fields.java:608)

testForFields_time_HMS(org.joda.time.format.TestISODateTimeFormat_Fields)  Time elapsed: 0.001 sec  <<< FAILURE!
junit.framework.ComparisonFailure: expected:<10:[20]:30> but was:<10:[��]:30>
	at junit.framework.Assert.assertEquals(Assert.java:81)
	at junit.framework.Assert.assertEquals(Assert.java:87)
	at org.joda.time.format.TestISODateTimeFormat_Fields.testForFields_time_HMS(TestISODateTimeFormat_Fields.java:637)

testForFields_time_HM(org.joda.time.format.TestISODateTimeFormat_Fields)  Time elapsed: 0 sec  <<< FAILURE!
junit.framework.ComparisonFailure: expected:<10:[20]> but was:<10:[��]>
	at junit.framework.Assert.assertEquals(Assert.java:81)
	at junit.framework.Assert.assertEquals(Assert.java:87)
	at org.joda.time.format.TestISODateTimeFormat_Fields.testForFields_time_HM(TestISODateTimeFormat_Fields.java:665)

testForFields_time_MSm(org.joda.time.format.TestISODateTimeFormat_Fields)  Time elapsed: 0.001 sec  <<< FAILURE!
junit.framework.ComparisonFailure: expected:<-20:[30].040> but was:<-20:[��].040>
	at junit.framework.Assert.assertEquals(Assert.java:81)
	at junit.framework.Assert.assertEquals(Assert.java:87)
	at org.joda.time.format.TestISODateTimeFormat_Fields.testForFields_time_MSm(TestISODateTimeFormat_Fields.java:721)

testForFields_time_MS(org.joda.time.format.TestISODateTimeFormat_Fields)  Time elapsed: 0 sec  <<< FAILURE!
junit.framework.ComparisonFailure: expected:<-20:[30]> but was:<-20:[��]>
	at junit.framework.Assert.assertEquals(Assert.java:81)
	at junit.framework.Assert.assertEquals(Assert.java:87)
	at org.joda.time.format.TestISODateTimeFormat_Fields.testForFields_time_MS(TestISODateTimeFormat_Fields.java:749)

testForFields_time_Sm(org.joda.time.format.TestISODateTimeFormat_Fields)  Time elapsed: 0.001 sec  <<< FAILURE!
junit.framework.ComparisonFailure: expected:<--30.[040]> but was:<--30.[���]>
	at junit.framework.Assert.assertEquals(Assert.java:81)
	at junit.framework.Assert.assertEquals(Assert.java:87)
	at org.joda.time.format.TestISODateTimeFormat_Fields.testForFields_time_Sm(TestISODateTimeFormat_Fields.java:804)

testForFields_time_Hm(org.joda.time.format.TestISODateTimeFormat_Fields)  Time elapsed: 0.014 sec  <<< FAILURE!
junit.framework.ComparisonFailure: expected:<10--.[040]> but was:<10--.[���]>
	at junit.framework.Assert.assertEquals(Assert.java:81)
	at junit.framework.Assert.assertEquals(Assert.java:87)
	at org.joda.time.format.TestISODateTimeFormat_Fields.testForFields_time_Hm(TestISODateTimeFormat_Fields.java:888)

testForFields_time_HS(org.joda.time.format.TestISODateTimeFormat_Fields)  Time elapsed: 0.001 sec  <<< FAILURE!
junit.framework.ComparisonFailure: expected:<10-[30]> but was:<10-[��]>
	at junit.framework.Assert.assertEquals(Assert.java:81)
	at junit.framework.Assert.assertEquals(Assert.java:87)
	at org.joda.time.format.TestISODateTimeFormat_Fields.testForFields_time_HS(TestISODateTimeFormat_Fields.java:918)

testForFields_time_Mm(org.joda.time.format.TestISODateTimeFormat_Fields)  Time elapsed: 0.001 sec  <<< FAILURE!
junit.framework.ComparisonFailure: expected:<-20-.[040]> but was:<-20-.[���]>
	at junit.framework.Assert.assertEquals(Assert.java:81)
	at junit.framework.Assert.assertEquals(Assert.java:87)
	at org.joda.time.format.TestISODateTimeFormat_Fields.testForFields_time_Mm(TestISODateTimeFormat_Fields.java:948)

testForFields_time_HSm(org.joda.time.format.TestISODateTimeFormat_Fields)  Time elapsed: 0.001 sec  <<< FAILURE!
junit.framework.ComparisonFailure: expected:<10-[30].040> but was:<10-[��].040>
	at junit.framework.Assert.assertEquals(Assert.java:81)
	at junit.framework.Assert.assertEquals(Assert.java:87)
	at org.joda.time.format.TestISODateTimeFormat_Fields.testForFields_time_HSm(TestISODateTimeFormat_Fields.java:979)

testForFields_time_HMm(org.joda.time.format.TestISODateTimeFormat_Fields)  Time elapsed: 0.001 sec  <<< FAILURE!
junit.framework.ComparisonFailure: expected:<10:[20]-.040> but was:<10:[��]-.040>
	at junit.framework.Assert.assertEquals(Assert.java:81)
	at junit.framework.Assert.assertEquals(Assert.java:87)
	at org.joda.time.format.TestISODateTimeFormat_Fields.testForFields_time_HMm(TestISODateTimeFormat_Fields.java:1010)

testForFields_datetime_YMDH(org.joda.time.format.TestISODateTimeFormat_Fields)  Time elapsed: 0.001 sec  <<< FAILURE!
junit.framework.ComparisonFailure: expected:<2005-[06]-25T12> but was:<2005-[��]-25T12>
	at junit.framework.Assert.assertEquals(Assert.java:81)
	at junit.framework.Assert.assertEquals(Assert.java:87)
	at org.joda.time.format.TestISODateTimeFormat_Fields.testForFields_datetime_YMDH(TestISODateTimeFormat_Fields.java:1044)

testForFields_datetime_DH(org.joda.time.format.TestISODateTimeFormat_Fields)  Time elapsed: 0.001 sec  <<< FAILURE!
junit.framework.ComparisonFailure: expected:<---25T[12]> but was:<---25T[��]>
	at junit.framework.Assert.assertEquals(Assert.java:81)
	at junit.framework.Assert.assertEquals(Assert.java:87)
	at org.joda.time.format.TestISODateTimeFormat_Fields.testForFields_datetime_DH(TestISODateTimeFormat_Fields.java:1072)

testForFields_datetime_YH(org.joda.time.format.TestISODateTimeFormat_Fields)  Time elapsed: 0.001 sec  <<< FAILURE!
junit.framework.ComparisonFailure: expected:<2005T[12]> but was:<2005T[��]>
	at junit.framework.Assert.assertEquals(Assert.java:81)
	at junit.framework.Assert.assertEquals(Assert.java:87)
	at org.joda.time.format.TestISODateTimeFormat_Fields.testForFields_datetime_YH(TestISODateTimeFormat_Fields.java:1100)

testForFields_datetime_DM(org.joda.time.format.TestISODateTimeFormat_Fields)  Time elapsed: 0.001 sec  <<< FAILURE!
junit.framework.ComparisonFailure: expected:<---25T-[20]> but was:<---25T-[��]>
	at junit.framework.Assert.assertEquals(Assert.java:81)
	at junit.framework.Assert.assertEquals(Assert.java:87)
	at org.joda.time.format.TestISODateTimeFormat_Fields.testForFields_datetime_DM(TestISODateTimeFormat_Fields.java:1130)

testForFields_calBased_YMD(org.joda.time.format.TestISODateTimeFormat_Fields)  Time elapsed: 0.006 sec  <<< FAILURE!
junit.framework.ComparisonFailure: expected:<2005-[06]-25> but was:<2005-[��]-25>
	at junit.framework.Assert.assertEquals(Assert.java:81)
	at junit.framework.Assert.assertEquals(Assert.java:87)
	at org.joda.time.format.TestISODateTimeFormat_Fields.testForFields_calBased_YMD(TestISODateTimeFormat_Fields.java:83)

testForFields_calBased_YMD_unmodifiable(org.joda.time.format.TestISODateTimeFormat_Fields)  Time elapsed: 0 sec  <<< FAILURE!
junit.framework.ComparisonFailure: expected:<2005-[06]-25> but was:<2005-[��]-25>
	at junit.framework.Assert.assertEquals(Assert.java:81)
	at junit.framework.Assert.assertEquals(Assert.java:87)
	at org.joda.time.format.TestISODateTimeFormat_Fields.testForFields_calBased_YMD_unmodifiable(TestISODateTimeFormat_Fields.java:112)

testForFields_calBased_YMD_duplicates(org.joda.time.format.TestISODateTimeFormat_Fields)  Time elapsed: 0 sec  <<< FAILURE!
junit.framework.ComparisonFailure: expected:<2005-[06]-25> but was:<2005-[��]-25>
	at junit.framework.Assert.assertEquals(Assert.java:81)
	at junit.framework.Assert.assertEquals(Assert.java:87)
	at org.joda.time.format.TestISODateTimeFormat_Fields.testForFields_calBased_YMD_duplicates(TestISODateTimeFormat_Fields.java:137)

testForFields_calBased_YM(org.joda.time.format.TestISODateTimeFormat_Fields)  Time elapsed: 0 sec  <<< FAILURE!
junit.framework.ComparisonFailure: expected:<2005-[06]> but was:<2005-[��]>
	at junit.framework.Assert.assertEquals(Assert.java:81)
	at junit.framework.Assert.assertEquals(Assert.java:87)
	at org.joda.time.format.TestISODateTimeFormat_Fields.testForFields_calBased_YM(TestISODateTimeFormat_Fields.java:236)

testForFields_calBased_MD(org.joda.time.format.TestISODateTimeFormat_Fields)  Time elapsed: 0.001 sec  <<< FAILURE!
junit.framework.ComparisonFailure: expected:<--06-[25]> but was:<--06-[��]>
	at junit.framework.Assert.assertEquals(Assert.java:81)
	at junit.framework.Assert.assertEquals(Assert.java:87)
	at org.joda.time.format.TestISODateTimeFormat_Fields.testForFields_calBased_MD(TestISODateTimeFormat_Fields.java:264)

testForFields_calBased_YD(org.joda.time.format.TestISODateTimeFormat_Fields)  Time elapsed: 0.001 sec  <<< FAILURE!
junit.framework.ComparisonFailure: expected:<2005--[25]> but was:<2005--[��]>
	at junit.framework.Assert.assertEquals(Assert.java:81)
	at junit.framework.Assert.assertEquals(Assert.java:87)
	at org.joda.time.format.TestISODateTimeFormat_Fields.testForFields_calBased_YD(TestISODateTimeFormat_Fields.java:292)

testForFields_weekBased_YWD(org.joda.time.format.TestISODateTimeFormat_Fields)  Time elapsed: 0.001 sec  <<< FAILURE!
junit.framework.ComparisonFailure: expected:<2005-W[08]-5> but was:<2005-W[��]-5>
	at junit.framework.Assert.assertEquals(Assert.java:81)
	at junit.framework.Assert.assertEquals(Assert.java:87)
	at org.joda.time.format.TestISODateTimeFormat_Fields.testForFields_weekBased_YWD(TestISODateTimeFormat_Fields.java:325)


Results :

Failed tests: 
  org.joda.time.TestMonthDay_Basics#testIsSupported AssertionFailedError expecte...
  org.joda.time.TestMonthDay_Basics#testToString ComparisonFailure expected:<--0...
  org.joda.time.TestMonthDay_Basics#testToString_DTFormatter ComparisonFailure e...
  org.joda.time.TestMonthDay_Basics#testToString_String ComparisonFailure expect...
  org.joda.time.TestMonthDay_Basics#testToString_String_Locale ComparisonFailure
  org.joda.time.TestPartial_Basics#testGetFormatter1 ComparisonFailure expected:...
  org.joda.time.TestPartial_Basics#testIsSupported AssertionFailedError expected...
  org.joda.time.TestPartial_Basics#testToString1 ComparisonFailure expected:<10:...
  org.joda.time.TestPartial_Basics#testToString3 ComparisonFailure expected:<200...
  org.joda.time.TestPartial_Basics#testToString_DTFormatter ComparisonFailure ex...
  org.joda.time.TestPartial_Basics#testToString_String ComparisonFailure expecte...
  org.joda.time.TestPartial_Basics#testToString_String_Locale ComparisonFailure ...
  org.joda.time.TestPartial_Basics#testWith3a AssertionFailedError expected:<tru...
  org.joda.time.TestPartial_Basics#testWith3b AssertionFailedError expected:<tru...
  org.joda.time.TestPartial_Basics#testWith3c AssertionFailedError expected:<tru...
  org.joda.time.TestPartial_Basics#testWithout3 AssertionFailedError expected:<f...
  org.joda.time.TestPartial_Basics#testWithout4 AssertionFailedError expected:<f...
  org.joda.time.TestPartial_Basics#testWithout5 AssertionFailedError expected:<f...
  org.joda.time.TestPartial_Constructors#testConstructor_Partial AssertionFailedError
  org.joda.time.TestPartial_Constructors#testConstructor_TypeArray_intArray AssertionFailedError
  org.joda.time.TestPartial_Constructors#testConstructor_TypeArray_intArray_Chrono AssertionFailedError
  org.joda.time.TestPartial_Constructors#testConstructor_TypeArray_intArray_year_weekyear AssertionFailedError
  org.joda.time.TestStringConvert#testMonthDay ComparisonFailure expected:<--06-...
  org.joda.time.TestStringConvert#testMonthDay_leapDay ComparisonFailure expecte...
  org.joda.time.TestStringConvert#testYearMonth ComparisonFailure expected:<2010...
  org.joda.time.TestTimeOfDay_Basics#testIsSupported AssertionFailedError expect...
  org.joda.time.TestTimeOfDay_Basics#testToString ComparisonFailure expected:<T1...
  org.joda.time.TestTimeOfDay_Basics#testToString_DTFormatter ComparisonFailure ...
  org.joda.time.TestTimeOfDay_Basics#testToString_String ComparisonFailure expec...
  org.joda.time.TestTimeOfDay_Basics#testToString_String_Locale ComparisonFailure
  org.joda.time.TestYearMonthDay_Basics#testIsSupported AssertionFailedError exp...
  org.joda.time.TestYearMonthDay_Basics#testToString ComparisonFailure expected:...
  org.joda.time.TestYearMonthDay_Basics#testToString_DTFormatter ComparisonFailure
  org.joda.time.TestYearMonthDay_Basics#testToString_String ComparisonFailure ex...
  org.joda.time.TestYearMonthDay_Basics#testToString_String_Locale ComparisonFailure
  org.joda.time.TestYearMonthDay_Properties#testPropertyGetMaxMinValuesDay AssertionFailedError
  org.joda.time.TestYearMonth_Basics#testIsSupported AssertionFailedError expect...
  org.joda.time.TestYearMonth_Basics#testToString ComparisonFailure expected:<20...
  org.joda.time.TestYearMonth_Basics#testToString_DTFormatter ComparisonFailure ...
  org.joda.time.TestYearMonth_Basics#testToString_String ComparisonFailure expec...
  org.joda.time.TestYearMonth_Basics#testToString_String_Locale ComparisonFailure
  org.joda.time.chrono.TestGregorianChronology#testMaximumValue AssertionFailedError
  org.joda.time.chrono.TestISOChronology#testMaximumValue AssertionFailedError e...
  org.joda.time.format.TestDateTimeFormatter#testPrint_bufferMethods ComparisonFailure
  org.joda.time.format.TestDateTimeFormatter#testPrint_writerMethods ComparisonFailure
  org.joda.time.format.TestISODateTimeFormat#testFormat_date_partial ComparisonFailure
  org.joda.time.format.TestISODateTimeFormat#testFormat_timeNoMillis_partial ComparisonFailure
  org.joda.time.format.TestISODateTimeFormat#testFormat_time_partial ComparisonFailure
  org.joda.time.format.TestISODateTimeFormat_Fields#testForFields_calBased_MD ComparisonFailure
  org.joda.time.format.TestISODateTimeFormat_Fields#testForFields_calBased_YD ComparisonFailure
  org.joda.time.format.TestISODateTimeFormat_Fields#testForFields_calBased_YM ComparisonFailure
  org.joda.time.format.TestISODateTimeFormat_Fields#testForFields_calBased_YMD ComparisonFailure
  org.joda.time.format.TestISODateTimeFormat_Fields#testForFields_calBased_YMD_duplicates ComparisonFailure
  org.joda.time.format.TestISODateTimeFormat_Fields#testForFields_calBased_YMD_unmodifiable ComparisonFailure
  org.joda.time.format.TestISODateTimeFormat_Fields#testForFields_datetime_DH ComparisonFailure
  org.joda.time.format.TestISODateTimeFormat_Fields#testForFields_datetime_DM ComparisonFailure
  org.joda.time.format.TestISODateTimeFormat_Fields#testForFields_datetime_YH ComparisonFailure
  org.joda.time.format.TestISODateTimeFormat_Fields#testForFields_datetime_YMDH ComparisonFailure
  org.joda.time.format.TestISODateTimeFormat_Fields#testForFields_ordinalBased_YD ComparisonFailure
  org.joda.time.format.TestISODateTimeFormat_Fields#testForFields_time_HM ComparisonFailure
  org.joda.time.format.TestISODateTimeFormat_Fields#testForFields_time_HMS ComparisonFailure
  org.joda.time.format.TestISODateTimeFormat_Fields#testForFields_time_HMSm ComparisonFailure
  org.joda.time.format.TestISODateTimeFormat_Fields#testForFields_time_HMm ComparisonFailure
  org.joda.time.format.TestISODateTimeFormat_Fields#testForFields_time_HS ComparisonFailure
  org.joda.time.format.TestISODateTimeFormat_Fields#testForFields_time_HSm ComparisonFailure
  org.joda.time.format.TestISODateTimeFormat_Fields#testForFields_time_Hm ComparisonFailure
  org.joda.time.format.TestISODateTimeFormat_Fields#testForFields_time_MS ComparisonFailure
  org.joda.time.format.TestISODateTimeFormat_Fields#testForFields_time_MSm ComparisonFailure
  org.joda.time.format.TestISODateTimeFormat_Fields#testForFields_time_Mm ComparisonFailure
  org.joda.time.format.TestISODateTimeFormat_Fields#testForFields_time_Sm ComparisonFailure
  org.joda.time.format.TestISODateTimeFormat_Fields#testForFields_weekBased_WD ComparisonFailure
  org.joda.time.format.TestISODateTimeFormat_Fields#testForFields_weekBased_YD ComparisonFailure
  org.joda.time.format.TestISODateTimeFormat_Fields#testForFields_weekBased_YW ComparisonFailure
  org.joda.time.format.TestISODateTimeFormat_Fields#testForFields_weekBased_YWD ComparisonFailure
Tests in error: 
  org.joda.time.TestMonthDay_Properties#testPropertyAddWrapFieldDayOfMonth IllegalArgumentException
  org.joda.time.TestMonthDay_Properties#testPropertyGetMaxMinValuesDayOfMonth IllegalArgumentException
  org.joda.time.TestYearMonthDay_Properties#testPropertyAddWrapFieldDay IllegalFieldValueException
  org.joda.time.TestYearMonthDay_Properties#testPropertyWithMaximumValueDayOfMonth IllegalFieldValueException

Tests run: 4157, Failures: 74, Errors: 4, Skipped: 0

[INFO] ------------------------------------------------------------------------
[INFO] BUILD FAILURE
[INFO] ------------------------------------------------------------------------
[INFO] Total time: 17.406s
[INFO] Finished at: Wed Aug 05 20:44:07 BST 2015
[INFO] Final Memory: 9M/214M
[INFO] ------------------------------------------------------------------------
[ERROR] Failed to execute goal org.apache.maven.plugins:maven-surefire-plugin:2.18.1:test (default-test) on project joda-time: There are test failures.
[ERROR] 
[ERROR] Please refer to /home/perham/Study/LittleDarwin/Cases/joda-time-2.8.1/target/surefire-reports for the individual test results.
[ERROR] -> [Help 1]
[ERROR] 
[ERROR] To see the full stack trace of the errors, re-run Maven with the -e switch.
[ERROR] Re-run Maven using the -X switch to enable full debug logging.
[ERROR] 
[ERROR] For more information about the errors and possible solutions, please read the following articles:
[ERROR] [Help 1] http://cwiki.apache.org/confluence/display/MAVEN/MojoFailureException
