[INFO] Scanning for projects...
[INFO]                                                                         
[INFO] ------------------------------------------------------------------------
[INFO] Building Joda-Time 2.8.1
[INFO] ------------------------------------------------------------------------
[INFO] 
[INFO] --- maven-resources-plugin:2.7:resources (default-resources) @ joda-time ---
[INFO] Using 'UTF-8' encoding to copy filtered resources.
[INFO] Copying 2 resources to META-INF
[INFO] Copying 10 resources
[INFO] 
[INFO] --- maven-compiler-plugin:3.3:compile (default-compile) @ joda-time ---
[INFO] Changes detected - recompiling the module!
[INFO] Compiling 166 source files to /home/perham/Study/LittleDarwin/Cases/joda-time-2.8.1/target/classes
[INFO] 
[INFO] --- exec-maven-plugin:1.4.0:java (compile-tzdb) @ joda-time ---
Writing zoneinfo files
Writing ZoneInfoMap
[INFO] 
[INFO] --- maven-resources-plugin:2.7:testResources (default-testResources) @ joda-time ---
[INFO] Using 'UTF-8' encoding to copy filtered resources.
[INFO] Copying 34 resources
[INFO] 
[INFO] --- maven-compiler-plugin:3.3:testCompile (default-testCompile) @ joda-time ---
[INFO] Nothing to compile - all classes are up to date
[INFO] 
[INFO] --- maven-surefire-plugin:2.18.1:test (default-test) @ joda-time ---
[INFO] Surefire report directory: /home/perham/Study/LittleDarwin/Cases/joda-time-2.8.1/target/surefire-reports

-------------------------------------------------------
 T E S T S
-------------------------------------------------------
Running org.joda.time.TestAllPackages

TestBuddhistChronology.testCalendar

TestCopticChronology.testCalendar

TestEthiopicChronology.testCalendar

TestIslamicChronology.testCalendar

Testing Gregorian chronology over 1000 iterations
100% complete (i=1000)

Testing Julian chronology over 1000 iterations
100% complete (i=1000)
Writing zoneinfo files
Writing ZoneInfoMap
Tests run: 4157, Failures: 46, Errors: 26, Skipped: 0, Time elapsed: 6.254 sec <<< FAILURE! - in org.joda.time.TestAllPackages
testCompareTo(org.joda.time.TestLocalDateTime_Basics)  Time elapsed: 0.004 sec  <<< ERROR!
java.lang.ArrayIndexOutOfBoundsException: 1
	at org.joda.time.Partial.getValue(Partial.java:393)
	at org.joda.time.Partial.with(Partial.java:499)
	at org.joda.time.TestLocalDateTime_Basics.testCompareTo(TestLocalDateTime_Basics.java:377)

testCompareTo(org.joda.time.TestLocalDate_Basics)  Time elapsed: 0.001 sec  <<< ERROR!
java.lang.ArrayIndexOutOfBoundsException: 1
	at org.joda.time.Partial.getValue(Partial.java:393)
	at org.joda.time.Partial.with(Partial.java:499)
	at org.joda.time.TestLocalDate_Basics.testCompareTo(TestLocalDate_Basics.java:363)

testConstructor_RP_RP7(org.joda.time.TestPeriod_Constructors)  Time elapsed: 0 sec  <<< ERROR!
java.lang.ArrayIndexOutOfBoundsException: 1
	at org.joda.time.Partial.getValue(Partial.java:393)
	at org.joda.time.Partial.with(Partial.java:499)
	at org.joda.time.TestPeriod_Constructors.testConstructor_RP_RP7(TestPeriod_Constructors.java:889)

testConstructor_RP_RP8(org.joda.time.TestPeriod_Constructors)  Time elapsed: 0 sec  <<< ERROR!
java.lang.ArrayIndexOutOfBoundsException: 1
	at org.joda.time.Partial.getValue(Partial.java:393)
	at org.joda.time.Partial.with(Partial.java:499)
	at org.joda.time.TestPeriod_Constructors.testConstructor_RP_RP8(TestPeriod_Constructors.java:898)

testConstructor_RP_RP_PeriodType7(org.joda.time.TestPeriod_Constructors)  Time elapsed: 0.001 sec  <<< ERROR!
java.lang.ArrayIndexOutOfBoundsException: 1
	at org.joda.time.Partial.getValue(Partial.java:393)
	at org.joda.time.Partial.with(Partial.java:499)
	at org.joda.time.TestPeriod_Constructors.testConstructor_RP_RP_PeriodType7(TestPeriod_Constructors.java:995)

testConstructor_RP_RP_PeriodType8(org.joda.time.TestPeriod_Constructors)  Time elapsed: 0.001 sec  <<< ERROR!
java.lang.ArrayIndexOutOfBoundsException: 1
	at org.joda.time.Partial.getValue(Partial.java:393)
	at org.joda.time.Partial.with(Partial.java:499)
	at org.joda.time.TestPeriod_Constructors.testConstructor_RP_RP_PeriodType8(TestPeriod_Constructors.java:1004)

testWithField2(org.joda.time.TestTimeOfDay_Basics)  Time elapsed: 0 sec  <<< FAILURE!
junit.framework.AssertionFailedError
	at junit.framework.Assert.fail(Assert.java:47)
	at junit.framework.Assert.fail(Assert.java:53)
	at org.joda.time.TestTimeOfDay_Basics.testWithField2(TestTimeOfDay_Basics.java:385)

testToString_String(org.joda.time.TestTimeOfDay_Basics)  Time elapsed: 0.003 sec  <<< FAILURE!
junit.framework.ComparisonFailure: expected:<[����] 10> but was:<[0020] 10>
	at junit.framework.Assert.assertEquals(Assert.java:81)
	at junit.framework.Assert.assertEquals(Assert.java:87)
	at org.joda.time.TestTimeOfDay_Basics.testToString_String(TestTimeOfDay_Basics.java:879)

testToString_DTFormatter(org.joda.time.TestTimeOfDay_Basics)  Time elapsed: 0 sec  <<< FAILURE!
junit.framework.ComparisonFailure: expected:<[����] 10> but was:<[0020] 10>
	at junit.framework.Assert.assertEquals(Assert.java:81)
	at junit.framework.Assert.assertEquals(Assert.java:87)
	at org.joda.time.TestTimeOfDay_Basics.testToString_DTFormatter(TestTimeOfDay_Basics.java:895)

testProperty(org.joda.time.TestTimeOfDay_Basics)  Time elapsed: 0.001 sec  <<< FAILURE!
junit.framework.AssertionFailedError
	at junit.framework.Assert.fail(Assert.java:47)
	at junit.framework.Assert.fail(Assert.java:53)
	at org.joda.time.TestTimeOfDay_Basics.testProperty(TestTimeOfDay_Basics.java:841)

testWithField3(org.joda.time.TestTimeOfDay_Basics)  Time elapsed: 0.001 sec  <<< FAILURE!
junit.framework.AssertionFailedError
	at junit.framework.Assert.fail(Assert.java:47)
	at junit.framework.Assert.fail(Assert.java:53)
	at org.joda.time.TestTimeOfDay_Basics.testWithField3(TestTimeOfDay_Basics.java:393)

testIsSupported(org.joda.time.TestTimeOfDay_Basics)  Time elapsed: 0 sec  <<< FAILURE!
junit.framework.AssertionFailedError: expected:<false> but was:<true>
	at junit.framework.Assert.fail(Assert.java:47)
	at junit.framework.Assert.failNotEquals(Assert.java:280)
	at junit.framework.Assert.assertEquals(Assert.java:64)
	at junit.framework.Assert.assertEquals(Assert.java:146)
	at junit.framework.Assert.assertEquals(Assert.java:152)
	at org.joda.time.TestTimeOfDay_Basics.testIsSupported(TestTimeOfDay_Basics.java:194)

testGet(org.joda.time.TestTimeOfDay_Basics)  Time elapsed: 0 sec  <<< FAILURE!
junit.framework.AssertionFailedError
	at junit.framework.Assert.fail(Assert.java:47)
	at junit.framework.Assert.fail(Assert.java:53)
	at org.joda.time.TestTimeOfDay_Basics.testGet(TestTimeOfDay_Basics.java:103)

testWithField2(org.joda.time.TestYearMonthDay_Basics)  Time elapsed: 0.001 sec  <<< FAILURE!
junit.framework.AssertionFailedError
	at junit.framework.Assert.fail(Assert.java:47)
	at junit.framework.Assert.fail(Assert.java:53)
	at org.joda.time.TestYearMonthDay_Basics.testWithField2(TestYearMonthDay_Basics.java:386)

testToString_String(org.joda.time.TestYearMonthDay_Basics)  Time elapsed: 0 sec  <<< FAILURE!
junit.framework.ComparisonFailure: expected:<2002 [��]> but was:<2002 [06]>
	at junit.framework.Assert.assertEquals(Assert.java:81)
	at junit.framework.Assert.assertEquals(Assert.java:87)
	at org.joda.time.TestYearMonthDay_Basics.testToString_String(TestYearMonthDay_Basics.java:805)

testToString_String_Locale(org.joda.time.TestYearMonthDay_Basics)  Time elapsed: 0.013 sec  <<< FAILURE!
junit.framework.ComparisonFailure: expected:<[�] 9/6> but was:<[Sat] 9/6>
	at junit.framework.Assert.assertEquals(Assert.java:81)
	at junit.framework.Assert.assertEquals(Assert.java:87)
	at org.joda.time.TestYearMonthDay_Basics.testToString_String_Locale(TestYearMonthDay_Basics.java:812)

testToString_DTFormatter(org.joda.time.TestYearMonthDay_Basics)  Time elapsed: 0 sec  <<< FAILURE!
junit.framework.ComparisonFailure: expected:<2002 [��]> but was:<2002 [06]>
	at junit.framework.Assert.assertEquals(Assert.java:81)
	at junit.framework.Assert.assertEquals(Assert.java:87)
	at org.joda.time.TestYearMonthDay_Basics.testToString_DTFormatter(TestYearMonthDay_Basics.java:822)

testCompareTo(org.joda.time.TestYearMonthDay_Basics)  Time elapsed: 0 sec  <<< ERROR!
java.lang.ArrayIndexOutOfBoundsException: 1
	at org.joda.time.Partial.getValue(Partial.java:393)
	at org.joda.time.Partial.with(Partial.java:499)
	at org.joda.time.TestYearMonthDay_Basics.testCompareTo(TestYearMonthDay_Basics.java:256)

testProperty(org.joda.time.TestYearMonthDay_Basics)  Time elapsed: 0.001 sec  <<< FAILURE!
junit.framework.AssertionFailedError
	at junit.framework.Assert.fail(Assert.java:47)
	at junit.framework.Assert.fail(Assert.java:53)
	at org.joda.time.TestYearMonthDay_Basics.testProperty(TestYearMonthDay_Basics.java:767)

testWithField3(org.joda.time.TestYearMonthDay_Basics)  Time elapsed: 0 sec  <<< FAILURE!
junit.framework.AssertionFailedError
	at junit.framework.Assert.fail(Assert.java:47)
	at junit.framework.Assert.fail(Assert.java:53)
	at org.joda.time.TestYearMonthDay_Basics.testWithField3(TestYearMonthDay_Basics.java:394)

testIsSupported(org.joda.time.TestYearMonthDay_Basics)  Time elapsed: 0.001 sec  <<< FAILURE!
junit.framework.AssertionFailedError: expected:<false> but was:<true>
	at junit.framework.Assert.fail(Assert.java:47)
	at junit.framework.Assert.failNotEquals(Assert.java:280)
	at junit.framework.Assert.assertEquals(Assert.java:64)
	at junit.framework.Assert.assertEquals(Assert.java:146)
	at junit.framework.Assert.assertEquals(Assert.java:152)
	at org.joda.time.TestYearMonthDay_Basics.testIsSupported(TestYearMonthDay_Basics.java:175)

testGet(org.joda.time.TestYearMonthDay_Basics)  Time elapsed: 0 sec  <<< FAILURE!
junit.framework.AssertionFailedError
	at junit.framework.Assert.fail(Assert.java:47)
	at junit.framework.Assert.fail(Assert.java:53)
	at org.joda.time.TestYearMonthDay_Basics.testGet(TestYearMonthDay_Basics.java:91)

testToString_String(org.joda.time.TestYearMonth_Basics)  Time elapsed: 0.001 sec  <<< FAILURE!
junit.framework.ComparisonFailure: expected:<2002 [��]> but was:<2002 [06]>
	at junit.framework.Assert.assertEquals(Assert.java:81)
	at junit.framework.Assert.assertEquals(Assert.java:87)
	at org.joda.time.TestYearMonth_Basics.testToString_String(TestYearMonth_Basics.java:629)

testToString_String_Locale(org.joda.time.TestYearMonth_Basics)  Time elapsed: 0 sec  <<< FAILURE!
junit.framework.ComparisonFailure: expected:<[� �]/6> but was:<[Sat 6]/6>
	at junit.framework.Assert.assertEquals(Assert.java:81)
	at junit.framework.Assert.assertEquals(Assert.java:87)
	at org.joda.time.TestYearMonth_Basics.testToString_String_Locale(TestYearMonth_Basics.java:636)

testToString_DTFormatter(org.joda.time.TestYearMonth_Basics)  Time elapsed: 0.001 sec  <<< FAILURE!
junit.framework.ComparisonFailure: expected:<2002 [��]> but was:<2002 [06]>
	at junit.framework.Assert.assertEquals(Assert.java:81)
	at junit.framework.Assert.assertEquals(Assert.java:87)
	at org.joda.time.TestYearMonth_Basics.testToString_DTFormatter(TestYearMonth_Basics.java:646)

testCompareTo(org.joda.time.TestYearMonth_Basics)  Time elapsed: 0.001 sec  <<< ERROR!
java.lang.ArrayIndexOutOfBoundsException: 1
	at org.joda.time.Partial.getValue(Partial.java:393)
	at org.joda.time.Partial.with(Partial.java:499)
	at org.joda.time.TestYearMonth_Basics.testCompareTo(TestYearMonth_Basics.java:250)

testProperty(org.joda.time.TestYearMonth_Basics)  Time elapsed: 0 sec  <<< FAILURE!
junit.framework.AssertionFailedError
	at junit.framework.Assert.fail(Assert.java:47)
	at junit.framework.Assert.fail(Assert.java:53)
	at org.joda.time.TestYearMonth_Basics.testProperty(TestYearMonth_Basics.java:591)

testWithField_unknownField(org.joda.time.TestYearMonth_Basics)  Time elapsed: 0 sec  <<< FAILURE!
junit.framework.AssertionFailedError
	at junit.framework.Assert.fail(Assert.java:47)
	at junit.framework.Assert.fail(Assert.java:53)
	at org.joda.time.TestYearMonth_Basics.testWithField_unknownField(TestYearMonth_Basics.java:388)

testWithField_nullField(org.joda.time.TestYearMonth_Basics)  Time elapsed: 0 sec  <<< FAILURE!
junit.framework.AssertionFailedError
	at junit.framework.Assert.fail(Assert.java:47)
	at junit.framework.Assert.fail(Assert.java:53)
	at org.joda.time.TestYearMonth_Basics.testWithField_nullField(TestYearMonth_Basics.java:380)

testIsSupported(org.joda.time.TestYearMonth_Basics)  Time elapsed: 0.001 sec  <<< FAILURE!
junit.framework.AssertionFailedError: expected:<false> but was:<true>
	at junit.framework.Assert.fail(Assert.java:47)
	at junit.framework.Assert.failNotEquals(Assert.java:280)
	at junit.framework.Assert.assertEquals(Assert.java:64)
	at junit.framework.Assert.assertEquals(Assert.java:146)
	at junit.framework.Assert.assertEquals(Assert.java:152)
	at org.joda.time.TestYearMonth_Basics.testIsSupported(TestYearMonth_Basics.java:174)

testGet(org.joda.time.TestYearMonth_Basics)  Time elapsed: 0.001 sec  <<< FAILURE!
junit.framework.AssertionFailedError
	at junit.framework.Assert.fail(Assert.java:47)
	at junit.framework.Assert.fail(Assert.java:53)
	at org.joda.time.TestYearMonth_Basics.testGet(TestYearMonth_Basics.java:94)

testToString_String(org.joda.time.TestMonthDay_Basics)  Time elapsed: 0.001 sec  <<< FAILURE!
junit.framework.ComparisonFailure: expected:<05 [��]> but was:<05 [06]>
	at junit.framework.Assert.assertEquals(Assert.java:81)
	at junit.framework.Assert.assertEquals(Assert.java:87)
	at org.joda.time.TestMonthDay_Basics.testToString_String(TestMonthDay_Basics.java:795)

testToString_String_Locale(org.joda.time.TestMonthDay_Basics)  Time elapsed: 0.001 sec  <<< FAILURE!
junit.framework.ComparisonFailure: expected:<[�] 6/5> but was:<[Sat] 6/5>
	at junit.framework.Assert.assertEquals(Assert.java:81)
	at junit.framework.Assert.assertEquals(Assert.java:87)
	at org.joda.time.TestMonthDay_Basics.testToString_String_Locale(TestMonthDay_Basics.java:802)

testToString_DTFormatter(org.joda.time.TestMonthDay_Basics)  Time elapsed: 0 sec  <<< FAILURE!
junit.framework.ComparisonFailure: expected:<05 [��]> but was:<05 [06]>
	at junit.framework.Assert.assertEquals(Assert.java:81)
	at junit.framework.Assert.assertEquals(Assert.java:87)
	at org.joda.time.TestMonthDay_Basics.testToString_DTFormatter(TestMonthDay_Basics.java:812)

testCompareTo(org.joda.time.TestMonthDay_Basics)  Time elapsed: 0.003 sec  <<< ERROR!
java.lang.ArrayIndexOutOfBoundsException: 1
	at org.joda.time.Partial.getValue(Partial.java:393)
	at org.joda.time.Partial.with(Partial.java:499)
	at org.joda.time.TestMonthDay_Basics.testCompareTo(TestMonthDay_Basics.java:255)

testProperty(org.joda.time.TestMonthDay_Basics)  Time elapsed: 0 sec  <<< FAILURE!
junit.framework.AssertionFailedError
	at junit.framework.Assert.fail(Assert.java:47)
	at junit.framework.Assert.fail(Assert.java:53)
	at org.joda.time.TestMonthDay_Basics.testProperty(TestMonthDay_Basics.java:757)

testWithField_unknownField(org.joda.time.TestMonthDay_Basics)  Time elapsed: 0.001 sec  <<< FAILURE!
junit.framework.AssertionFailedError
	at junit.framework.Assert.fail(Assert.java:47)
	at junit.framework.Assert.fail(Assert.java:53)
	at org.joda.time.TestMonthDay_Basics.testWithField_unknownField(TestMonthDay_Basics.java:383)

testWithField_nullField(org.joda.time.TestMonthDay_Basics)  Time elapsed: 0.001 sec  <<< FAILURE!
junit.framework.AssertionFailedError
	at junit.framework.Assert.fail(Assert.java:47)
	at junit.framework.Assert.fail(Assert.java:53)
	at org.joda.time.TestMonthDay_Basics.testWithField_nullField(TestMonthDay_Basics.java:375)

testIsSupported(org.joda.time.TestMonthDay_Basics)  Time elapsed: 0.001 sec  <<< FAILURE!
junit.framework.AssertionFailedError: expected:<false> but was:<true>
	at junit.framework.Assert.fail(Assert.java:47)
	at junit.framework.Assert.failNotEquals(Assert.java:280)
	at junit.framework.Assert.assertEquals(Assert.java:64)
	at junit.framework.Assert.assertEquals(Assert.java:146)
	at junit.framework.Assert.assertEquals(Assert.java:152)
	at org.joda.time.TestMonthDay_Basics.testIsSupported(TestMonthDay_Basics.java:171)

testGet(org.joda.time.TestMonthDay_Basics)  Time elapsed: 0 sec  <<< FAILURE!
junit.framework.AssertionFailedError
	at junit.framework.Assert.fail(Assert.java:47)
	at junit.framework.Assert.fail(Assert.java:53)
	at org.joda.time.TestMonthDay_Basics.testGet(TestMonthDay_Basics.java:92)

testWithField2(org.joda.time.TestPartial_Basics)  Time elapsed: 0 sec  <<< FAILURE!
junit.framework.AssertionFailedError
	at junit.framework.Assert.fail(Assert.java:47)
	at junit.framework.Assert.fail(Assert.java:53)
	at org.joda.time.TestPartial_Basics.testWithField2(TestPartial_Basics.java:529)

testToString_String(org.joda.time.TestPartial_Basics)  Time elapsed: 0.001 sec  <<< FAILURE!
junit.framework.ComparisonFailure: expected:<[����] 10> but was:<[0020] 10>
	at junit.framework.Assert.assertEquals(Assert.java:81)
	at junit.framework.Assert.assertEquals(Assert.java:87)
	at org.joda.time.TestPartial_Basics.testToString_String(TestPartial_Basics.java:877)

testToString_DTFormatter(org.joda.time.TestPartial_Basics)  Time elapsed: 0.001 sec  <<< FAILURE!
junit.framework.ComparisonFailure: expected:<[����] 10> but was:<[0020] 10>
	at junit.framework.Assert.assertEquals(Assert.java:81)
	at junit.framework.Assert.assertEquals(Assert.java:87)
	at org.joda.time.TestPartial_Basics.testToString_DTFormatter(TestPartial_Basics.java:893)

testProperty(org.joda.time.TestPartial_Basics)  Time elapsed: 0 sec  <<< FAILURE!
junit.framework.AssertionFailedError
	at junit.framework.Assert.fail(Assert.java:47)
	at junit.framework.Assert.fail(Assert.java:53)
	at org.joda.time.TestPartial_Basics.testProperty(TestPartial_Basics.java:769)

testWithField3(org.joda.time.TestPartial_Basics)  Time elapsed: 0.002 sec  <<< FAILURE!
junit.framework.AssertionFailedError
	at junit.framework.Assert.fail(Assert.java:47)
	at junit.framework.Assert.fail(Assert.java:53)
	at org.joda.time.TestPartial_Basics.testWithField3(TestPartial_Basics.java:538)

testIsSupported(org.joda.time.TestPartial_Basics)  Time elapsed: 0 sec  <<< FAILURE!
junit.framework.AssertionFailedError: expected:<false> but was:<true>
	at junit.framework.Assert.fail(Assert.java:47)
	at junit.framework.Assert.failNotEquals(Assert.java:280)
	at junit.framework.Assert.assertEquals(Assert.java:64)
	at junit.framework.Assert.assertEquals(Assert.java:146)
	at junit.framework.Assert.assertEquals(Assert.java:152)
	at org.joda.time.TestPartial_Basics.testIsSupported(TestPartial_Basics.java:177)

testGet(org.joda.time.TestPartial_Basics)  Time elapsed: 0.001 sec  <<< FAILURE!
junit.framework.AssertionFailedError
	at junit.framework.Assert.fail(Assert.java:47)
	at junit.framework.Assert.fail(Assert.java:53)
	at org.joda.time.TestPartial_Basics.testGet(TestPartial_Basics.java:97)

testWith3a(org.joda.time.TestPartial_Basics)  Time elapsed: 0.005 sec  <<< FAILURE!
junit.framework.AssertionFailedError: expected:<3> but was:<2>
	at junit.framework.Assert.fail(Assert.java:47)
	at junit.framework.Assert.failNotEquals(Assert.java:280)
	at junit.framework.Assert.assertEquals(Assert.java:64)
	at junit.framework.Assert.assertEquals(Assert.java:198)
	at junit.framework.Assert.assertEquals(Assert.java:204)
	at org.joda.time.TestPartial_Basics.testWith3a(TestPartial_Basics.java:373)

testWith3b(org.joda.time.TestPartial_Basics)  Time elapsed: 0 sec  <<< FAILURE!
junit.framework.AssertionFailedError: expected:<3> but was:<2>
	at junit.framework.Assert.fail(Assert.java:47)
	at junit.framework.Assert.failNotEquals(Assert.java:280)
	at junit.framework.Assert.assertEquals(Assert.java:64)
	at junit.framework.Assert.assertEquals(Assert.java:198)
	at junit.framework.Assert.assertEquals(Assert.java:204)
	at org.joda.time.TestPartial_Basics.testWith3b(TestPartial_Basics.java:389)

testWith3c(org.joda.time.TestPartial_Basics)  Time elapsed: 0 sec  <<< FAILURE!
junit.framework.AssertionFailedError: expected:<3> but was:<2>
	at junit.framework.Assert.fail(Assert.java:47)
	at junit.framework.Assert.failNotEquals(Assert.java:280)
	at junit.framework.Assert.assertEquals(Assert.java:64)
	at junit.framework.Assert.assertEquals(Assert.java:198)
	at junit.framework.Assert.assertEquals(Assert.java:204)
	at org.joda.time.TestPartial_Basics.testWith3c(TestPartial_Basics.java:405)

testWith3d(org.joda.time.TestPartial_Basics)  Time elapsed: 0 sec  <<< ERROR!
java.lang.ArrayIndexOutOfBoundsException: 1
	at org.joda.time.Partial.getValue(Partial.java:393)
	at org.joda.time.Partial.with(Partial.java:499)
	at org.joda.time.TestPartial_Basics.testWith3d(TestPartial_Basics.java:419)

testWith3e(org.joda.time.TestPartial_Basics)  Time elapsed: 0 sec  <<< ERROR!
java.lang.ArrayIndexOutOfBoundsException: 1
	at org.joda.time.Partial.getValue(Partial.java:393)
	at org.joda.time.Partial.with(Partial.java:499)
	at org.joda.time.TestPartial_Basics.testWith3e(TestPartial_Basics.java:427)

testWith3f(org.joda.time.TestPartial_Basics)  Time elapsed: 0.001 sec  <<< ERROR!
java.lang.ArrayIndexOutOfBoundsException: 1
	at org.joda.time.Partial.getValue(Partial.java:393)
	at org.joda.time.Partial.with(Partial.java:499)
	at org.joda.time.TestPartial_Basics.testWith3f(TestPartial_Basics.java:437)

testWith_baseHasNoRange(org.joda.time.TestPartial_Basics)  Time elapsed: 0 sec  <<< ERROR!
java.lang.ArrayIndexOutOfBoundsException: 1
	at org.joda.time.Partial.getValue(Partial.java:393)
	at org.joda.time.Partial.with(Partial.java:499)
	at org.joda.time.TestPartial_Basics.testWith_baseHasNoRange(TestPartial_Basics.java:453)

testWith_argHasNoRange(org.joda.time.TestPartial_Basics)  Time elapsed: 0.001 sec  <<< ERROR!
java.lang.ArrayIndexOutOfBoundsException: 1
	at org.joda.time.Partial.getValue(Partial.java:393)
	at org.joda.time.Partial.with(Partial.java:499)
	at org.joda.time.TestPartial_Basics.testWith_argHasNoRange(TestPartial_Basics.java:461)

testWith_baseAndArgHaveNoRange(org.joda.time.TestPartial_Basics)  Time elapsed: 0 sec  <<< ERROR!
java.lang.ArrayIndexOutOfBoundsException: 1
	at org.joda.time.Partial.getValue(Partial.java:393)
	at org.joda.time.Partial.with(Partial.java:499)
	at org.joda.time.TestPartial_Basics.testWith_baseAndArgHaveNoRange(TestPartial_Basics.java:469)

testWithout1(org.joda.time.TestPartial_Basics)  Time elapsed: 0.001 sec  <<< ERROR!
java.lang.ArrayIndexOutOfBoundsException: 1
	at org.joda.time.Partial.getValue(Partial.java:393)
	at org.joda.time.base.AbstractPartial.get(AbstractPartial.java:38)
	at org.joda.time.TestPartial_Basics.check(TestPartial_Basics.java:928)
	at org.joda.time.TestPartial_Basics.testWithout1(TestPartial_Basics.java:480)

testGetFormatter1(org.joda.time.TestPartial_Basics)  Time elapsed: 0.001 sec  <<< ERROR!
java.lang.ArrayIndexOutOfBoundsException: 1
	at org.joda.time.Partial.getValue(Partial.java:393)
	at org.joda.time.Partial.with(Partial.java:499)
	at org.joda.time.TestPartial_Basics.testGetFormatter1(TestPartial_Basics.java:803)

testGetFormatter2(org.joda.time.TestPartial_Basics)  Time elapsed: 0.001 sec  <<< ERROR!
java.lang.ArrayIndexOutOfBoundsException: 1
	at org.joda.time.Partial.getValue(Partial.java:393)
	at org.joda.time.Partial.with(Partial.java:499)
	at org.joda.time.TestPartial_Basics.testGetFormatter2(TestPartial_Basics.java:817)

testGetFormatter3(org.joda.time.TestPartial_Basics)  Time elapsed: 0 sec  <<< ERROR!
java.lang.ArrayIndexOutOfBoundsException: 1
	at org.joda.time.Partial.getValue(Partial.java:393)
	at org.joda.time.Partial.with(Partial.java:499)
	at org.joda.time.TestPartial_Basics.testGetFormatter3(TestPartial_Basics.java:829)

testToString3(org.joda.time.TestPartial_Basics)  Time elapsed: 0 sec  <<< ERROR!
java.lang.ArrayIndexOutOfBoundsException: 1
	at org.joda.time.Partial.getValue(Partial.java:393)
	at org.joda.time.Partial.with(Partial.java:499)
	at org.joda.time.TestPartial_Basics.testToString3(TestPartial_Basics.java:848)

testToString4(org.joda.time.TestPartial_Basics)  Time elapsed: 0.001 sec  <<< ERROR!
java.lang.ArrayIndexOutOfBoundsException: 1
	at org.joda.time.Partial.getValue(Partial.java:393)
	at org.joda.time.Partial.with(Partial.java:499)
	at org.joda.time.TestPartial_Basics.testToString4(TestPartial_Basics.java:862)

testToString5(org.joda.time.TestPartial_Basics)  Time elapsed: 0.001 sec  <<< ERROR!
java.lang.ArrayIndexOutOfBoundsException: 1
	at org.joda.time.Partial.getValue(Partial.java:393)
	at org.joda.time.Partial.with(Partial.java:499)
	at org.joda.time.TestPartial_Basics.testToString5(TestPartial_Basics.java:870)

testWithout2(org.joda.time.TestPartial_Basics)  Time elapsed: 0.001 sec  <<< ERROR!
java.lang.ArrayIndexOutOfBoundsException: 1
	at org.joda.time.Partial.getValue(Partial.java:393)
	at org.joda.time.base.AbstractPartial.get(AbstractPartial.java:38)
	at org.joda.time.TestPartial_Basics.check(TestPartial_Basics.java:928)
	at org.joda.time.TestPartial_Basics.testWithout2(TestPartial_Basics.java:487)

testWithout3(org.joda.time.TestPartial_Basics)  Time elapsed: 0.001 sec  <<< FAILURE!
junit.framework.AssertionFailedError: expected:<false> but was:<true>
	at junit.framework.Assert.fail(Assert.java:47)
	at junit.framework.Assert.failNotEquals(Assert.java:280)
	at junit.framework.Assert.assertEquals(Assert.java:64)
	at junit.framework.Assert.assertEquals(Assert.java:146)
	at junit.framework.Assert.assertEquals(Assert.java:152)
	at org.joda.time.TestPartial_Basics.testWithout3(TestPartial_Basics.java:495)

testWithout4(org.joda.time.TestPartial_Basics)  Time elapsed: 0 sec  <<< FAILURE!
junit.framework.AssertionFailedError: expected:<false> but was:<true>
	at junit.framework.Assert.fail(Assert.java:47)
	at junit.framework.Assert.failNotEquals(Assert.java:280)
	at junit.framework.Assert.assertEquals(Assert.java:64)
	at junit.framework.Assert.assertEquals(Assert.java:146)
	at junit.framework.Assert.assertEquals(Assert.java:152)
	at org.joda.time.TestPartial_Basics.testWithout4(TestPartial_Basics.java:506)

testWithout5(org.joda.time.TestPartial_Basics)  Time elapsed: 0.001 sec  <<< FAILURE!
junit.framework.AssertionFailedError: expected:<false> but was:<true>
	at junit.framework.Assert.fail(Assert.java:47)
	at junit.framework.Assert.failNotEquals(Assert.java:280)
	at junit.framework.Assert.assertEquals(Assert.java:64)
	at junit.framework.Assert.assertEquals(Assert.java:146)
	at junit.framework.Assert.assertEquals(Assert.java:152)
	at org.joda.time.TestPartial_Basics.testWithout5(TestPartial_Basics.java:514)

testWith3(org.joda.time.TestPartial_Basics)  Time elapsed: 0.001 sec  <<< FAILURE!
junit.framework.AssertionFailedError
	at junit.framework.Assert.fail(Assert.java:47)
	at junit.framework.Assert.fail(Assert.java:53)
	at org.joda.time.TestPartial_Basics.testWith3(TestPartial_Basics.java:364)

testIsContiguous_RP(org.joda.time.TestDateTimeUtils)  Time elapsed: 0.001 sec  <<< ERROR!
java.lang.ArrayIndexOutOfBoundsException: 1
	at org.joda.time.Partial.getValue(Partial.java:393)
	at org.joda.time.Partial.with(Partial.java:499)
	at org.joda.time.TestDateTimeUtils.testIsContiguous_RP(TestDateTimeUtils.java:438)

testIsContiguous_RP_GJChronology(org.joda.time.TestDateTimeUtils)  Time elapsed: 0.001 sec  <<< ERROR!
java.lang.ArrayIndexOutOfBoundsException: 1
	at org.joda.time.Partial.getValue(Partial.java:393)
	at org.joda.time.Partial.with(Partial.java:499)
	at org.joda.time.TestDateTimeUtils.testIsContiguous_RP_GJChronology(TestDateTimeUtils.java:462)

testPartialDayOfYearAdd(org.joda.time.chrono.TestISOChronology)  Time elapsed: 0.001 sec  <<< ERROR!
java.lang.ArrayIndexOutOfBoundsException: 1
	at org.joda.time.Partial.getValue(Partial.java:393)
	at org.joda.time.Partial.with(Partial.java:499)
	at org.joda.time.chrono.TestISOChronology.testPartialDayOfYearAdd(TestISOChronology.java:440)

testGetPartialValues(org.joda.time.convert.TestReadablePartialConverter)  Time elapsed: 0 sec  <<< FAILURE!
junit.framework.AssertionFailedError
	at junit.framework.Assert.fail(Assert.java:47)
	at junit.framework.Assert.fail(Assert.java:53)
	at org.joda.time.convert.TestReadablePartialConverter.testGetPartialValues(TestReadablePartialConverter.java:115)


Results :

Failed tests: 
  org.joda.time.TestMonthDay_Basics#testGet AssertionFailedError
  org.joda.time.TestMonthDay_Basics#testIsSupported AssertionFailedError expecte...
  org.joda.time.TestMonthDay_Basics#testProperty AssertionFailedError
  org.joda.time.TestMonthDay_Basics#testToString_DTFormatter ComparisonFailure e...
  org.joda.time.TestMonthDay_Basics#testToString_String ComparisonFailure expect...
  org.joda.time.TestMonthDay_Basics#testToString_String_Locale ComparisonFailure
  org.joda.time.TestMonthDay_Basics#testWithField_nullField AssertionFailedError
  org.joda.time.TestMonthDay_Basics#testWithField_unknownField AssertionFailedError
  org.joda.time.TestPartial_Basics#testGet AssertionFailedError
  org.joda.time.TestPartial_Basics#testIsSupported AssertionFailedError expected...
  org.joda.time.TestPartial_Basics#testProperty AssertionFailedError
  org.joda.time.TestPartial_Basics#testToString_DTFormatter ComparisonFailure ex...
  org.joda.time.TestPartial_Basics#testToString_String ComparisonFailure expecte...
  org.joda.time.TestPartial_Basics#testWith3 AssertionFailedError
  org.joda.time.TestPartial_Basics#testWith3a AssertionFailedError expected:<3> ...
  org.joda.time.TestPartial_Basics#testWith3b AssertionFailedError expected:<3> ...
  org.joda.time.TestPartial_Basics#testWith3c AssertionFailedError expected:<3> ...
  org.joda.time.TestPartial_Basics#testWithField2 AssertionFailedError
  org.joda.time.TestPartial_Basics#testWithField3 AssertionFailedError
  org.joda.time.TestPartial_Basics#testWithout3 AssertionFailedError expected:<f...
  org.joda.time.TestPartial_Basics#testWithout4 AssertionFailedError expected:<f...
  org.joda.time.TestPartial_Basics#testWithout5 AssertionFailedError expected:<f...
  org.joda.time.TestTimeOfDay_Basics#testGet AssertionFailedError
  org.joda.time.TestTimeOfDay_Basics#testIsSupported AssertionFailedError expect...
  org.joda.time.TestTimeOfDay_Basics#testProperty AssertionFailedError
  org.joda.time.TestTimeOfDay_Basics#testToString_DTFormatter ComparisonFailure ...
  org.joda.time.TestTimeOfDay_Basics#testToString_String ComparisonFailure expec...
  org.joda.time.TestTimeOfDay_Basics#testWithField2 AssertionFailedError
  org.joda.time.TestTimeOfDay_Basics#testWithField3 AssertionFailedError
  org.joda.time.TestYearMonthDay_Basics#testGet AssertionFailedError
  org.joda.time.TestYearMonthDay_Basics#testIsSupported AssertionFailedError exp...
  org.joda.time.TestYearMonthDay_Basics#testProperty AssertionFailedError
  org.joda.time.TestYearMonthDay_Basics#testToString_DTFormatter ComparisonFailure
  org.joda.time.TestYearMonthDay_Basics#testToString_String ComparisonFailure ex...
  org.joda.time.TestYearMonthDay_Basics#testToString_String_Locale ComparisonFailure
  org.joda.time.TestYearMonthDay_Basics#testWithField2 AssertionFailedError
  org.joda.time.TestYearMonthDay_Basics#testWithField3 AssertionFailedError
  org.joda.time.TestYearMonth_Basics#testGet AssertionFailedError
  org.joda.time.TestYearMonth_Basics#testIsSupported AssertionFailedError expect...
  org.joda.time.TestYearMonth_Basics#testProperty AssertionFailedError
  org.joda.time.TestYearMonth_Basics#testToString_DTFormatter ComparisonFailure ...
  org.joda.time.TestYearMonth_Basics#testToString_String ComparisonFailure expec...
  org.joda.time.TestYearMonth_Basics#testToString_String_Locale ComparisonFailure
  org.joda.time.TestYearMonth_Basics#testWithField_nullField AssertionFailedError
  org.joda.time.TestYearMonth_Basics#testWithField_unknownField AssertionFailedError
  org.joda.time.convert.TestReadablePartialConverter#testGetPartialValues AssertionFailedError
Tests in error: 
  org.joda.time.TestDateTimeUtils#testIsContiguous_RP ArrayIndexOutOfBoundsException
  org.joda.time.TestDateTimeUtils#testIsContiguous_RP_GJChronology ArrayIndexOutOfBoundsException
  org.joda.time.TestLocalDateTime_Basics#testCompareTo ArrayIndexOutOfBoundsException
  org.joda.time.TestLocalDate_Basics#testCompareTo ArrayIndexOutOfBoundsException
  org.joda.time.TestMonthDay_Basics#testCompareTo ArrayIndexOutOfBoundsException
  org.joda.time.TestPartial_Basics#testGetFormatter1 ArrayIndexOutOfBoundsException
  org.joda.time.TestPartial_Basics#testGetFormatter2 ArrayIndexOutOfBoundsException
  org.joda.time.TestPartial_Basics#testGetFormatter3 ArrayIndexOutOfBoundsException
  org.joda.time.TestPartial_Basics#testToString3 ArrayIndexOutOfBoundsException ...
  org.joda.time.TestPartial_Basics#testToString4 ArrayIndexOutOfBoundsException ...
  org.joda.time.TestPartial_Basics#testToString5 ArrayIndexOutOfBoundsException ...
  org.joda.time.TestPartial_Basics#testWith3d ArrayIndexOutOfBoundsException 1
  org.joda.time.TestPartial_Basics#testWith3e ArrayIndexOutOfBoundsException 1
  org.joda.time.TestPartial_Basics#testWith3f ArrayIndexOutOfBoundsException 1
  org.joda.time.TestPartial_Basics#testWith_argHasNoRange ArrayIndexOutOfBoundsException
  org.joda.time.TestPartial_Basics#testWith_baseAndArgHaveNoRange ArrayIndexOutOfBoundsException
  org.joda.time.TestPartial_Basics#testWith_baseHasNoRange ArrayIndexOutOfBoundsException
  org.joda.time.TestPartial_Basics#testWithout1 ArrayIndexOutOfBoundsException 1
  org.joda.time.TestPartial_Basics#testWithout2 ArrayIndexOutOfBoundsException 1
  org.joda.time.TestPeriod_Constructors#testConstructor_RP_RP7 ArrayIndexOutOfBoundsException
  org.joda.time.TestPeriod_Constructors#testConstructor_RP_RP8 ArrayIndexOutOfBoundsException
  org.joda.time.TestPeriod_Constructors#testConstructor_RP_RP_PeriodType7 ArrayIndexOutOfBoundsException
  org.joda.time.TestPeriod_Constructors#testConstructor_RP_RP_PeriodType8 ArrayIndexOutOfBoundsException
  org.joda.time.TestYearMonthDay_Basics#testCompareTo ArrayIndexOutOfBoundsException
  org.joda.time.TestYearMonth_Basics#testCompareTo ArrayIndexOutOfBoundsException
  org.joda.time.chrono.TestISOChronology#testPartialDayOfYearAdd ArrayIndexOutOfBoundsException

Tests run: 4157, Failures: 46, Errors: 26, Skipped: 0

[INFO] ------------------------------------------------------------------------
[INFO] BUILD FAILURE
[INFO] ------------------------------------------------------------------------
[INFO] Total time: 17.143s
[INFO] Finished at: Wed Aug 05 20:43:48 BST 2015
[INFO] Final Memory: 8M/209M
[INFO] ------------------------------------------------------------------------
[ERROR] Failed to execute goal org.apache.maven.plugins:maven-surefire-plugin:2.18.1:test (default-test) on project joda-time: There are test failures.
[ERROR] 
[ERROR] Please refer to /home/perham/Study/LittleDarwin/Cases/joda-time-2.8.1/target/surefire-reports for the individual test results.
[ERROR] -> [Help 1]
[ERROR] 
[ERROR] To see the full stack trace of the errors, re-run Maven with the -e switch.
[ERROR] Re-run Maven using the -X switch to enable full debug logging.
[ERROR] 
[ERROR] For more information about the errors and possible solutions, please read the following articles:
[ERROR] [Help 1] http://cwiki.apache.org/confluence/display/MAVEN/MojoFailureException
