[INFO] Scanning for projects...
[INFO]                                                                         
[INFO] ------------------------------------------------------------------------
[INFO] Building Joda-Time 2.8.1
[INFO] ------------------------------------------------------------------------
[INFO] 
[INFO] --- maven-resources-plugin:2.7:resources (default-resources) @ joda-time ---
[INFO] Using 'UTF-8' encoding to copy filtered resources.
[INFO] Copying 2 resources to META-INF
[INFO] Copying 10 resources
[INFO] 
[INFO] --- maven-compiler-plugin:3.3:compile (default-compile) @ joda-time ---
[INFO] Changes detected - recompiling the module!
[INFO] Compiling 166 source files to /home/perham/Study/LittleDarwin/Cases/joda-time-2.8.1/target/classes
[INFO] 
[INFO] --- exec-maven-plugin:1.4.0:java (compile-tzdb) @ joda-time ---
Writing zoneinfo files
Writing ZoneInfoMap
[INFO] 
[INFO] --- maven-resources-plugin:2.7:testResources (default-testResources) @ joda-time ---
[INFO] Using 'UTF-8' encoding to copy filtered resources.
[INFO] Copying 34 resources
[INFO] 
[INFO] --- maven-compiler-plugin:3.3:testCompile (default-testCompile) @ joda-time ---
[INFO] Nothing to compile - all classes are up to date
[INFO] 
[INFO] --- maven-surefire-plugin:2.18.1:test (default-test) @ joda-time ---
[INFO] Surefire report directory: /home/perham/Study/LittleDarwin/Cases/joda-time-2.8.1/target/surefire-reports

-------------------------------------------------------
 T E S T S
-------------------------------------------------------
Running org.joda.time.TestAllPackages

TestBuddhistChronology.testCalendar

TestCopticChronology.testCalendar

TestEthiopicChronology.testCalendar

TestIslamicChronology.testCalendar

Testing Gregorian chronology over 1000 iterations
100% complete (i=1000)

Testing Julian chronology over 1000 iterations
100% complete (i=1000)
Writing zoneinfo files
Writing ZoneInfoMap
Tests run: 4157, Failures: 56, Errors: 84, Skipped: 0, Time elapsed: 5.472 sec <<< FAILURE! - in org.joda.time.TestAllPackages
testConstructor_ObjectYearMonthDay(org.joda.time.TestLocalDate_Constructors)  Time elapsed: 0.005 sec  <<< ERROR!
java.lang.IllegalArgumentException: Field 'monthOfYear' is not supported
	at org.joda.time.base.AbstractPartial.indexOfSupported(AbstractPartial.java:45)
	at org.joda.time.base.AbstractPartial.get(AbstractPartial.java:38)
	at org.joda.time.convert.ReadablePartialConverter.getPartialValues(ReadablePartialConverter.java:91)
	at org.joda.time.convert.AbstractConverter.getPartialValues(AbstractConverter.java:123)
	at org.joda.time.LocalDate.<init>(LocalDate.java:419)
	at org.joda.time.LocalDate.<init>(LocalDate.java:363)
	at org.joda.time.TestLocalDate_Constructors.testConstructor_ObjectYearMonthDay(TestLocalDate_Constructors.java:434)

testConstructor_ObjectTimeOfDay(org.joda.time.TestLocalTime_Constructors)  Time elapsed: 0.002 sec  <<< ERROR!
java.lang.IllegalArgumentException: Field 'minuteOfHour' is not supported
	at org.joda.time.base.AbstractPartial.indexOfSupported(AbstractPartial.java:45)
	at org.joda.time.base.AbstractPartial.get(AbstractPartial.java:38)
	at org.joda.time.convert.ReadablePartialConverter.getPartialValues(ReadablePartialConverter.java:91)
	at org.joda.time.convert.AbstractConverter.getPartialValues(AbstractConverter.java:123)
	at org.joda.time.LocalTime.<init>(LocalTime.java:435)
	at org.joda.time.LocalTime.<init>(LocalTime.java:383)
	at org.joda.time.TestLocalTime_Constructors.testConstructor_ObjectTimeOfDay(TestLocalTime_Constructors.java:491)

testToString(org.joda.time.TestTimeOfDay_Basics)  Time elapsed: 0.002 sec  <<< FAILURE!
junit.framework.ComparisonFailure: expected:<T10:[20]:30.040> but was:<T10:[��]:30.040>
	at junit.framework.Assert.assertEquals(Assert.java:81)
	at junit.framework.Assert.assertEquals(Assert.java:87)
	at org.joda.time.TestTimeOfDay_Basics.testToString(TestTimeOfDay_Basics.java:873)

testToString_String(org.joda.time.TestTimeOfDay_Basics)  Time elapsed: 0 sec  <<< FAILURE!
junit.framework.ComparisonFailure: expected:<T10:[20]:30.040> but was:<T10:[��]:30.040>
	at junit.framework.Assert.assertEquals(Assert.java:81)
	at junit.framework.Assert.assertEquals(Assert.java:87)
	at org.joda.time.TestTimeOfDay_Basics.testToString_String(TestTimeOfDay_Basics.java:880)

testToString_String_Locale(org.joda.time.TestTimeOfDay_Basics)  Time elapsed: 0.003 sec  <<< FAILURE!
junit.framework.ComparisonFailure: expected:<10 [20]> but was:<10 [�]>
	at junit.framework.Assert.assertEquals(Assert.java:81)
	at junit.framework.Assert.assertEquals(Assert.java:87)
	at org.joda.time.TestTimeOfDay_Basics.testToString_String_Locale(TestTimeOfDay_Basics.java:886)

testToString_DTFormatter(org.joda.time.TestTimeOfDay_Basics)  Time elapsed: 0 sec  <<< FAILURE!
junit.framework.ComparisonFailure: expected:<T10:[20]:30.040> but was:<T10:[��]:30.040>
	at junit.framework.Assert.assertEquals(Assert.java:81)
	at junit.framework.Assert.assertEquals(Assert.java:87)
	at org.joda.time.TestTimeOfDay_Basics.testToString_DTFormatter(TestTimeOfDay_Basics.java:896)

testWithField2(org.joda.time.TestTimeOfDay_Basics)  Time elapsed: 0.001 sec  <<< ERROR!
java.lang.ArrayIndexOutOfBoundsException: -1
	at org.joda.time.base.BasePartial.getValue(BasePartial.java:225)
	at org.joda.time.TimeOfDay.withField(TimeOfDay.java:525)
	at org.joda.time.TestTimeOfDay_Basics.testWithField2(TestTimeOfDay_Basics.java:384)

testProperty(org.joda.time.TestTimeOfDay_Basics)  Time elapsed: 0 sec  <<< ERROR!
java.lang.IllegalArgumentException: Field 'minuteOfHour' is not supported
	at org.joda.time.base.AbstractPartial.indexOfSupported(AbstractPartial.java:45)
	at org.joda.time.TimeOfDay.property(TimeOfDay.java:805)
	at org.joda.time.TestTimeOfDay_Basics.testProperty(TestTimeOfDay_Basics.java:836)

testWithField3(org.joda.time.TestTimeOfDay_Basics)  Time elapsed: 0 sec  <<< ERROR!
java.lang.ArrayIndexOutOfBoundsException: -1
	at org.joda.time.base.BasePartial.getValue(BasePartial.java:225)
	at org.joda.time.TimeOfDay.withField(TimeOfDay.java:525)
	at org.joda.time.TestTimeOfDay_Basics.testWithField3(TestTimeOfDay_Basics.java:392)

testGet(org.joda.time.TestTimeOfDay_Basics)  Time elapsed: 0 sec  <<< ERROR!
java.lang.IllegalArgumentException: Field 'minuteOfHour' is not supported
	at org.joda.time.base.AbstractPartial.indexOfSupported(AbstractPartial.java:45)
	at org.joda.time.base.AbstractPartial.get(AbstractPartial.java:38)
	at org.joda.time.TestTimeOfDay_Basics.testGet(TestTimeOfDay_Basics.java:98)

testConstructor_todObject(org.joda.time.TestTimeOfDay_Constructors)  Time elapsed: 0 sec  <<< ERROR!
java.lang.IllegalArgumentException: Field 'minuteOfHour' is not supported
	at org.joda.time.base.AbstractPartial.indexOfSupported(AbstractPartial.java:45)
	at org.joda.time.base.AbstractPartial.get(AbstractPartial.java:38)
	at org.joda.time.convert.ReadablePartialConverter.getPartialValues(ReadablePartialConverter.java:91)
	at org.joda.time.convert.AbstractConverter.getPartialValues(AbstractConverter.java:123)
	at org.joda.time.base.BasePartial.<init>(BasePartial.java:163)
	at org.joda.time.TimeOfDay.<init>(TimeOfDay.java:277)
	at org.joda.time.TestTimeOfDay_Constructors.testConstructor_todObject(TestTimeOfDay_Constructors.java:356)

testPropertyCompareToMinute(org.joda.time.TestTimeOfDay_Properties)  Time elapsed: 0 sec  <<< ERROR!
java.lang.IllegalArgumentException: Field 'minuteOfHour' is not supported
	at org.joda.time.base.AbstractPartial.indexOfSupported(AbstractPartial.java:45)
	at org.joda.time.base.AbstractPartial.get(AbstractPartial.java:38)
	at org.joda.time.field.AbstractPartialFieldProperty.compareTo(AbstractPartialFieldProperty.java:304)
	at org.joda.time.TestTimeOfDay_Properties.testPropertyCompareToMinute(TestTimeOfDay_Properties.java:384)

testToString(org.joda.time.TestYearMonthDay_Basics)  Time elapsed: 0.001 sec  <<< FAILURE!
junit.framework.ComparisonFailure: expected:<2002-[06]-09> but was:<2002-[��]-09>
	at junit.framework.Assert.assertEquals(Assert.java:81)
	at junit.framework.Assert.assertEquals(Assert.java:87)
	at org.joda.time.TestYearMonthDay_Basics.testToString(TestYearMonthDay_Basics.java:799)

testToString_String(org.joda.time.TestYearMonthDay_Basics)  Time elapsed: 0.009 sec  <<< FAILURE!
junit.framework.ComparisonFailure: expected:<2002-[06]-09> but was:<2002-[��]-09>
	at junit.framework.Assert.assertEquals(Assert.java:81)
	at junit.framework.Assert.assertEquals(Assert.java:87)
	at org.joda.time.TestYearMonthDay_Basics.testToString_String(TestYearMonthDay_Basics.java:806)

testToString_String_Locale(org.joda.time.TestYearMonthDay_Basics)  Time elapsed: 0 sec  <<< FAILURE!
junit.framework.ComparisonFailure: expected:<� 9/[6]> but was:<� 9/[�]>
	at junit.framework.Assert.assertEquals(Assert.java:81)
	at junit.framework.Assert.assertEquals(Assert.java:87)
	at org.joda.time.TestYearMonthDay_Basics.testToString_String_Locale(TestYearMonthDay_Basics.java:812)

testToString_DTFormatter(org.joda.time.TestYearMonthDay_Basics)  Time elapsed: 0.001 sec  <<< FAILURE!
junit.framework.ComparisonFailure: expected:<2002-[06]-09> but was:<2002-[��]-09>
	at junit.framework.Assert.assertEquals(Assert.java:81)
	at junit.framework.Assert.assertEquals(Assert.java:87)
	at org.joda.time.TestYearMonthDay_Basics.testToString_DTFormatter(TestYearMonthDay_Basics.java:823)

testWithField2(org.joda.time.TestYearMonthDay_Basics)  Time elapsed: 0.001 sec  <<< ERROR!
java.lang.ArrayIndexOutOfBoundsException: -1
	at org.joda.time.base.BasePartial.getValue(BasePartial.java:225)
	at org.joda.time.YearMonthDay.withField(YearMonthDay.java:412)
	at org.joda.time.TestYearMonthDay_Basics.testWithField2(TestYearMonthDay_Basics.java:385)

testProperty(org.joda.time.TestYearMonthDay_Basics)  Time elapsed: 0 sec  <<< ERROR!
java.lang.IllegalArgumentException: Field 'monthOfYear' is not supported
	at org.joda.time.base.AbstractPartial.indexOfSupported(AbstractPartial.java:45)
	at org.joda.time.YearMonthDay.property(YearMonthDay.java:648)
	at org.joda.time.TestYearMonthDay_Basics.testProperty(TestYearMonthDay_Basics.java:763)

testWithField3(org.joda.time.TestYearMonthDay_Basics)  Time elapsed: 0 sec  <<< ERROR!
java.lang.ArrayIndexOutOfBoundsException: -1
	at org.joda.time.base.BasePartial.getValue(BasePartial.java:225)
	at org.joda.time.YearMonthDay.withField(YearMonthDay.java:412)
	at org.joda.time.TestYearMonthDay_Basics.testWithField3(TestYearMonthDay_Basics.java:393)

testGet(org.joda.time.TestYearMonthDay_Basics)  Time elapsed: 0 sec  <<< ERROR!
java.lang.IllegalArgumentException: Field 'monthOfYear' is not supported
	at org.joda.time.base.AbstractPartial.indexOfSupported(AbstractPartial.java:45)
	at org.joda.time.base.AbstractPartial.get(AbstractPartial.java:38)
	at org.joda.time.TestYearMonthDay_Basics.testGet(TestYearMonthDay_Basics.java:87)

testPropertyCompareToMonth(org.joda.time.TestYearMonthDay_Properties)  Time elapsed: 0.001 sec  <<< ERROR!
java.lang.IllegalArgumentException: Field 'monthOfYear' is not supported
	at org.joda.time.base.AbstractPartial.indexOfSupported(AbstractPartial.java:45)
	at org.joda.time.base.AbstractPartial.get(AbstractPartial.java:38)
	at org.joda.time.field.AbstractPartialFieldProperty.compareTo(AbstractPartialFieldProperty.java:304)
	at org.joda.time.TestYearMonthDay_Properties.testPropertyCompareToMonth(TestYearMonthDay_Properties.java:320)

testPropertyGetMaxMinValuesDay(org.joda.time.TestYearMonthDay_Properties)  Time elapsed: 0.001 sec  <<< ERROR!
java.lang.IllegalArgumentException: Field 'monthOfYear' is not supported
	at org.joda.time.base.AbstractPartial.indexOfSupported(AbstractPartial.java:45)
	at org.joda.time.base.AbstractPartial.get(AbstractPartial.java:38)
	at org.joda.time.chrono.BasicDayOfMonthDateTimeField.getMaximumValue(BasicDayOfMonthDateTimeField.java:69)
	at org.joda.time.field.AbstractPartialFieldProperty.getMaximumValue(AbstractPartialFieldProperty.java:230)
	at org.joda.time.TestYearMonthDay_Properties.testPropertyGetMaxMinValuesDay(TestYearMonthDay_Properties.java:363)

testPropertyAddWrapFieldDay(org.joda.time.TestYearMonthDay_Properties)  Time elapsed: 0.001 sec  <<< ERROR!
java.lang.IllegalArgumentException: Field 'monthOfYear' is not supported
	at org.joda.time.base.AbstractPartial.indexOfSupported(AbstractPartial.java:45)
	at org.joda.time.base.AbstractPartial.get(AbstractPartial.java:38)
	at org.joda.time.chrono.BasicDayOfMonthDateTimeField.getMaximumValue(BasicDayOfMonthDateTimeField.java:69)
	at org.joda.time.field.BaseDateTimeField.addWrapField(BaseDateTimeField.java:496)
	at org.joda.time.YearMonthDay$Property.addWrapFieldToCopy(YearMonthDay.java:1035)
	at org.joda.time.TestYearMonthDay_Properties.testPropertyAddWrapFieldDay(TestYearMonthDay_Properties.java:412)

testPropertyWithMaximumValueDayOfMonth(org.joda.time.TestYearMonthDay_Properties)  Time elapsed: 0 sec  <<< ERROR!
java.lang.IllegalArgumentException: Field 'monthOfYear' is not supported
	at org.joda.time.base.AbstractPartial.indexOfSupported(AbstractPartial.java:45)
	at org.joda.time.base.AbstractPartial.get(AbstractPartial.java:38)
	at org.joda.time.chrono.BasicDayOfMonthDateTimeField.getMaximumValue(BasicDayOfMonthDateTimeField.java:69)
	at org.joda.time.field.AbstractPartialFieldProperty.getMaximumValue(AbstractPartialFieldProperty.java:230)
	at org.joda.time.YearMonthDay$Property.withMaximumValue(YearMonthDay.java:1104)
	at org.joda.time.TestYearMonthDay_Properties.testPropertyWithMaximumValueDayOfMonth(TestYearMonthDay_Properties.java:461)

testToString(org.joda.time.TestYearMonth_Basics)  Time elapsed: 0.001 sec  <<< FAILURE!
junit.framework.ComparisonFailure: expected:<2002-[06]> but was:<2002-[��]>
	at junit.framework.Assert.assertEquals(Assert.java:81)
	at junit.framework.Assert.assertEquals(Assert.java:87)
	at org.joda.time.TestYearMonth_Basics.testToString(TestYearMonth_Basics.java:623)

testToString_String(org.joda.time.TestYearMonth_Basics)  Time elapsed: 0.001 sec  <<< FAILURE!
junit.framework.ComparisonFailure: expected:<2002-[06]> but was:<2002-[��]>
	at junit.framework.Assert.assertEquals(Assert.java:81)
	at junit.framework.Assert.assertEquals(Assert.java:87)
	at org.joda.time.TestYearMonth_Basics.testToString_String(TestYearMonth_Basics.java:630)

testToString_String_Locale(org.joda.time.TestYearMonth_Basics)  Time elapsed: 0.001 sec  <<< FAILURE!
junit.framework.ComparisonFailure: expected:<� �/[6]> but was:<� �/[�]>
	at junit.framework.Assert.assertEquals(Assert.java:81)
	at junit.framework.Assert.assertEquals(Assert.java:87)
	at org.joda.time.TestYearMonth_Basics.testToString_String_Locale(TestYearMonth_Basics.java:636)

testToString_DTFormatter(org.joda.time.TestYearMonth_Basics)  Time elapsed: 0.001 sec  <<< FAILURE!
junit.framework.ComparisonFailure: expected:<2002-[06]> but was:<2002-[��]>
	at junit.framework.Assert.assertEquals(Assert.java:81)
	at junit.framework.Assert.assertEquals(Assert.java:87)
	at org.joda.time.TestYearMonth_Basics.testToString_DTFormatter(TestYearMonth_Basics.java:647)

testProperty(org.joda.time.TestYearMonth_Basics)  Time elapsed: 0.002 sec  <<< ERROR!
java.lang.IllegalArgumentException: Field 'monthOfYear' is not supported
	at org.joda.time.base.AbstractPartial.indexOfSupported(AbstractPartial.java:45)
	at org.joda.time.YearMonth.property(YearMonth.java:767)
	at org.joda.time.TestYearMonth_Basics.testProperty(TestYearMonth_Basics.java:588)

testWithField_nullField(org.joda.time.TestYearMonth_Basics)  Time elapsed: 0 sec  <<< ERROR!
java.lang.ArrayIndexOutOfBoundsException: -1
	at org.joda.time.base.BasePartial.getValue(BasePartial.java:225)
	at org.joda.time.YearMonth.withField(YearMonth.java:479)
	at org.joda.time.TestYearMonth_Basics.testWithField_nullField(TestYearMonth_Basics.java:379)

testWithField_unknownField(org.joda.time.TestYearMonth_Basics)  Time elapsed: 0 sec  <<< ERROR!
java.lang.ArrayIndexOutOfBoundsException: -1
	at org.joda.time.base.BasePartial.getValue(BasePartial.java:225)
	at org.joda.time.YearMonth.withField(YearMonth.java:479)
	at org.joda.time.TestYearMonth_Basics.testWithField_unknownField(TestYearMonth_Basics.java:387)

testGet(org.joda.time.TestYearMonth_Basics)  Time elapsed: 0 sec  <<< ERROR!
java.lang.IllegalArgumentException: Field 'monthOfYear' is not supported
	at org.joda.time.base.AbstractPartial.indexOfSupported(AbstractPartial.java:45)
	at org.joda.time.base.AbstractPartial.get(AbstractPartial.java:38)
	at org.joda.time.TestYearMonth_Basics.testGet(TestYearMonth_Basics.java:91)

testPropertyCompareToMonth(org.joda.time.TestYearMonth_Properties)  Time elapsed: 0.002 sec  <<< ERROR!
java.lang.IllegalArgumentException: Field 'monthOfYear' is not supported
	at org.joda.time.base.AbstractPartial.indexOfSupported(AbstractPartial.java:45)
	at org.joda.time.base.AbstractPartial.get(AbstractPartial.java:38)
	at org.joda.time.field.AbstractPartialFieldProperty.compareTo(AbstractPartialFieldProperty.java:304)
	at org.joda.time.TestYearMonth_Properties.testPropertyCompareToMonth(TestYearMonth_Properties.java:287)

testToString(org.joda.time.TestMonthDay_Basics)  Time elapsed: 0.002 sec  <<< FAILURE!
junit.framework.ComparisonFailure: expected:<--05-[06]> but was:<--05-[��]>
	at junit.framework.Assert.assertEquals(Assert.java:81)
	at junit.framework.Assert.assertEquals(Assert.java:87)
	at org.joda.time.TestMonthDay_Basics.testToString(TestMonthDay_Basics.java:789)

testToString_String(org.joda.time.TestMonthDay_Basics)  Time elapsed: 0.001 sec  <<< FAILURE!
junit.framework.ComparisonFailure: expected:<--05-[06]> but was:<--05-[��]>
	at junit.framework.Assert.assertEquals(Assert.java:81)
	at junit.framework.Assert.assertEquals(Assert.java:87)
	at org.joda.time.TestMonthDay_Basics.testToString_String(TestMonthDay_Basics.java:796)

testToString_String_Locale(org.joda.time.TestMonthDay_Basics)  Time elapsed: 0.001 sec  <<< FAILURE!
junit.framework.ComparisonFailure: expected:<� [6]/5> but was:<� [�]/5>
	at junit.framework.Assert.assertEquals(Assert.java:81)
	at junit.framework.Assert.assertEquals(Assert.java:87)
	at org.joda.time.TestMonthDay_Basics.testToString_String_Locale(TestMonthDay_Basics.java:802)

testToString_DTFormatter(org.joda.time.TestMonthDay_Basics)  Time elapsed: 0 sec  <<< FAILURE!
junit.framework.ComparisonFailure: expected:<--05-[06]> but was:<--05-[��]>
	at junit.framework.Assert.assertEquals(Assert.java:81)
	at junit.framework.Assert.assertEquals(Assert.java:87)
	at org.joda.time.TestMonthDay_Basics.testToString_DTFormatter(TestMonthDay_Basics.java:813)

testProperty(org.joda.time.TestMonthDay_Basics)  Time elapsed: 0.001 sec  <<< ERROR!
java.lang.IllegalArgumentException: Field 'dayOfMonth' is not supported
	at org.joda.time.base.AbstractPartial.indexOfSupported(AbstractPartial.java:45)
	at org.joda.time.MonthDay.property(MonthDay.java:753)
	at org.joda.time.TestMonthDay_Basics.testProperty(TestMonthDay_Basics.java:754)

testWithField_nullField(org.joda.time.TestMonthDay_Basics)  Time elapsed: 0.001 sec  <<< ERROR!
java.lang.ArrayIndexOutOfBoundsException: -1
	at org.joda.time.base.BasePartial.getValue(BasePartial.java:225)
	at org.joda.time.MonthDay.withField(MonthDay.java:487)
	at org.joda.time.TestMonthDay_Basics.testWithField_nullField(TestMonthDay_Basics.java:374)

testWithField_unknownField(org.joda.time.TestMonthDay_Basics)  Time elapsed: 0 sec  <<< ERROR!
java.lang.ArrayIndexOutOfBoundsException: -1
	at org.joda.time.base.BasePartial.getValue(BasePartial.java:225)
	at org.joda.time.MonthDay.withField(MonthDay.java:487)
	at org.joda.time.TestMonthDay_Basics.testWithField_unknownField(TestMonthDay_Basics.java:382)

testGet(org.joda.time.TestMonthDay_Basics)  Time elapsed: 0.002 sec  <<< ERROR!
java.lang.IllegalArgumentException: Field 'dayOfMonth' is not supported
	at org.joda.time.base.AbstractPartial.indexOfSupported(AbstractPartial.java:45)
	at org.joda.time.base.AbstractPartial.get(AbstractPartial.java:38)
	at org.joda.time.TestMonthDay_Basics.testGet(TestMonthDay_Basics.java:89)

testPropertyCompareToDayOfMonth(org.joda.time.TestMonthDay_Properties)  Time elapsed: 0 sec  <<< ERROR!
java.lang.IllegalArgumentException: Field 'dayOfMonth' is not supported
	at org.joda.time.base.AbstractPartial.indexOfSupported(AbstractPartial.java:45)
	at org.joda.time.base.AbstractPartial.get(AbstractPartial.java:38)
	at org.joda.time.field.AbstractPartialFieldProperty.compareTo(AbstractPartialFieldProperty.java:304)
	at org.joda.time.TestMonthDay_Properties.testPropertyCompareToDayOfMonth(TestMonthDay_Properties.java:269)

testToString_String(org.joda.time.TestPartial_Basics)  Time elapsed: 0.001 sec  <<< FAILURE!
junit.framework.ComparisonFailure: expected:<10:[20]> but was:<10:[��]>
	at junit.framework.Assert.assertEquals(Assert.java:81)
	at junit.framework.Assert.assertEquals(Assert.java:87)
	at org.joda.time.TestPartial_Basics.testToString_String(TestPartial_Basics.java:878)

testToString_String_Locale(org.joda.time.TestPartial_Basics)  Time elapsed: 0 sec  <<< FAILURE!
junit.framework.ComparisonFailure: expected:<10 [20]> but was:<10 [�]>
	at junit.framework.Assert.assertEquals(Assert.java:81)
	at junit.framework.Assert.assertEquals(Assert.java:87)
	at org.joda.time.TestPartial_Basics.testToString_String_Locale(TestPartial_Basics.java:884)

testToString_DTFormatter(org.joda.time.TestPartial_Basics)  Time elapsed: 0.001 sec  <<< FAILURE!
junit.framework.ComparisonFailure: expected:<10:[20]> but was:<10:[��]>
	at junit.framework.Assert.assertEquals(Assert.java:81)
	at junit.framework.Assert.assertEquals(Assert.java:87)
	at org.joda.time.TestPartial_Basics.testToString_DTFormatter(TestPartial_Basics.java:894)

testWithField1(org.joda.time.TestPartial_Basics)  Time elapsed: 0.001 sec  <<< ERROR!
java.lang.IllegalArgumentException: Field 'minuteOfHour' is not supported
	at org.joda.time.base.AbstractPartial.indexOfSupported(AbstractPartial.java:45)
	at org.joda.time.base.AbstractPartial.get(AbstractPartial.java:38)
	at org.joda.time.TestPartial_Basics.check(TestPartial_Basics.java:928)
	at org.joda.time.TestPartial_Basics.testWithField1(TestPartial_Basics.java:521)

testWithField2(org.joda.time.TestPartial_Basics)  Time elapsed: 0 sec  <<< ERROR!
java.lang.ArrayIndexOutOfBoundsException: -1
	at org.joda.time.Partial.getValue(Partial.java:393)
	at org.joda.time.Partial.withField(Partial.java:548)
	at org.joda.time.TestPartial_Basics.testWithField2(TestPartial_Basics.java:528)

testWithFieldAdded1(org.joda.time.TestPartial_Basics)  Time elapsed: 0.004 sec  <<< ERROR!
java.lang.IllegalArgumentException: Field 'minuteOfHour' is not supported
	at org.joda.time.base.AbstractPartial.indexOfSupported(AbstractPartial.java:45)
	at org.joda.time.base.AbstractPartial.get(AbstractPartial.java:38)
	at org.joda.time.TestPartial_Basics.check(TestPartial_Basics.java:928)
	at org.joda.time.TestPartial_Basics.testWithFieldAdded1(TestPartial_Basics.java:555)

testWithFieldAdded2(org.joda.time.TestPartial_Basics)  Time elapsed: 0 sec  <<< ERROR!
java.lang.IllegalArgumentException: Field 'minuteOfHour' is not supported
	at org.joda.time.base.AbstractPartial.indexOfSupported(AbstractPartial.java:45)
	at org.joda.time.base.AbstractPartial.get(AbstractPartial.java:38)
	at org.joda.time.TestPartial_Basics.check(TestPartial_Basics.java:928)
	at org.joda.time.TestPartial_Basics.testWithFieldAdded2(TestPartial_Basics.java:565)

testWithFieldAdded3(org.joda.time.TestPartial_Basics)  Time elapsed: 0 sec  <<< ERROR!
java.lang.IllegalArgumentException: Field 'minuteOfHour' is not supported
	at org.joda.time.base.AbstractPartial.indexOfSupported(AbstractPartial.java:45)
	at org.joda.time.base.AbstractPartial.get(AbstractPartial.java:38)
	at org.joda.time.TestPartial_Basics.check(TestPartial_Basics.java:928)
	at org.joda.time.TestPartial_Basics.testWithFieldAdded3(TestPartial_Basics.java:574)

testPlus_RP(org.joda.time.TestPartial_Basics)  Time elapsed: 0 sec  <<< ERROR!
java.lang.IllegalArgumentException: Field 'minuteOfHour' is not supported
	at org.joda.time.base.AbstractPartial.indexOfSupported(AbstractPartial.java:45)
	at org.joda.time.base.AbstractPartial.get(AbstractPartial.java:38)
	at org.joda.time.TestPartial_Basics.check(TestPartial_Basics.java:928)
	at org.joda.time.TestPartial_Basics.testPlus_RP(TestPartial_Basics.java:723)

testMinus_RP(org.joda.time.TestPartial_Basics)  Time elapsed: 0 sec  <<< ERROR!
java.lang.IllegalArgumentException: Field 'minuteOfHour' is not supported
	at org.joda.time.base.AbstractPartial.indexOfSupported(AbstractPartial.java:45)
	at org.joda.time.base.AbstractPartial.get(AbstractPartial.java:38)
	at org.joda.time.TestPartial_Basics.check(TestPartial_Basics.java:928)
	at org.joda.time.TestPartial_Basics.testMinus_RP(TestPartial_Basics.java:734)

testProperty(org.joda.time.TestPartial_Basics)  Time elapsed: 0.001 sec  <<< ERROR!
java.lang.IllegalArgumentException: Field 'minuteOfHour' is not supported
	at org.joda.time.base.AbstractPartial.indexOfSupported(AbstractPartial.java:45)
	at org.joda.time.Partial.property(Partial.java:673)
	at org.joda.time.TestPartial_Basics.testProperty(TestPartial_Basics.java:766)

testWithChronologyRetainFields_Chrono(org.joda.time.TestPartial_Basics)  Time elapsed: 0 sec  <<< ERROR!
java.lang.IllegalArgumentException: Field 'minuteOfHour' is not supported
	at org.joda.time.base.AbstractPartial.indexOfSupported(AbstractPartial.java:45)
	at org.joda.time.base.AbstractPartial.get(AbstractPartial.java:38)
	at org.joda.time.TestPartial_Basics.check(TestPartial_Basics.java:928)
	at org.joda.time.TestPartial_Basics.testWithChronologyRetainFields_Chrono(TestPartial_Basics.java:322)

testWithChronologyRetainFields_nullChrono(org.joda.time.TestPartial_Basics)  Time elapsed: 0.001 sec  <<< ERROR!
java.lang.IllegalArgumentException: Field 'minuteOfHour' is not supported
	at org.joda.time.base.AbstractPartial.indexOfSupported(AbstractPartial.java:45)
	at org.joda.time.base.AbstractPartial.get(AbstractPartial.java:38)
	at org.joda.time.TestPartial_Basics.check(TestPartial_Basics.java:928)
	at org.joda.time.TestPartial_Basics.testWithChronologyRetainFields_nullChrono(TestPartial_Basics.java:337)

testWithFieldAdded5(org.joda.time.TestPartial_Basics)  Time elapsed: 0.004 sec  <<< ERROR!
java.lang.IllegalArgumentException: Field 'minuteOfHour' is not supported
	at org.joda.time.base.AbstractPartial.indexOfSupported(AbstractPartial.java:45)
	at org.joda.time.base.AbstractPartial.get(AbstractPartial.java:38)
	at org.joda.time.TestPartial_Basics.check(TestPartial_Basics.java:928)
	at org.joda.time.TestPartial_Basics.testWithFieldAdded5(TestPartial_Basics.java:589)

testWithFieldAdded6(org.joda.time.TestPartial_Basics)  Time elapsed: 0 sec  <<< ERROR!
java.lang.IllegalArgumentException: Field 'minuteOfHour' is not supported
	at org.joda.time.base.AbstractPartial.indexOfSupported(AbstractPartial.java:45)
	at org.joda.time.base.AbstractPartial.get(AbstractPartial.java:38)
	at org.joda.time.TestPartial_Basics.check(TestPartial_Basics.java:928)
	at org.joda.time.TestPartial_Basics.testWithFieldAdded6(TestPartial_Basics.java:600)

testWithFieldAdded7(org.joda.time.TestPartial_Basics)  Time elapsed: 0 sec  <<< ERROR!
java.lang.IllegalArgumentException: Field 'minuteOfHour' is not supported
	at org.joda.time.base.AbstractPartial.indexOfSupported(AbstractPartial.java:45)
	at org.joda.time.base.AbstractPartial.get(AbstractPartial.java:38)
	at org.joda.time.TestPartial_Basics.check(TestPartial_Basics.java:928)
	at org.joda.time.TestPartial_Basics.testWithFieldAdded7(TestPartial_Basics.java:611)

testWithFieldAdded8(org.joda.time.TestPartial_Basics)  Time elapsed: 0 sec  <<< ERROR!
java.lang.IllegalArgumentException: Field 'minuteOfHour' is not supported
	at org.joda.time.base.AbstractPartial.indexOfSupported(AbstractPartial.java:45)
	at org.joda.time.base.AbstractPartial.get(AbstractPartial.java:38)
	at org.joda.time.TestPartial_Basics.check(TestPartial_Basics.java:928)
	at org.joda.time.TestPartial_Basics.testWithFieldAdded8(TestPartial_Basics.java:631)

testWith2(org.joda.time.TestPartial_Basics)  Time elapsed: 0 sec  <<< ERROR!
java.lang.IllegalArgumentException: Field 'minuteOfHour' is not supported
	at org.joda.time.base.AbstractPartial.indexOfSupported(AbstractPartial.java:45)
	at org.joda.time.base.AbstractPartial.get(AbstractPartial.java:38)
	at org.joda.time.TestPartial_Basics.check(TestPartial_Basics.java:928)
	at org.joda.time.TestPartial_Basics.testWith2(TestPartial_Basics.java:357)

testWith3(org.joda.time.TestPartial_Basics)  Time elapsed: 0.001 sec  <<< ERROR!
java.lang.IllegalArgumentException: Field 'minuteOfHour' is not supported
	at org.joda.time.base.AbstractPartial.indexOfSupported(AbstractPartial.java:45)
	at org.joda.time.base.AbstractPartial.get(AbstractPartial.java:38)
	at org.joda.time.TestPartial_Basics.check(TestPartial_Basics.java:928)
	at org.joda.time.TestPartial_Basics.testWith3(TestPartial_Basics.java:366)

testWith3a(org.joda.time.TestPartial_Basics)  Time elapsed: 0.001 sec  <<< ERROR!
java.lang.IllegalArgumentException: Field 'minuteOfHour' is not supported
	at org.joda.time.base.AbstractPartial.indexOfSupported(AbstractPartial.java:45)
	at org.joda.time.base.AbstractPartial.get(AbstractPartial.java:38)
	at org.joda.time.TestPartial_Basics.check(TestPartial_Basics.java:928)
	at org.joda.time.TestPartial_Basics.testWith3a(TestPartial_Basics.java:372)

testWith3b(org.joda.time.TestPartial_Basics)  Time elapsed: 0.001 sec  <<< ERROR!
java.lang.IllegalArgumentException: Field 'minuteOfHour' is not supported
	at org.joda.time.base.AbstractPartial.indexOfSupported(AbstractPartial.java:45)
	at org.joda.time.base.AbstractPartial.get(AbstractPartial.java:38)
	at org.joda.time.TestPartial_Basics.check(TestPartial_Basics.java:928)
	at org.joda.time.TestPartial_Basics.testWith3b(TestPartial_Basics.java:388)

testWith3c(org.joda.time.TestPartial_Basics)  Time elapsed: 0.001 sec  <<< ERROR!
java.lang.IllegalArgumentException: Field 'minuteOfHour' is not supported
	at org.joda.time.base.AbstractPartial.indexOfSupported(AbstractPartial.java:45)
	at org.joda.time.base.AbstractPartial.get(AbstractPartial.java:38)
	at org.joda.time.TestPartial_Basics.check(TestPartial_Basics.java:928)
	at org.joda.time.TestPartial_Basics.testWith3c(TestPartial_Basics.java:404)

testWith3d(org.joda.time.TestPartial_Basics)  Time elapsed: 0 sec  <<< ERROR!
java.lang.IllegalArgumentException: Field 'monthOfYear' is not supported
	at org.joda.time.base.AbstractPartial.indexOfSupported(AbstractPartial.java:45)
	at org.joda.time.base.AbstractPartial.get(AbstractPartial.java:38)
	at org.joda.time.TestPartial_Basics.testWith3d(TestPartial_Basics.java:422)

testWith3e(org.joda.time.TestPartial_Basics)  Time elapsed: 0.001 sec  <<< ERROR!
java.lang.IllegalArgumentException: Field 'halfdayOfDay' is not supported
	at org.joda.time.base.AbstractPartial.indexOfSupported(AbstractPartial.java:45)
	at org.joda.time.base.AbstractPartial.get(AbstractPartial.java:38)
	at org.joda.time.TestPartial_Basics.testWith3e(TestPartial_Basics.java:430)

testWith3f(org.joda.time.TestPartial_Basics)  Time elapsed: 0 sec  <<< ERROR!
java.lang.IllegalArgumentException: Field 'halfdayOfDay' is not supported
	at org.joda.time.base.AbstractPartial.indexOfSupported(AbstractPartial.java:45)
	at org.joda.time.base.AbstractPartial.get(AbstractPartial.java:38)
	at org.joda.time.TestPartial_Basics.testWith3f(TestPartial_Basics.java:440)

testWithout1(org.joda.time.TestPartial_Basics)  Time elapsed: 0.001 sec  <<< ERROR!
java.lang.IllegalArgumentException: Field 'minuteOfHour' is not supported
	at org.joda.time.base.AbstractPartial.indexOfSupported(AbstractPartial.java:45)
	at org.joda.time.base.AbstractPartial.get(AbstractPartial.java:38)
	at org.joda.time.TestPartial_Basics.check(TestPartial_Basics.java:928)
	at org.joda.time.TestPartial_Basics.testWithout1(TestPartial_Basics.java:479)

testWithout2(org.joda.time.TestPartial_Basics)  Time elapsed: 0.001 sec  <<< ERROR!
java.lang.IllegalArgumentException: Field 'minuteOfHour' is not supported
	at org.joda.time.base.AbstractPartial.indexOfSupported(AbstractPartial.java:45)
	at org.joda.time.base.AbstractPartial.get(AbstractPartial.java:38)
	at org.joda.time.TestPartial_Basics.check(TestPartial_Basics.java:928)
	at org.joda.time.TestPartial_Basics.testWithout2(TestPartial_Basics.java:486)

testWithout3(org.joda.time.TestPartial_Basics)  Time elapsed: 0.001 sec  <<< ERROR!
java.lang.IllegalArgumentException: Field 'minuteOfHour' is not supported
	at org.joda.time.base.AbstractPartial.indexOfSupported(AbstractPartial.java:45)
	at org.joda.time.base.AbstractPartial.get(AbstractPartial.java:38)
	at org.joda.time.TestPartial_Basics.check(TestPartial_Basics.java:928)
	at org.joda.time.TestPartial_Basics.testWithout3(TestPartial_Basics.java:493)

testWithout4(org.joda.time.TestPartial_Basics)  Time elapsed: 0.001 sec  <<< ERROR!
java.lang.IllegalArgumentException: Field 'minuteOfHour' is not supported
	at org.joda.time.base.AbstractPartial.indexOfSupported(AbstractPartial.java:45)
	at org.joda.time.base.AbstractPartial.get(AbstractPartial.java:38)
	at org.joda.time.TestPartial_Basics.check(TestPartial_Basics.java:928)
	at org.joda.time.TestPartial_Basics.testWithout4(TestPartial_Basics.java:503)

testWithFieldAddWrapped1(org.joda.time.TestPartial_Basics)  Time elapsed: 0.001 sec  <<< ERROR!
java.lang.IllegalArgumentException: Field 'minuteOfHour' is not supported
	at org.joda.time.base.AbstractPartial.indexOfSupported(AbstractPartial.java:45)
	at org.joda.time.base.AbstractPartial.get(AbstractPartial.java:38)
	at org.joda.time.TestPartial_Basics.check(TestPartial_Basics.java:928)
	at org.joda.time.TestPartial_Basics.testWithFieldAddWrapped1(TestPartial_Basics.java:649)

testWithFieldAddWrapped2(org.joda.time.TestPartial_Basics)  Time elapsed: 0.001 sec  <<< ERROR!
java.lang.IllegalArgumentException: Field 'minuteOfHour' is not supported
	at org.joda.time.base.AbstractPartial.indexOfSupported(AbstractPartial.java:45)
	at org.joda.time.base.AbstractPartial.get(AbstractPartial.java:38)
	at org.joda.time.TestPartial_Basics.check(TestPartial_Basics.java:928)
	at org.joda.time.TestPartial_Basics.testWithFieldAddWrapped2(TestPartial_Basics.java:659)

testWithFieldAddWrapped3(org.joda.time.TestPartial_Basics)  Time elapsed: 0.001 sec  <<< ERROR!
java.lang.IllegalArgumentException: Field 'minuteOfHour' is not supported
	at org.joda.time.base.AbstractPartial.indexOfSupported(AbstractPartial.java:45)
	at org.joda.time.base.AbstractPartial.get(AbstractPartial.java:38)
	at org.joda.time.TestPartial_Basics.check(TestPartial_Basics.java:928)
	at org.joda.time.TestPartial_Basics.testWithFieldAddWrapped3(TestPartial_Basics.java:668)

testWithFieldAddWrapped5(org.joda.time.TestPartial_Basics)  Time elapsed: 0 sec  <<< ERROR!
java.lang.IllegalArgumentException: Field 'minuteOfHour' is not supported
	at org.joda.time.base.AbstractPartial.indexOfSupported(AbstractPartial.java:45)
	at org.joda.time.base.AbstractPartial.get(AbstractPartial.java:38)
	at org.joda.time.TestPartial_Basics.check(TestPartial_Basics.java:928)
	at org.joda.time.TestPartial_Basics.testWithFieldAddWrapped5(TestPartial_Basics.java:683)

testWithFieldAddWrapped6(org.joda.time.TestPartial_Basics)  Time elapsed: 0.001 sec  <<< ERROR!
java.lang.IllegalArgumentException: Field 'minuteOfHour' is not supported
	at org.joda.time.base.AbstractPartial.indexOfSupported(AbstractPartial.java:45)
	at org.joda.time.base.AbstractPartial.get(AbstractPartial.java:38)
	at org.joda.time.TestPartial_Basics.check(TestPartial_Basics.java:928)
	at org.joda.time.TestPartial_Basics.testWithFieldAddWrapped6(TestPartial_Basics.java:691)

testWithFieldAddWrapped7(org.joda.time.TestPartial_Basics)  Time elapsed: 0.001 sec  <<< ERROR!
java.lang.IllegalArgumentException: Field 'minuteOfHour' is not supported
	at org.joda.time.base.AbstractPartial.indexOfSupported(AbstractPartial.java:45)
	at org.joda.time.base.AbstractPartial.get(AbstractPartial.java:38)
	at org.joda.time.TestPartial_Basics.check(TestPartial_Basics.java:928)
	at org.joda.time.TestPartial_Basics.testWithFieldAddWrapped7(TestPartial_Basics.java:698)

testWithFieldAddWrapped8(org.joda.time.TestPartial_Basics)  Time elapsed: 0.001 sec  <<< ERROR!
java.lang.IllegalArgumentException: Field 'minuteOfHour' is not supported
	at org.joda.time.base.AbstractPartial.indexOfSupported(AbstractPartial.java:45)
	at org.joda.time.base.AbstractPartial.get(AbstractPartial.java:38)
	at org.joda.time.TestPartial_Basics.check(TestPartial_Basics.java:928)
	at org.joda.time.TestPartial_Basics.testWithFieldAddWrapped8(TestPartial_Basics.java:710)

testGetFormatter1(org.joda.time.TestPartial_Basics)  Time elapsed: 0.001 sec  <<< FAILURE!
junit.framework.ComparisonFailure: expected:<2005-[06]> but was:<2005-[��]>
	at junit.framework.Assert.assertEquals(Assert.java:81)
	at junit.framework.Assert.assertEquals(Assert.java:87)
	at org.joda.time.TestPartial_Basics.testGetFormatter1(TestPartial_Basics.java:804)

testWith1(org.joda.time.TestPartial_Basics)  Time elapsed: 0.001 sec  <<< ERROR!
java.lang.IllegalArgumentException: Field 'minuteOfHour' is not supported
	at org.joda.time.base.AbstractPartial.indexOfSupported(AbstractPartial.java:45)
	at org.joda.time.base.AbstractPartial.get(AbstractPartial.java:38)
	at org.joda.time.TestPartial_Basics.check(TestPartial_Basics.java:928)
	at org.joda.time.TestPartial_Basics.testWith1(TestPartial_Basics.java:347)

testToString1(org.joda.time.TestPartial_Basics)  Time elapsed: 0.001 sec  <<< FAILURE!
junit.framework.ComparisonFailure: expected:<10:[20]> but was:<10:[��]>
	at junit.framework.Assert.assertEquals(Assert.java:81)
	at junit.framework.Assert.assertEquals(Assert.java:87)
	at org.joda.time.TestPartial_Basics.testToString1(TestPartial_Basics.java:836)

testToString3(org.joda.time.TestPartial_Basics)  Time elapsed: 0.001 sec  <<< FAILURE!
junit.framework.ComparisonFailure: expected:<2005-[06]> but was:<2005-[��]>
	at junit.framework.Assert.assertEquals(Assert.java:81)
	at junit.framework.Assert.assertEquals(Assert.java:87)
	at org.joda.time.TestPartial_Basics.testToString3(TestPartial_Basics.java:849)

testToDateTime_RI(org.joda.time.TestPartial_Basics)  Time elapsed: 0.001 sec  <<< ERROR!
java.lang.IllegalArgumentException: Field 'minuteOfHour' is not supported
	at org.joda.time.base.AbstractPartial.indexOfSupported(AbstractPartial.java:45)
	at org.joda.time.base.AbstractPartial.get(AbstractPartial.java:38)
	at org.joda.time.TestPartial_Basics.check(TestPartial_Basics.java:928)
	at org.joda.time.TestPartial_Basics.testToDateTime_RI(TestPartial_Basics.java:748)

testToDateTime_nullRI(org.joda.time.TestPartial_Basics)  Time elapsed: 0 sec  <<< ERROR!
java.lang.IllegalArgumentException: Field 'minuteOfHour' is not supported
	at org.joda.time.base.AbstractPartial.indexOfSupported(AbstractPartial.java:45)
	at org.joda.time.base.AbstractPartial.get(AbstractPartial.java:38)
	at org.joda.time.TestPartial_Basics.check(TestPartial_Basics.java:928)
	at org.joda.time.TestPartial_Basics.testToDateTime_nullRI(TestPartial_Basics.java:758)

testWithField3(org.joda.time.TestPartial_Basics)  Time elapsed: 0.001 sec  <<< ERROR!
java.lang.ArrayIndexOutOfBoundsException: -1
	at org.joda.time.Partial.getValue(Partial.java:393)
	at org.joda.time.Partial.withField(Partial.java:548)
	at org.joda.time.TestPartial_Basics.testWithField3(TestPartial_Basics.java:537)

testGet(org.joda.time.TestPartial_Basics)  Time elapsed: 0.002 sec  <<< ERROR!
java.lang.IllegalArgumentException: Field 'minuteOfHour' is not supported
	at org.joda.time.base.AbstractPartial.indexOfSupported(AbstractPartial.java:45)
	at org.joda.time.base.AbstractPartial.get(AbstractPartial.java:38)
	at org.joda.time.TestPartial_Basics.testGet(TestPartial_Basics.java:94)

testConstructor_TypeArray_intArray(org.joda.time.TestPartial_Constructors)  Time elapsed: 0 sec  <<< ERROR!
java.lang.IllegalArgumentException: Field 'dayOfYear' is not supported
	at org.joda.time.base.AbstractPartial.indexOfSupported(AbstractPartial.java:45)
	at org.joda.time.base.AbstractPartial.get(AbstractPartial.java:38)
	at org.joda.time.TestPartial_Constructors.testConstructor_TypeArray_intArray(TestPartial_Constructors.java:186)

testConstructor_TypeArray_intArray_year_weekyear(org.joda.time.TestPartial_Constructors)  Time elapsed: 0 sec  <<< ERROR!
java.lang.IllegalArgumentException: Field 'weekyear' is not supported
	at org.joda.time.base.AbstractPartial.indexOfSupported(AbstractPartial.java:45)
	at org.joda.time.base.AbstractPartial.get(AbstractPartial.java:38)
	at org.joda.time.TestPartial_Constructors.testConstructor_TypeArray_intArray_year_weekyear(TestPartial_Constructors.java:208)

testConstructor_TypeArray_intArray_Chrono(org.joda.time.TestPartial_Constructors)  Time elapsed: 0 sec  <<< ERROR!
java.lang.IllegalArgumentException: Field 'dayOfYear' is not supported
	at org.joda.time.base.AbstractPartial.indexOfSupported(AbstractPartial.java:45)
	at org.joda.time.base.AbstractPartial.get(AbstractPartial.java:38)
	at org.joda.time.TestPartial_Constructors.testConstructor_TypeArray_intArray_Chrono(TestPartial_Constructors.java:431)

testConstructor_Partial(org.joda.time.TestPartial_Constructors)  Time elapsed: 0.001 sec  <<< ERROR!
java.lang.IllegalArgumentException: Field 'monthOfYear' is not supported
	at org.joda.time.base.AbstractPartial.indexOfSupported(AbstractPartial.java:45)
	at org.joda.time.base.AbstractPartial.get(AbstractPartial.java:38)
	at org.joda.time.TestPartial_Constructors.testConstructor_Partial(TestPartial_Constructors.java:451)

testPropertySetHour(org.joda.time.TestPartial_Properties)  Time elapsed: 0.001 sec  <<< ERROR!
java.lang.IllegalArgumentException: Field 'minuteOfHour' is not supported
	at org.joda.time.base.AbstractPartial.indexOfSupported(AbstractPartial.java:45)
	at org.joda.time.base.AbstractPartial.get(AbstractPartial.java:38)
	at org.joda.time.TestPartial_Properties.check(TestPartial_Properties.java:412)
	at org.joda.time.TestPartial_Properties.testPropertySetHour(TestPartial_Properties.java:181)

testPropertySetTextHour(org.joda.time.TestPartial_Properties)  Time elapsed: 0.001 sec  <<< ERROR!
java.lang.IllegalArgumentException: Field 'minuteOfHour' is not supported
	at org.joda.time.base.AbstractPartial.indexOfSupported(AbstractPartial.java:45)
	at org.joda.time.base.AbstractPartial.get(AbstractPartial.java:38)
	at org.joda.time.TestPartial_Properties.check(TestPartial_Properties.java:412)
	at org.joda.time.TestPartial_Properties.testPropertySetTextHour(TestPartial_Properties.java:197)

testPropertyWithMaximumValueHour(org.joda.time.TestPartial_Properties)  Time elapsed: 0 sec  <<< ERROR!
java.lang.IllegalArgumentException: Field 'minuteOfHour' is not supported
	at org.joda.time.base.AbstractPartial.indexOfSupported(AbstractPartial.java:45)
	at org.joda.time.base.AbstractPartial.get(AbstractPartial.java:38)
	at org.joda.time.TestPartial_Properties.check(TestPartial_Properties.java:412)
	at org.joda.time.TestPartial_Properties.testPropertyWithMaximumValueHour(TestPartial_Properties.java:204)

testPropertyWithMinimumValueHour(org.joda.time.TestPartial_Properties)  Time elapsed: 0.001 sec  <<< ERROR!
java.lang.IllegalArgumentException: Field 'minuteOfHour' is not supported
	at org.joda.time.base.AbstractPartial.indexOfSupported(AbstractPartial.java:45)
	at org.joda.time.base.AbstractPartial.get(AbstractPartial.java:38)
	at org.joda.time.TestPartial_Properties.check(TestPartial_Properties.java:412)
	at org.joda.time.TestPartial_Properties.testPropertyWithMinimumValueHour(TestPartial_Properties.java:211)

testPropertyAddWrapFieldHour(org.joda.time.TestPartial_Properties)  Time elapsed: 0 sec  <<< ERROR!
java.lang.IllegalArgumentException: Field 'minuteOfHour' is not supported
	at org.joda.time.base.AbstractPartial.indexOfSupported(AbstractPartial.java:45)
	at org.joda.time.base.AbstractPartial.get(AbstractPartial.java:38)
	at org.joda.time.TestPartial_Properties.check(TestPartial_Properties.java:412)
	at org.joda.time.TestPartial_Properties.testPropertyAddWrapFieldHour(TestPartial_Properties.java:165)

testPropertyAddMinute(org.joda.time.TestPartial_Properties)  Time elapsed: 0.001 sec  <<< ERROR!
java.lang.IllegalArgumentException: Field 'minuteOfHour' is not supported
	at org.joda.time.base.AbstractPartial.indexOfSupported(AbstractPartial.java:45)
	at org.joda.time.Partial.property(Partial.java:673)
	at org.joda.time.TestPartial_Properties.testPropertyAddMinute(TestPartial_Properties.java:307)

testPropertyAddWrapFieldMinute(org.joda.time.TestPartial_Properties)  Time elapsed: 0 sec  <<< ERROR!
java.lang.IllegalArgumentException: Field 'minuteOfHour' is not supported
	at org.joda.time.base.AbstractPartial.indexOfSupported(AbstractPartial.java:45)
	at org.joda.time.Partial.property(Partial.java:673)
	at org.joda.time.TestPartial_Properties.testPropertyAddWrapFieldMinute(TestPartial_Properties.java:353)

testPropertyAddHour(org.joda.time.TestPartial_Properties)  Time elapsed: 0.001 sec  <<< ERROR!
java.lang.IllegalArgumentException: Field 'minuteOfHour' is not supported
	at org.joda.time.base.AbstractPartial.indexOfSupported(AbstractPartial.java:45)
	at org.joda.time.base.AbstractPartial.get(AbstractPartial.java:38)
	at org.joda.time.TestPartial_Properties.check(TestPartial_Properties.java:412)
	at org.joda.time.TestPartial_Properties.testPropertyAddHour(TestPartial_Properties.java:137)

testPropertyGetMinute(org.joda.time.TestPartial_Properties)  Time elapsed: 0.001 sec  <<< ERROR!
java.lang.IllegalArgumentException: Field 'minuteOfHour' is not supported
	at org.joda.time.base.AbstractPartial.indexOfSupported(AbstractPartial.java:45)
	at org.joda.time.Partial.property(Partial.java:673)
	at org.joda.time.TestPartial_Properties.testPropertyGetMinute(TestPartial_Properties.java:240)

testPropertyGetMaxMinValuesMinute(org.joda.time.TestPartial_Properties)  Time elapsed: 0 sec  <<< ERROR!
java.lang.IllegalArgumentException: Field 'minuteOfHour' is not supported
	at org.joda.time.base.AbstractPartial.indexOfSupported(AbstractPartial.java:45)
	at org.joda.time.Partial.property(Partial.java:673)
	at org.joda.time.TestPartial_Properties.testPropertyGetMaxMinValuesMinute(TestPartial_Properties.java:259)

testPropertySetMinute(org.joda.time.TestPartial_Properties)  Time elapsed: 0.001 sec  <<< ERROR!
java.lang.IllegalArgumentException: Field 'minuteOfHour' is not supported
	at org.joda.time.base.AbstractPartial.indexOfSupported(AbstractPartial.java:45)
	at org.joda.time.Partial.property(Partial.java:673)
	at org.joda.time.TestPartial_Properties.testPropertySetMinute(TestPartial_Properties.java:366)

testPropertySetTextMinute(org.joda.time.TestPartial_Properties)  Time elapsed: 0 sec  <<< ERROR!
java.lang.IllegalArgumentException: Field 'minuteOfHour' is not supported
	at org.joda.time.base.AbstractPartial.indexOfSupported(AbstractPartial.java:45)
	at org.joda.time.Partial.property(Partial.java:673)
	at org.joda.time.TestPartial_Properties.testPropertySetTextMinute(TestPartial_Properties.java:382)

testPropertyCompareToMinute(org.joda.time.TestPartial_Properties)  Time elapsed: 0.001 sec  <<< ERROR!
java.lang.IllegalArgumentException: Field 'minuteOfHour' is not supported
	at org.joda.time.base.AbstractPartial.indexOfSupported(AbstractPartial.java:45)
	at org.joda.time.Partial.property(Partial.java:673)
	at org.joda.time.TestPartial_Properties.testPropertyCompareToMinute(TestPartial_Properties.java:390)

testYearMonth(org.joda.time.TestStringConvert)  Time elapsed: 0.001 sec  <<< FAILURE!
junit.framework.ComparisonFailure: expected:<2010-[06]> but was:<2010-[��]>
	at junit.framework.Assert.assertEquals(Assert.java:81)
	at junit.framework.Assert.assertEquals(Assert.java:87)
	at org.joda.time.TestStringConvert.testYearMonth(TestStringConvert.java:98)

testMonthDay(org.joda.time.TestStringConvert)  Time elapsed: 0.001 sec  <<< FAILURE!
junit.framework.ComparisonFailure: expected:<--06-[30]> but was:<--06-[��]>
	at junit.framework.Assert.assertEquals(Assert.java:81)
	at junit.framework.Assert.assertEquals(Assert.java:87)
	at org.joda.time.TestStringConvert.testMonthDay(TestStringConvert.java:105)

testMonthDay_leapDay(org.joda.time.TestStringConvert)  Time elapsed: 0.001 sec  <<< FAILURE!
junit.framework.ComparisonFailure: expected:<--02-[29]> but was:<--02-[��]>
	at junit.framework.Assert.assertEquals(Assert.java:81)
	at junit.framework.Assert.assertEquals(Assert.java:87)
	at org.joda.time.TestStringConvert.testMonthDay_leapDay(TestStringConvert.java:112)

testMaximumValue(org.joda.time.chrono.TestGregorianChronology)  Time elapsed: 0.001 sec  <<< ERROR!
java.lang.IllegalArgumentException: Field 'monthOfYear' is not supported
	at org.joda.time.base.AbstractPartial.indexOfSupported(AbstractPartial.java:45)
	at org.joda.time.base.AbstractPartial.get(AbstractPartial.java:38)
	at org.joda.time.chrono.BasicDayOfMonthDateTimeField.getMaximumValue(BasicDayOfMonthDateTimeField.java:69)
	at org.joda.time.chrono.ZonedChronology$ZonedDateTimeField.getMaximumValue(ZonedChronology.java:592)
	at org.joda.time.chrono.TestGregorianChronology.testMaximumValue(TestGregorianChronology.java:309)

testMaximumValue(org.joda.time.chrono.TestISOChronology)  Time elapsed: 0.001 sec  <<< ERROR!
java.lang.IllegalArgumentException: Field 'monthOfYear' is not supported
	at org.joda.time.base.AbstractPartial.indexOfSupported(AbstractPartial.java:45)
	at org.joda.time.base.AbstractPartial.get(AbstractPartial.java:38)
	at org.joda.time.chrono.BasicDayOfMonthDateTimeField.getMaximumValue(BasicDayOfMonthDateTimeField.java:69)
	at org.joda.time.field.AbstractPartialFieldProperty.getMaximumValue(AbstractPartialFieldProperty.java:230)
	at org.joda.time.chrono.TestISOChronology.testMaximumValue(TestISOChronology.java:453)

testGetPartialValues(org.joda.time.convert.TestReadablePartialConverter)  Time elapsed: 0 sec  <<< ERROR!
java.lang.IllegalArgumentException: Field 'minuteOfHour' is not supported
	at org.joda.time.base.AbstractPartial.indexOfSupported(AbstractPartial.java:45)
	at org.joda.time.base.AbstractPartial.get(AbstractPartial.java:38)
	at org.joda.time.convert.ReadablePartialConverter.getPartialValues(ReadablePartialConverter.java:91)
	at org.joda.time.convert.TestReadablePartialConverter.testGetPartialValues(TestReadablePartialConverter.java:110)

testPrint_bufferMethods(org.joda.time.format.TestDateTimeFormatter)  Time elapsed: 0 sec  <<< FAILURE!
junit.framework.ComparisonFailure: expected:<2004-[06]-09> but was:<2004-[��]-09>
	at junit.framework.Assert.assertEquals(Assert.java:81)
	at junit.framework.Assert.assertEquals(Assert.java:87)
	at org.joda.time.format.TestDateTimeFormatter.testPrint_bufferMethods(TestDateTimeFormatter.java:172)

testPrint_writerMethods(org.joda.time.format.TestDateTimeFormatter)  Time elapsed: 0.001 sec  <<< FAILURE!
junit.framework.ComparisonFailure: expected:<2004-[06]-09> but was:<2004-[��]-09>
	at junit.framework.Assert.assertEquals(Assert.java:81)
	at junit.framework.Assert.assertEquals(Assert.java:87)
	at org.joda.time.format.TestDateTimeFormatter.testPrint_writerMethods(TestDateTimeFormatter.java:194)

testFormat_date_partial(org.joda.time.format.TestISODateTimeFormat)  Time elapsed: 0.001 sec  <<< FAILURE!
junit.framework.ComparisonFailure: expected:<2004-[06]-09> but was:<2004-[��]-09>
	at junit.framework.Assert.assertEquals(Assert.java:81)
	at junit.framework.Assert.assertEquals(Assert.java:87)
	at org.joda.time.format.TestISODateTimeFormat.testFormat_date_partial(TestISODateTimeFormat.java:111)

testFormat_time_partial(org.joda.time.format.TestISODateTimeFormat)  Time elapsed: 0 sec  <<< FAILURE!
junit.framework.ComparisonFailure: expected:<10:[20]:30.040> but was:<10:[��]:30.040>
	at junit.framework.Assert.assertEquals(Assert.java:81)
	at junit.framework.Assert.assertEquals(Assert.java:87)
	at org.joda.time.format.TestISODateTimeFormat.testFormat_time_partial(TestISODateTimeFormat.java:130)

testFormat_timeNoMillis_partial(org.joda.time.format.TestISODateTimeFormat)  Time elapsed: 0.001 sec  <<< FAILURE!
junit.framework.ComparisonFailure: expected:<10:[20]:30> but was:<10:[��]:30>
	at junit.framework.Assert.assertEquals(Assert.java:81)
	at junit.framework.Assert.assertEquals(Assert.java:87)
	at org.joda.time.format.TestISODateTimeFormat.testFormat_timeNoMillis_partial(TestISODateTimeFormat.java:149)

testForFields_weekBased_YW(org.joda.time.format.TestISODateTimeFormat_Fields)  Time elapsed: 0 sec  <<< FAILURE!
junit.framework.ComparisonFailure: expected:<2005-W[08]> but was:<2005-W[��]>
	at junit.framework.Assert.assertEquals(Assert.java:81)
	at junit.framework.Assert.assertEquals(Assert.java:87)
	at org.joda.time.format.TestISODateTimeFormat_Fields.testForFields_weekBased_YW(TestISODateTimeFormat_Fields.java:434)

testForFields_weekBased_WD(org.joda.time.format.TestISODateTimeFormat_Fields)  Time elapsed: 0 sec  <<< FAILURE!
junit.framework.ComparisonFailure: expected:<-W08-[5]> but was:<-W08-[�]>
	at junit.framework.Assert.assertEquals(Assert.java:81)
	at junit.framework.Assert.assertEquals(Assert.java:87)
	at org.joda.time.format.TestISODateTimeFormat_Fields.testForFields_weekBased_WD(TestISODateTimeFormat_Fields.java:462)

testForFields_weekBased_YD(org.joda.time.format.TestISODateTimeFormat_Fields)  Time elapsed: 0 sec  <<< FAILURE!
junit.framework.ComparisonFailure: expected:<2005-W-[5]> but was:<2005-W-[�]>
	at junit.framework.Assert.assertEquals(Assert.java:81)
	at junit.framework.Assert.assertEquals(Assert.java:87)
	at org.joda.time.format.TestISODateTimeFormat_Fields.testForFields_weekBased_YD(TestISODateTimeFormat_Fields.java:490)

testForFields_ordinalBased_YD(org.joda.time.format.TestISODateTimeFormat_Fields)  Time elapsed: 0 sec  <<< FAILURE!
junit.framework.ComparisonFailure: expected:<2005-[177]> but was:<2005-[���]>
	at junit.framework.Assert.assertEquals(Assert.java:81)
	at junit.framework.Assert.assertEquals(Assert.java:87)
	at org.joda.time.format.TestISODateTimeFormat_Fields.testForFields_ordinalBased_YD(TestISODateTimeFormat_Fields.java:522)

testForFields_time_HMSm(org.joda.time.format.TestISODateTimeFormat_Fields)  Time elapsed: 0 sec  <<< FAILURE!
junit.framework.ComparisonFailure: expected:<10:[20]:30.040> but was:<10:[��]:30.040>
	at junit.framework.Assert.assertEquals(Assert.java:81)
	at junit.framework.Assert.assertEquals(Assert.java:87)
	at org.joda.time.format.TestISODateTimeFormat_Fields.testForFields_time_HMSm(TestISODateTimeFormat_Fields.java:608)

testForFields_time_HMS(org.joda.time.format.TestISODateTimeFormat_Fields)  Time elapsed: 0.001 sec  <<< FAILURE!
junit.framework.ComparisonFailure: expected:<10:[20]:30> but was:<10:[��]:30>
	at junit.framework.Assert.assertEquals(Assert.java:81)
	at junit.framework.Assert.assertEquals(Assert.java:87)
	at org.joda.time.format.TestISODateTimeFormat_Fields.testForFields_time_HMS(TestISODateTimeFormat_Fields.java:637)

testForFields_time_HM(org.joda.time.format.TestISODateTimeFormat_Fields)  Time elapsed: 0 sec  <<< FAILURE!
junit.framework.ComparisonFailure: expected:<10:[20]> but was:<10:[��]>
	at junit.framework.Assert.assertEquals(Assert.java:81)
	at junit.framework.Assert.assertEquals(Assert.java:87)
	at org.joda.time.format.TestISODateTimeFormat_Fields.testForFields_time_HM(TestISODateTimeFormat_Fields.java:665)

testForFields_time_MSm(org.joda.time.format.TestISODateTimeFormat_Fields)  Time elapsed: 0 sec  <<< FAILURE!
junit.framework.ComparisonFailure: expected:<-20:[30].040> but was:<-20:[��].040>
	at junit.framework.Assert.assertEquals(Assert.java:81)
	at junit.framework.Assert.assertEquals(Assert.java:87)
	at org.joda.time.format.TestISODateTimeFormat_Fields.testForFields_time_MSm(TestISODateTimeFormat_Fields.java:721)

testForFields_time_MS(org.joda.time.format.TestISODateTimeFormat_Fields)  Time elapsed: 0.001 sec  <<< FAILURE!
junit.framework.ComparisonFailure: expected:<-20:[30]> but was:<-20:[��]>
	at junit.framework.Assert.assertEquals(Assert.java:81)
	at junit.framework.Assert.assertEquals(Assert.java:87)
	at org.joda.time.format.TestISODateTimeFormat_Fields.testForFields_time_MS(TestISODateTimeFormat_Fields.java:749)

testForFields_time_Sm(org.joda.time.format.TestISODateTimeFormat_Fields)  Time elapsed: 0 sec  <<< FAILURE!
junit.framework.ComparisonFailure: expected:<--30.[040]> but was:<--30.[���]>
	at junit.framework.Assert.assertEquals(Assert.java:81)
	at junit.framework.Assert.assertEquals(Assert.java:87)
	at org.joda.time.format.TestISODateTimeFormat_Fields.testForFields_time_Sm(TestISODateTimeFormat_Fields.java:804)

testForFields_time_Hm(org.joda.time.format.TestISODateTimeFormat_Fields)  Time elapsed: 0.001 sec  <<< FAILURE!
junit.framework.ComparisonFailure: expected:<10--.[040]> but was:<10--.[���]>
	at junit.framework.Assert.assertEquals(Assert.java:81)
	at junit.framework.Assert.assertEquals(Assert.java:87)
	at org.joda.time.format.TestISODateTimeFormat_Fields.testForFields_time_Hm(TestISODateTimeFormat_Fields.java:888)

testForFields_time_HS(org.joda.time.format.TestISODateTimeFormat_Fields)  Time elapsed: 0.001 sec  <<< FAILURE!
junit.framework.ComparisonFailure: expected:<10-[30]> but was:<10-[��]>
	at junit.framework.Assert.assertEquals(Assert.java:81)
	at junit.framework.Assert.assertEquals(Assert.java:87)
	at org.joda.time.format.TestISODateTimeFormat_Fields.testForFields_time_HS(TestISODateTimeFormat_Fields.java:918)

testForFields_time_Mm(org.joda.time.format.TestISODateTimeFormat_Fields)  Time elapsed: 0.001 sec  <<< FAILURE!
junit.framework.ComparisonFailure: expected:<-20-.[040]> but was:<-20-.[���]>
	at junit.framework.Assert.assertEquals(Assert.java:81)
	at junit.framework.Assert.assertEquals(Assert.java:87)
	at org.joda.time.format.TestISODateTimeFormat_Fields.testForFields_time_Mm(TestISODateTimeFormat_Fields.java:948)

testForFields_time_HSm(org.joda.time.format.TestISODateTimeFormat_Fields)  Time elapsed: 0 sec  <<< FAILURE!
junit.framework.ComparisonFailure: expected:<10-[30].040> but was:<10-[��].040>
	at junit.framework.Assert.assertEquals(Assert.java:81)
	at junit.framework.Assert.assertEquals(Assert.java:87)
	at org.joda.time.format.TestISODateTimeFormat_Fields.testForFields_time_HSm(TestISODateTimeFormat_Fields.java:979)

testForFields_time_HMm(org.joda.time.format.TestISODateTimeFormat_Fields)  Time elapsed: 0.001 sec  <<< FAILURE!
junit.framework.ComparisonFailure: expected:<10:[20]-.040> but was:<10:[��]-.040>
	at junit.framework.Assert.assertEquals(Assert.java:81)
	at junit.framework.Assert.assertEquals(Assert.java:87)
	at org.joda.time.format.TestISODateTimeFormat_Fields.testForFields_time_HMm(TestISODateTimeFormat_Fields.java:1010)

testForFields_datetime_YMDH(org.joda.time.format.TestISODateTimeFormat_Fields)  Time elapsed: 0.001 sec  <<< FAILURE!
junit.framework.ComparisonFailure: expected:<2005-[06]-25T12> but was:<2005-[��]-25T12>
	at junit.framework.Assert.assertEquals(Assert.java:81)
	at junit.framework.Assert.assertEquals(Assert.java:87)
	at org.joda.time.format.TestISODateTimeFormat_Fields.testForFields_datetime_YMDH(TestISODateTimeFormat_Fields.java:1044)

testForFields_datetime_DH(org.joda.time.format.TestISODateTimeFormat_Fields)  Time elapsed: 0.001 sec  <<< FAILURE!
junit.framework.ComparisonFailure: expected:<---25T[12]> but was:<---25T[��]>
	at junit.framework.Assert.assertEquals(Assert.java:81)
	at junit.framework.Assert.assertEquals(Assert.java:87)
	at org.joda.time.format.TestISODateTimeFormat_Fields.testForFields_datetime_DH(TestISODateTimeFormat_Fields.java:1072)

testForFields_datetime_YH(org.joda.time.format.TestISODateTimeFormat_Fields)  Time elapsed: 0.001 sec  <<< FAILURE!
junit.framework.ComparisonFailure: expected:<2005T[12]> but was:<2005T[��]>
	at junit.framework.Assert.assertEquals(Assert.java:81)
	at junit.framework.Assert.assertEquals(Assert.java:87)
	at org.joda.time.format.TestISODateTimeFormat_Fields.testForFields_datetime_YH(TestISODateTimeFormat_Fields.java:1100)

testForFields_datetime_DM(org.joda.time.format.TestISODateTimeFormat_Fields)  Time elapsed: 0 sec  <<< FAILURE!
junit.framework.ComparisonFailure: expected:<---25T-[20]> but was:<---25T-[��]>
	at junit.framework.Assert.assertEquals(Assert.java:81)
	at junit.framework.Assert.assertEquals(Assert.java:87)
	at org.joda.time.format.TestISODateTimeFormat_Fields.testForFields_datetime_DM(TestISODateTimeFormat_Fields.java:1130)

testForFields_calBased_YMD(org.joda.time.format.TestISODateTimeFormat_Fields)  Time elapsed: 0.001 sec  <<< FAILURE!
junit.framework.ComparisonFailure: expected:<2005-[06]-25> but was:<2005-[��]-25>
	at junit.framework.Assert.assertEquals(Assert.java:81)
	at junit.framework.Assert.assertEquals(Assert.java:87)
	at org.joda.time.format.TestISODateTimeFormat_Fields.testForFields_calBased_YMD(TestISODateTimeFormat_Fields.java:83)

testForFields_calBased_YMD_unmodifiable(org.joda.time.format.TestISODateTimeFormat_Fields)  Time elapsed: 0 sec  <<< FAILURE!
junit.framework.ComparisonFailure: expected:<2005-[06]-25> but was:<2005-[��]-25>
	at junit.framework.Assert.assertEquals(Assert.java:81)
	at junit.framework.Assert.assertEquals(Assert.java:87)
	at org.joda.time.format.TestISODateTimeFormat_Fields.testForFields_calBased_YMD_unmodifiable(TestISODateTimeFormat_Fields.java:112)

testForFields_calBased_YMD_duplicates(org.joda.time.format.TestISODateTimeFormat_Fields)  Time elapsed: 0.001 sec  <<< FAILURE!
junit.framework.ComparisonFailure: expected:<2005-[06]-25> but was:<2005-[��]-25>
	at junit.framework.Assert.assertEquals(Assert.java:81)
	at junit.framework.Assert.assertEquals(Assert.java:87)
	at org.joda.time.format.TestISODateTimeFormat_Fields.testForFields_calBased_YMD_duplicates(TestISODateTimeFormat_Fields.java:137)

testForFields_calBased_YM(org.joda.time.format.TestISODateTimeFormat_Fields)  Time elapsed: 0 sec  <<< FAILURE!
junit.framework.ComparisonFailure: expected:<2005-[06]> but was:<2005-[��]>
	at junit.framework.Assert.assertEquals(Assert.java:81)
	at junit.framework.Assert.assertEquals(Assert.java:87)
	at org.joda.time.format.TestISODateTimeFormat_Fields.testForFields_calBased_YM(TestISODateTimeFormat_Fields.java:236)

testForFields_calBased_MD(org.joda.time.format.TestISODateTimeFormat_Fields)  Time elapsed: 0.001 sec  <<< FAILURE!
junit.framework.ComparisonFailure: expected:<--06-[25]> but was:<--06-[��]>
	at junit.framework.Assert.assertEquals(Assert.java:81)
	at junit.framework.Assert.assertEquals(Assert.java:87)
	at org.joda.time.format.TestISODateTimeFormat_Fields.testForFields_calBased_MD(TestISODateTimeFormat_Fields.java:264)

testForFields_calBased_YD(org.joda.time.format.TestISODateTimeFormat_Fields)  Time elapsed: 0.001 sec  <<< FAILURE!
junit.framework.ComparisonFailure: expected:<2005--[25]> but was:<2005--[��]>
	at junit.framework.Assert.assertEquals(Assert.java:81)
	at junit.framework.Assert.assertEquals(Assert.java:87)
	at org.joda.time.format.TestISODateTimeFormat_Fields.testForFields_calBased_YD(TestISODateTimeFormat_Fields.java:292)

testForFields_weekBased_YWD(org.joda.time.format.TestISODateTimeFormat_Fields)  Time elapsed: 0 sec  <<< FAILURE!
junit.framework.ComparisonFailure: expected:<2005-W[08]-5> but was:<2005-W[��]-5>
	at junit.framework.Assert.assertEquals(Assert.java:81)
	at junit.framework.Assert.assertEquals(Assert.java:87)
	at org.joda.time.format.TestISODateTimeFormat_Fields.testForFields_weekBased_YWD(TestISODateTimeFormat_Fields.java:325)


Results :

Failed tests: 
  org.joda.time.TestMonthDay_Basics#testToString ComparisonFailure expected:<--0...
  org.joda.time.TestMonthDay_Basics#testToString_DTFormatter ComparisonFailure e...
  org.joda.time.TestMonthDay_Basics#testToString_String ComparisonFailure expect...
  org.joda.time.TestMonthDay_Basics#testToString_String_Locale ComparisonFailure
  org.joda.time.TestPartial_Basics#testGetFormatter1 ComparisonFailure expected:...
  org.joda.time.TestPartial_Basics#testToString1 ComparisonFailure expected:<10:...
  org.joda.time.TestPartial_Basics#testToString3 ComparisonFailure expected:<200...
  org.joda.time.TestPartial_Basics#testToString_DTFormatter ComparisonFailure ex...
  org.joda.time.TestPartial_Basics#testToString_String ComparisonFailure expecte...
  org.joda.time.TestPartial_Basics#testToString_String_Locale ComparisonFailure ...
  org.joda.time.TestStringConvert#testMonthDay ComparisonFailure expected:<--06-...
  org.joda.time.TestStringConvert#testMonthDay_leapDay ComparisonFailure expecte...
  org.joda.time.TestStringConvert#testYearMonth ComparisonFailure expected:<2010...
  org.joda.time.TestTimeOfDay_Basics#testToString ComparisonFailure expected:<T1...
  org.joda.time.TestTimeOfDay_Basics#testToString_DTFormatter ComparisonFailure ...
  org.joda.time.TestTimeOfDay_Basics#testToString_String ComparisonFailure expec...
  org.joda.time.TestTimeOfDay_Basics#testToString_String_Locale ComparisonFailure
  org.joda.time.TestYearMonthDay_Basics#testToString ComparisonFailure expected:...
  org.joda.time.TestYearMonthDay_Basics#testToString_DTFormatter ComparisonFailure
  org.joda.time.TestYearMonthDay_Basics#testToString_String ComparisonFailure ex...
  org.joda.time.TestYearMonthDay_Basics#testToString_String_Locale ComparisonFailure
  org.joda.time.TestYearMonth_Basics#testToString ComparisonFailure expected:<20...
  org.joda.time.TestYearMonth_Basics#testToString_DTFormatter ComparisonFailure ...
  org.joda.time.TestYearMonth_Basics#testToString_String ComparisonFailure expec...
  org.joda.time.TestYearMonth_Basics#testToString_String_Locale ComparisonFailure
  org.joda.time.format.TestDateTimeFormatter#testPrint_bufferMethods ComparisonFailure
  org.joda.time.format.TestDateTimeFormatter#testPrint_writerMethods ComparisonFailure
  org.joda.time.format.TestISODateTimeFormat#testFormat_date_partial ComparisonFailure
  org.joda.time.format.TestISODateTimeFormat#testFormat_timeNoMillis_partial ComparisonFailure
  org.joda.time.format.TestISODateTimeFormat#testFormat_time_partial ComparisonFailure
  org.joda.time.format.TestISODateTimeFormat_Fields#testForFields_calBased_MD ComparisonFailure
  org.joda.time.format.TestISODateTimeFormat_Fields#testForFields_calBased_YD ComparisonFailure
  org.joda.time.format.TestISODateTimeFormat_Fields#testForFields_calBased_YM ComparisonFailure
  org.joda.time.format.TestISODateTimeFormat_Fields#testForFields_calBased_YMD ComparisonFailure
  org.joda.time.format.TestISODateTimeFormat_Fields#testForFields_calBased_YMD_duplicates ComparisonFailure
  org.joda.time.format.TestISODateTimeFormat_Fields#testForFields_calBased_YMD_unmodifiable ComparisonFailure
  org.joda.time.format.TestISODateTimeFormat_Fields#testForFields_datetime_DH ComparisonFailure
  org.joda.time.format.TestISODateTimeFormat_Fields#testForFields_datetime_DM ComparisonFailure
  org.joda.time.format.TestISODateTimeFormat_Fields#testForFields_datetime_YH ComparisonFailure
  org.joda.time.format.TestISODateTimeFormat_Fields#testForFields_datetime_YMDH ComparisonFailure
  org.joda.time.format.TestISODateTimeFormat_Fields#testForFields_ordinalBased_YD ComparisonFailure
  org.joda.time.format.TestISODateTimeFormat_Fields#testForFields_time_HM ComparisonFailure
  org.joda.time.format.TestISODateTimeFormat_Fields#testForFields_time_HMS ComparisonFailure
  org.joda.time.format.TestISODateTimeFormat_Fields#testForFields_time_HMSm ComparisonFailure
  org.joda.time.format.TestISODateTimeFormat_Fields#testForFields_time_HMm ComparisonFailure
  org.joda.time.format.TestISODateTimeFormat_Fields#testForFields_time_HS ComparisonFailure
  org.joda.time.format.TestISODateTimeFormat_Fields#testForFields_time_HSm ComparisonFailure
  org.joda.time.format.TestISODateTimeFormat_Fields#testForFields_time_Hm ComparisonFailure
  org.joda.time.format.TestISODateTimeFormat_Fields#testForFields_time_MS ComparisonFailure
  org.joda.time.format.TestISODateTimeFormat_Fields#testForFields_time_MSm ComparisonFailure
  org.joda.time.format.TestISODateTimeFormat_Fields#testForFields_time_Mm ComparisonFailure
  org.joda.time.format.TestISODateTimeFormat_Fields#testForFields_time_Sm ComparisonFailure
  org.joda.time.format.TestISODateTimeFormat_Fields#testForFields_weekBased_WD ComparisonFailure
  org.joda.time.format.TestISODateTimeFormat_Fields#testForFields_weekBased_YD ComparisonFailure
  org.joda.time.format.TestISODateTimeFormat_Fields#testForFields_weekBased_YW ComparisonFailure
  org.joda.time.format.TestISODateTimeFormat_Fields#testForFields_weekBased_YWD ComparisonFailure
Tests in error: 
  org.joda.time.TestLocalDate_Constructors#testConstructor_ObjectYearMonthDay IllegalArgumentException
  org.joda.time.TestLocalTime_Constructors#testConstructor_ObjectTimeOfDay IllegalArgumentException
  org.joda.time.TestMonthDay_Basics#testGet IllegalArgumentException Field 'dayO...
  org.joda.time.TestMonthDay_Basics#testProperty IllegalArgumentException Field ...
  org.joda.time.TestMonthDay_Basics#testWithField_nullField ArrayIndexOutOfBoundsException
  org.joda.time.TestMonthDay_Basics#testWithField_unknownField ArrayIndexOutOfBoundsException
  org.joda.time.TestMonthDay_Properties#testPropertyCompareToDayOfMonth IllegalArgumentException
  org.joda.time.TestPartial_Basics#testGet IllegalArgumentException Field 'minut...
  org.joda.time.TestPartial_Basics#testMinus_RP IllegalArgumentException Field '...
  org.joda.time.TestPartial_Basics#testPlus_RP IllegalArgumentException Field 'm...
  org.joda.time.TestPartial_Basics#testProperty IllegalArgumentException Field '...
  org.joda.time.TestPartial_Basics#testToDateTime_RI IllegalArgumentException Fi...
  org.joda.time.TestPartial_Basics#testToDateTime_nullRI IllegalArgumentException
  org.joda.time.TestPartial_Basics#testWith1 IllegalArgumentException Field 'min...
  org.joda.time.TestPartial_Basics#testWith2 IllegalArgumentException Field 'min...
  org.joda.time.TestPartial_Basics#testWith3 IllegalArgumentException Field 'min...
  org.joda.time.TestPartial_Basics#testWith3a IllegalArgumentException Field 'mi...
  org.joda.time.TestPartial_Basics#testWith3b IllegalArgumentException Field 'mi...
  org.joda.time.TestPartial_Basics#testWith3c IllegalArgumentException Field 'mi...
  org.joda.time.TestPartial_Basics#testWith3d IllegalArgumentException Field 'mo...
  org.joda.time.TestPartial_Basics#testWith3e IllegalArgumentException Field 'ha...
  org.joda.time.TestPartial_Basics#testWith3f IllegalArgumentException Field 'ha...
  org.joda.time.TestPartial_Basics#testWithChronologyRetainFields_Chrono IllegalArgumentException
  org.joda.time.TestPartial_Basics#testWithChronologyRetainFields_nullChrono IllegalArgumentException
  org.joda.time.TestPartial_Basics#testWithField1 IllegalArgumentException Field...
  org.joda.time.TestPartial_Basics#testWithField2 ArrayIndexOutOfBoundsException
  org.joda.time.TestPartial_Basics#testWithField3 ArrayIndexOutOfBoundsException
  org.joda.time.TestPartial_Basics#testWithFieldAddWrapped1 IllegalArgumentException
  org.joda.time.TestPartial_Basics#testWithFieldAddWrapped2 IllegalArgumentException
  org.joda.time.TestPartial_Basics#testWithFieldAddWrapped3 IllegalArgumentException
  org.joda.time.TestPartial_Basics#testWithFieldAddWrapped5 IllegalArgumentException
  org.joda.time.TestPartial_Basics#testWithFieldAddWrapped6 IllegalArgumentException
  org.joda.time.TestPartial_Basics#testWithFieldAddWrapped7 IllegalArgumentException
  org.joda.time.TestPartial_Basics#testWithFieldAddWrapped8 IllegalArgumentException
  org.joda.time.TestPartial_Basics#testWithFieldAdded1 IllegalArgumentException ...
  org.joda.time.TestPartial_Basics#testWithFieldAdded2 IllegalArgumentException ...
  org.joda.time.TestPartial_Basics#testWithFieldAdded3 IllegalArgumentException ...
  org.joda.time.TestPartial_Basics#testWithFieldAdded5 IllegalArgumentException ...
  org.joda.time.TestPartial_Basics#testWithFieldAdded6 IllegalArgumentException ...
  org.joda.time.TestPartial_Basics#testWithFieldAdded7 IllegalArgumentException ...
  org.joda.time.TestPartial_Basics#testWithFieldAdded8 IllegalArgumentException ...
  org.joda.time.TestPartial_Basics#testWithout1 IllegalArgumentException Field '...
  org.joda.time.TestPartial_Basics#testWithout2 IllegalArgumentException Field '...
  org.joda.time.TestPartial_Basics#testWithout3 IllegalArgumentException Field '...
  org.joda.time.TestPartial_Basics#testWithout4 IllegalArgumentException Field '...
  org.joda.time.TestPartial_Constructors#testConstructor_Partial IllegalArgumentException
  org.joda.time.TestPartial_Constructors#testConstructor_TypeArray_intArray IllegalArgumentException
  org.joda.time.TestPartial_Constructors#testConstructor_TypeArray_intArray_Chrono IllegalArgumentException
  org.joda.time.TestPartial_Constructors#testConstructor_TypeArray_intArray_year_weekyear IllegalArgumentException
  org.joda.time.TestPartial_Properties#testPropertyAddHour IllegalArgumentException
  org.joda.time.TestPartial_Properties#testPropertyAddMinute IllegalArgumentException
  org.joda.time.TestPartial_Properties#testPropertyAddWrapFieldHour IllegalArgumentException
  org.joda.time.TestPartial_Properties#testPropertyAddWrapFieldMinute IllegalArgumentException
  org.joda.time.TestPartial_Properties#testPropertyCompareToMinute IllegalArgumentException
  org.joda.time.TestPartial_Properties#testPropertyGetMaxMinValuesMinute IllegalArgumentException
  org.joda.time.TestPartial_Properties#testPropertyGetMinute IllegalArgumentException
  org.joda.time.TestPartial_Properties#testPropertySetHour IllegalArgumentException
  org.joda.time.TestPartial_Properties#testPropertySetMinute IllegalArgumentException
  org.joda.time.TestPartial_Properties#testPropertySetTextHour IllegalArgumentException
  org.joda.time.TestPartial_Properties#testPropertySetTextMinute IllegalArgumentException
  org.joda.time.TestPartial_Properties#testPropertyWithMaximumValueHour IllegalArgumentException
  org.joda.time.TestPartial_Properties#testPropertyWithMinimumValueHour IllegalArgumentException
  org.joda.time.TestTimeOfDay_Basics#testGet IllegalArgumentException Field 'min...
  org.joda.time.TestTimeOfDay_Basics#testProperty IllegalArgumentException Field...
  org.joda.time.TestTimeOfDay_Basics#testWithField2 ArrayIndexOutOfBoundsException
  org.joda.time.TestTimeOfDay_Basics#testWithField3 ArrayIndexOutOfBoundsException
  org.joda.time.TestTimeOfDay_Constructors#testConstructor_todObject IllegalArgumentException
  org.joda.time.TestTimeOfDay_Properties#testPropertyCompareToMinute IllegalArgumentException
  org.joda.time.TestYearMonthDay_Basics#testGet IllegalArgumentException Field '...
  org.joda.time.TestYearMonthDay_Basics#testProperty IllegalArgumentException Fi...
  org.joda.time.TestYearMonthDay_Basics#testWithField2 ArrayIndexOutOfBoundsException
  org.joda.time.TestYearMonthDay_Basics#testWithField3 ArrayIndexOutOfBoundsException
  org.joda.time.TestYearMonthDay_Properties#testPropertyAddWrapFieldDay IllegalArgumentException
  org.joda.time.TestYearMonthDay_Properties#testPropertyCompareToMonth IllegalArgumentException
  org.joda.time.TestYearMonthDay_Properties#testPropertyGetMaxMinValuesDay IllegalArgumentException
  org.joda.time.TestYearMonthDay_Properties#testPropertyWithMaximumValueDayOfMonth IllegalArgumentException
  org.joda.time.TestYearMonth_Basics#testGet IllegalArgumentException Field 'mon...
  org.joda.time.TestYearMonth_Basics#testProperty IllegalArgumentException Field...
  org.joda.time.TestYearMonth_Basics#testWithField_nullField ArrayIndexOutOfBoundsException
  org.joda.time.TestYearMonth_Basics#testWithField_unknownField ArrayIndexOutOfBoundsException
  org.joda.time.TestYearMonth_Properties#testPropertyCompareToMonth IllegalArgumentException
  org.joda.time.chrono.TestGregorianChronology#testMaximumValue IllegalArgumentException
  org.joda.time.chrono.TestISOChronology#testMaximumValue IllegalArgumentException
  org.joda.time.convert.TestReadablePartialConverter#testGetPartialValues IllegalArgumentException

Tests run: 4157, Failures: 56, Errors: 84, Skipped: 0

[INFO] ------------------------------------------------------------------------
[INFO] BUILD FAILURE
[INFO] ------------------------------------------------------------------------
[INFO] Total time: 16.358s
[INFO] Finished at: Wed Aug 05 20:43:29 BST 2015
[INFO] Final Memory: 8M/210M
[INFO] ------------------------------------------------------------------------
[ERROR] Failed to execute goal org.apache.maven.plugins:maven-surefire-plugin:2.18.1:test (default-test) on project joda-time: There are test failures.
[ERROR] 
[ERROR] Please refer to /home/perham/Study/LittleDarwin/Cases/joda-time-2.8.1/target/surefire-reports for the individual test results.
[ERROR] -> [Help 1]
[ERROR] 
[ERROR] To see the full stack trace of the errors, re-run Maven with the -e switch.
[ERROR] Re-run Maven using the -X switch to enable full debug logging.
[ERROR] 
[ERROR] For more information about the errors and possible solutions, please read the following articles:
[ERROR] [Help 1] http://cwiki.apache.org/confluence/display/MAVEN/MojoFailureException
