[INFO] Scanning for projects...
[INFO]                                                                         
[INFO] ------------------------------------------------------------------------
[INFO] Building Joda-Time 2.8.1
[INFO] ------------------------------------------------------------------------
[INFO] 
[INFO] --- maven-resources-plugin:2.7:resources (default-resources) @ joda-time ---
[INFO] Using 'UTF-8' encoding to copy filtered resources.
[INFO] Copying 2 resources to META-INF
[INFO] Copying 10 resources
[INFO] 
[INFO] --- maven-compiler-plugin:3.3:compile (default-compile) @ joda-time ---
[INFO] Changes detected - recompiling the module!
[INFO] Compiling 166 source files to /home/perham/Study/LittleDarwin/Cases/joda-time-2.8.1/target/classes
[INFO] 
[INFO] --- exec-maven-plugin:1.4.0:java (compile-tzdb) @ joda-time ---
Writing zoneinfo files
Writing ZoneInfoMap
[INFO] 
[INFO] --- maven-resources-plugin:2.7:testResources (default-testResources) @ joda-time ---
[INFO] Using 'UTF-8' encoding to copy filtered resources.
[INFO] Copying 34 resources
[INFO] 
[INFO] --- maven-compiler-plugin:3.3:testCompile (default-testCompile) @ joda-time ---
[INFO] Nothing to compile - all classes are up to date
[INFO] 
[INFO] --- maven-surefire-plugin:2.18.1:test (default-test) @ joda-time ---
[INFO] Surefire report directory: /home/perham/Study/LittleDarwin/Cases/joda-time-2.8.1/target/surefire-reports

-------------------------------------------------------
 T E S T S
-------------------------------------------------------
Running org.joda.time.TestAllPackages

TestBuddhistChronology.testCalendar

TestCopticChronology.testCalendar

TestEthiopicChronology.testCalendar

TestIslamicChronology.testCalendar

Testing Gregorian chronology over 1000 iterations
100% complete (i=1000)

Testing Julian chronology over 1000 iterations
100% complete (i=1000)
Writing zoneinfo files
Writing ZoneInfoMap
Tests run: 4157, Failures: 0, Errors: 16, Skipped: 0, Time elapsed: 5.191 sec <<< FAILURE! - in org.joda.time.TestAllPackages
testSerialization(org.joda.time.TestLocalDateTime_Basics)  Time elapsed: 0.006 sec  <<< ERROR!
java.lang.IndexOutOfBoundsException: Invalid index: -1
	at org.joda.time.LocalDateTime.getField(LocalDateTime.java:562)
	at org.joda.time.base.AbstractPartial.getField(AbstractPartial.java:27)
	at org.joda.time.base.AbstractPartial.getFields(AbstractPartial.java:31)
	at org.joda.time.TestLocalDateTime_Basics.testSerialization(TestLocalDateTime_Basics.java:1064)

testGetFields(org.joda.time.TestLocalDateTime_Basics)  Time elapsed: 0.001 sec  <<< ERROR!
java.lang.IndexOutOfBoundsException: Invalid index: -1
	at org.joda.time.LocalDateTime.getField(LocalDateTime.java:562)
	at org.joda.time.base.AbstractPartial.getField(AbstractPartial.java:27)
	at org.joda.time.base.AbstractPartial.getFields(AbstractPartial.java:31)
	at org.joda.time.TestLocalDateTime_Basics.testGetFields(TestLocalDateTime_Basics.java:201)

testSerialization(org.joda.time.TestLocalDate_Basics)  Time elapsed: 0.003 sec  <<< ERROR!
java.lang.IndexOutOfBoundsException: Invalid index: -1
	at org.joda.time.LocalDate.getField(LocalDate.java:507)
	at org.joda.time.base.AbstractPartial.getField(AbstractPartial.java:27)
	at org.joda.time.base.AbstractPartial.getFields(AbstractPartial.java:31)
	at org.joda.time.TestLocalDate_Basics.testSerialization(TestLocalDate_Basics.java:1119)

testGetFields(org.joda.time.TestLocalDate_Basics)  Time elapsed: 0 sec  <<< ERROR!
java.lang.IndexOutOfBoundsException: Invalid index: -1
	at org.joda.time.LocalDate.getField(LocalDate.java:507)
	at org.joda.time.base.AbstractPartial.getField(AbstractPartial.java:27)
	at org.joda.time.base.AbstractPartial.getFields(AbstractPartial.java:31)
	at org.joda.time.TestLocalDate_Basics.testGetFields(TestLocalDate_Basics.java:182)

testSerialization(org.joda.time.TestLocalTime_Basics)  Time elapsed: 0.003 sec  <<< ERROR!
java.lang.IndexOutOfBoundsException: Invalid index: -1
	at org.joda.time.LocalTime.getField(LocalTime.java:558)
	at org.joda.time.base.AbstractPartial.getField(AbstractPartial.java:27)
	at org.joda.time.base.AbstractPartial.getFields(AbstractPartial.java:31)
	at org.joda.time.TestLocalTime_Basics.testSerialization(TestLocalTime_Basics.java:779)

testGetFields(org.joda.time.TestLocalTime_Basics)  Time elapsed: 0 sec  <<< ERROR!
java.lang.IndexOutOfBoundsException: Invalid index: -1
	at org.joda.time.LocalTime.getField(LocalTime.java:558)
	at org.joda.time.base.AbstractPartial.getField(AbstractPartial.java:27)
	at org.joda.time.base.AbstractPartial.getFields(AbstractPartial.java:31)
	at org.joda.time.TestLocalTime_Basics.testGetFields(TestLocalTime_Basics.java:177)

testSerialization(org.joda.time.TestTimeOfDay_Basics)  Time elapsed: 0.007 sec  <<< ERROR!
java.lang.IndexOutOfBoundsException: Invalid index: -1
	at org.joda.time.TimeOfDay.getField(TimeOfDay.java:452)
	at org.joda.time.base.AbstractPartial.getField(AbstractPartial.java:27)
	at org.joda.time.base.AbstractPartial.getFields(AbstractPartial.java:31)
	at org.joda.time.TestTimeOfDay_Basics.testSerialization(TestTimeOfDay_Basics.java:866)

testGetFields(org.joda.time.TestTimeOfDay_Basics)  Time elapsed: 0.001 sec  <<< ERROR!
java.lang.IndexOutOfBoundsException: Invalid index: -1
	at org.joda.time.TimeOfDay.getField(TimeOfDay.java:452)
	at org.joda.time.base.AbstractPartial.getField(AbstractPartial.java:27)
	at org.joda.time.base.AbstractPartial.getFields(AbstractPartial.java:31)
	at org.joda.time.TestTimeOfDay_Basics.testGetFields(TestTimeOfDay_Basics.java:156)

testSerialization(org.joda.time.TestYearMonthDay_Basics)  Time elapsed: 0 sec  <<< ERROR!
java.lang.IndexOutOfBoundsException: Invalid index: -1
	at org.joda.time.YearMonthDay.getField(YearMonthDay.java:339)
	at org.joda.time.base.AbstractPartial.getField(AbstractPartial.java:27)
	at org.joda.time.base.AbstractPartial.getFields(AbstractPartial.java:31)
	at org.joda.time.TestYearMonthDay_Basics.testSerialization(TestYearMonthDay_Basics.java:792)

testGetFields(org.joda.time.TestYearMonthDay_Basics)  Time elapsed: 0.001 sec  <<< ERROR!
java.lang.IndexOutOfBoundsException: Invalid index: -1
	at org.joda.time.YearMonthDay.getField(YearMonthDay.java:339)
	at org.joda.time.base.AbstractPartial.getField(AbstractPartial.java:27)
	at org.joda.time.base.AbstractPartial.getFields(AbstractPartial.java:31)
	at org.joda.time.TestYearMonthDay_Basics.testGetFields(TestYearMonthDay_Basics.java:141)

testSerialization(org.joda.time.TestYearMonth_Basics)  Time elapsed: 0.004 sec  <<< ERROR!
java.lang.IndexOutOfBoundsException: Invalid index: -1
	at org.joda.time.YearMonth.getField(YearMonth.java:406)
	at org.joda.time.base.AbstractPartial.getField(AbstractPartial.java:27)
	at org.joda.time.base.AbstractPartial.getFields(AbstractPartial.java:31)
	at org.joda.time.TestYearMonth_Basics.testSerialization(TestYearMonth_Basics.java:616)

testGetFields(org.joda.time.TestYearMonth_Basics)  Time elapsed: 0 sec  <<< ERROR!
java.lang.IndexOutOfBoundsException: Invalid index: -1
	at org.joda.time.YearMonth.getField(YearMonth.java:406)
	at org.joda.time.base.AbstractPartial.getField(AbstractPartial.java:27)
	at org.joda.time.base.AbstractPartial.getFields(AbstractPartial.java:31)
	at org.joda.time.TestYearMonth_Basics.testGetFields(TestYearMonth_Basics.java:142)

testSerialization(org.joda.time.TestMonthDay_Basics)  Time elapsed: 0.004 sec  <<< ERROR!
java.lang.IndexOutOfBoundsException: Invalid index: -1
	at org.joda.time.MonthDay.getField(MonthDay.java:414)
	at org.joda.time.base.AbstractPartial.getField(AbstractPartial.java:27)
	at org.joda.time.base.AbstractPartial.getFields(AbstractPartial.java:31)
	at org.joda.time.TestMonthDay_Basics.testSerialization(TestMonthDay_Basics.java:782)

testGetFields(org.joda.time.TestMonthDay_Basics)  Time elapsed: 0.001 sec  <<< ERROR!
java.lang.IndexOutOfBoundsException: Invalid index: -1
	at org.joda.time.MonthDay.getField(MonthDay.java:414)
	at org.joda.time.base.AbstractPartial.getField(AbstractPartial.java:27)
	at org.joda.time.base.AbstractPartial.getFields(AbstractPartial.java:31)
	at org.joda.time.TestMonthDay_Basics.testGetFields(TestMonthDay_Basics.java:141)

testSerialization(org.joda.time.TestPartial_Basics)  Time elapsed: 0.004 sec  <<< ERROR!
java.lang.ArrayIndexOutOfBoundsException: -1
	at org.joda.time.Partial.getField(Partial.java:358)
	at org.joda.time.base.AbstractPartial.getField(AbstractPartial.java:27)
	at org.joda.time.base.AbstractPartial.getFields(AbstractPartial.java:31)
	at org.joda.time.TestPartial_Basics.testSerialization(TestPartial_Basics.java:794)

testGetFields(org.joda.time.TestPartial_Basics)  Time elapsed: 0.001 sec  <<< ERROR!
java.lang.ArrayIndexOutOfBoundsException: -1
	at org.joda.time.Partial.getField(Partial.java:358)
	at org.joda.time.base.AbstractPartial.getField(AbstractPartial.java:27)
	at org.joda.time.base.AbstractPartial.getFields(AbstractPartial.java:31)
	at org.joda.time.TestPartial_Basics.testGetFields(TestPartial_Basics.java:145)


Results :

Tests in error: 
  org.joda.time.TestLocalDateTime_Basics#testGetFields IndexOutOfBoundsException
  org.joda.time.TestLocalDateTime_Basics#testSerialization IndexOutOfBoundsException
  org.joda.time.TestLocalDate_Basics#testGetFields IndexOutOfBoundsException Inv...
  org.joda.time.TestLocalDate_Basics#testSerialization IndexOutOfBoundsException
  org.joda.time.TestLocalTime_Basics#testGetFields IndexOutOfBoundsException Inv...
  org.joda.time.TestLocalTime_Basics#testSerialization IndexOutOfBoundsException
  org.joda.time.TestMonthDay_Basics#testGetFields IndexOutOfBoundsException Inva...
  org.joda.time.TestMonthDay_Basics#testSerialization IndexOutOfBoundsException ...
  org.joda.time.TestPartial_Basics#testGetFields ArrayIndexOutOfBoundsException ...
  org.joda.time.TestPartial_Basics#testSerialization ArrayIndexOutOfBoundsException
  org.joda.time.TestTimeOfDay_Basics#testGetFields IndexOutOfBoundsException Inv...
  org.joda.time.TestTimeOfDay_Basics#testSerialization IndexOutOfBoundsException
  org.joda.time.TestYearMonthDay_Basics#testGetFields IndexOutOfBoundsException ...
  org.joda.time.TestYearMonthDay_Basics#testSerialization IndexOutOfBoundsException
  org.joda.time.TestYearMonth_Basics#testGetFields IndexOutOfBoundsException Inv...
  org.joda.time.TestYearMonth_Basics#testSerialization IndexOutOfBoundsException

Tests run: 4157, Failures: 0, Errors: 16, Skipped: 0

[INFO] ------------------------------------------------------------------------
[INFO] BUILD FAILURE
[INFO] ------------------------------------------------------------------------
[INFO] Total time: 15.536s
[INFO] Finished at: Wed Aug 05 20:41:57 BST 2015
[INFO] Final Memory: 9M/213M
[INFO] ------------------------------------------------------------------------
[ERROR] Failed to execute goal org.apache.maven.plugins:maven-surefire-plugin:2.18.1:test (default-test) on project joda-time: There are test failures.
[ERROR] 
[ERROR] Please refer to /home/perham/Study/LittleDarwin/Cases/joda-time-2.8.1/target/surefire-reports for the individual test results.
[ERROR] -> [Help 1]
[ERROR] 
[ERROR] To see the full stack trace of the errors, re-run Maven with the -e switch.
[ERROR] Re-run Maven using the -X switch to enable full debug logging.
[ERROR] 
[ERROR] For more information about the errors and possible solutions, please read the following articles:
[ERROR] [Help 1] http://cwiki.apache.org/confluence/display/MAVEN/MojoFailureException
