[INFO] Scanning for projects...
[INFO]                                                                         
[INFO] ------------------------------------------------------------------------
[INFO] Building Joda-Time 2.8.1
[INFO] ------------------------------------------------------------------------
[INFO] 
[INFO] --- maven-resources-plugin:2.7:resources (default-resources) @ joda-time ---
[INFO] Using 'UTF-8' encoding to copy filtered resources.
[INFO] Copying 2 resources to META-INF
[INFO] Copying 10 resources
[INFO] 
[INFO] --- maven-compiler-plugin:3.3:compile (default-compile) @ joda-time ---
[INFO] Changes detected - recompiling the module!
[INFO] Compiling 166 source files to /home/perham/Study/LittleDarwin/Cases/joda-time-2.8.1/target/classes
[INFO] 
[INFO] --- exec-maven-plugin:1.4.0:java (compile-tzdb) @ joda-time ---
Writing zoneinfo files
Writing ZoneInfoMap
[INFO] 
[INFO] --- maven-resources-plugin:2.7:testResources (default-testResources) @ joda-time ---
[INFO] Using 'UTF-8' encoding to copy filtered resources.
[INFO] Copying 34 resources
[INFO] 
[INFO] --- maven-compiler-plugin:3.3:testCompile (default-testCompile) @ joda-time ---
[INFO] Nothing to compile - all classes are up to date
[INFO] 
[INFO] --- maven-surefire-plugin:2.18.1:test (default-test) @ joda-time ---
[INFO] Surefire report directory: /home/perham/Study/LittleDarwin/Cases/joda-time-2.8.1/target/surefire-reports

-------------------------------------------------------
 T E S T S
-------------------------------------------------------
Running org.joda.time.TestAllPackages

TestBuddhistChronology.testCalendar

TestCopticChronology.testCalendar

TestEthiopicChronology.testCalendar

TestIslamicChronology.testCalendar

Testing Gregorian chronology over 1000 iterations
100% complete (i=1000)

Testing Julian chronology over 1000 iterations
100% complete (i=1000)
Writing zoneinfo files
Writing ZoneInfoMap
Tests run: 4157, Failures: 0, Errors: 177, Skipped: 0, Time elapsed: 5.223 sec <<< FAILURE! - in org.joda.time.TestAllPackages
testCompareTo(org.joda.time.TestLocalDateTime_Basics)  Time elapsed: 0.004 sec  <<< ERROR!
java.lang.ArrayIndexOutOfBoundsException: -1
	at org.joda.time.Partial.getFieldType(Partial.java:369)
	at org.joda.time.base.AbstractPartial.indexOf(AbstractPartial.java:42)
	at org.joda.time.Partial.with(Partial.java:455)
	at org.joda.time.TestLocalDateTime_Basics.testCompareTo(TestLocalDateTime_Basics.java:377)

testConstructor_ObjectYearMonthDay(org.joda.time.TestLocalDate_Constructors)  Time elapsed: 0.001 sec  <<< ERROR!
java.lang.ArrayIndexOutOfBoundsException: -1
	at org.joda.time.YearMonthDay.getFieldType(YearMonthDay.java:351)
	at org.joda.time.base.AbstractPartial.indexOf(AbstractPartial.java:42)
	at org.joda.time.base.AbstractPartial.indexOfSupported(AbstractPartial.java:44)
	at org.joda.time.base.AbstractPartial.get(AbstractPartial.java:38)
	at org.joda.time.convert.ReadablePartialConverter.getPartialValues(ReadablePartialConverter.java:91)
	at org.joda.time.convert.AbstractConverter.getPartialValues(AbstractConverter.java:123)
	at org.joda.time.LocalDate.<init>(LocalDate.java:419)
	at org.joda.time.LocalDate.<init>(LocalDate.java:363)
	at org.joda.time.TestLocalDate_Constructors.testConstructor_ObjectYearMonthDay(TestLocalDate_Constructors.java:434)

testCompareTo(org.joda.time.TestLocalDate_Basics)  Time elapsed: 0.003 sec  <<< ERROR!
java.lang.ArrayIndexOutOfBoundsException: -1
	at org.joda.time.Partial.getFieldType(Partial.java:369)
	at org.joda.time.base.AbstractPartial.indexOf(AbstractPartial.java:42)
	at org.joda.time.Partial.with(Partial.java:455)
	at org.joda.time.TestLocalDate_Basics.testCompareTo(TestLocalDate_Basics.java:363)

testConstructor_ObjectTimeOfDay(org.joda.time.TestLocalTime_Constructors)  Time elapsed: 0.001 sec  <<< ERROR!
java.lang.ArrayIndexOutOfBoundsException: -1
	at org.joda.time.TimeOfDay.getFieldType(TimeOfDay.java:464)
	at org.joda.time.base.AbstractPartial.indexOf(AbstractPartial.java:42)
	at org.joda.time.base.AbstractPartial.indexOfSupported(AbstractPartial.java:44)
	at org.joda.time.base.AbstractPartial.get(AbstractPartial.java:38)
	at org.joda.time.convert.ReadablePartialConverter.getPartialValues(ReadablePartialConverter.java:91)
	at org.joda.time.convert.AbstractConverter.getPartialValues(AbstractConverter.java:123)
	at org.joda.time.LocalTime.<init>(LocalTime.java:435)
	at org.joda.time.LocalTime.<init>(LocalTime.java:383)
	at org.joda.time.TestLocalTime_Constructors.testConstructor_ObjectTimeOfDay(TestLocalTime_Constructors.java:491)

testConstructor_RP_RP7(org.joda.time.TestPeriod_Constructors)  Time elapsed: 0.001 sec  <<< ERROR!
java.lang.ArrayIndexOutOfBoundsException: -1
	at org.joda.time.Partial.getFieldType(Partial.java:369)
	at org.joda.time.base.AbstractPartial.indexOf(AbstractPartial.java:42)
	at org.joda.time.Partial.with(Partial.java:455)
	at org.joda.time.TestPeriod_Constructors.testConstructor_RP_RP7(TestPeriod_Constructors.java:889)

testConstructor_RP_RP8(org.joda.time.TestPeriod_Constructors)  Time elapsed: 0 sec  <<< ERROR!
java.lang.ArrayIndexOutOfBoundsException: -1
	at org.joda.time.Partial.getFieldType(Partial.java:369)
	at org.joda.time.base.AbstractPartial.indexOf(AbstractPartial.java:42)
	at org.joda.time.Partial.with(Partial.java:455)
	at org.joda.time.TestPeriod_Constructors.testConstructor_RP_RP8(TestPeriod_Constructors.java:898)

testConstructor_RP_RP_PeriodType7(org.joda.time.TestPeriod_Constructors)  Time elapsed: 0.001 sec  <<< ERROR!
java.lang.ArrayIndexOutOfBoundsException: -1
	at org.joda.time.Partial.getFieldType(Partial.java:369)
	at org.joda.time.base.AbstractPartial.indexOf(AbstractPartial.java:42)
	at org.joda.time.Partial.with(Partial.java:455)
	at org.joda.time.TestPeriod_Constructors.testConstructor_RP_RP_PeriodType7(TestPeriod_Constructors.java:995)

testConstructor_RP_RP_PeriodType8(org.joda.time.TestPeriod_Constructors)  Time elapsed: 0 sec  <<< ERROR!
java.lang.ArrayIndexOutOfBoundsException: -1
	at org.joda.time.Partial.getFieldType(Partial.java:369)
	at org.joda.time.base.AbstractPartial.indexOf(AbstractPartial.java:42)
	at org.joda.time.Partial.with(Partial.java:455)
	at org.joda.time.TestPeriod_Constructors.testConstructor_RP_RP_PeriodType8(TestPeriod_Constructors.java:1004)

testToString(org.joda.time.TestTimeOfDay_Basics)  Time elapsed: 0 sec  <<< ERROR!
java.lang.ArrayIndexOutOfBoundsException: -1
	at org.joda.time.TimeOfDay.getFieldType(TimeOfDay.java:464)
	at org.joda.time.base.AbstractPartial.indexOf(AbstractPartial.java:42)
	at org.joda.time.base.AbstractPartial.isSupported(AbstractPartial.java:39)
	at org.joda.time.format.DateTimeFormatterBuilder$PaddedNumber.printTo(DateTimeFormatterBuilder.java:1434)
	at org.joda.time.format.DateTimeFormatterBuilder$Composite.printTo(DateTimeFormatterBuilder.java:2446)
	at org.joda.time.format.DateTimeFormatter.printTo(DateTimeFormatter.java:609)
	at org.joda.time.format.DateTimeFormatter.print(DateTimeFormatter.java:663)
	at org.joda.time.TimeOfDay.toString(TimeOfDay.java:1004)
	at org.joda.time.TestTimeOfDay_Basics.testToString(TestTimeOfDay_Basics.java:873)

testWithField2(org.joda.time.TestTimeOfDay_Basics)  Time elapsed: 0 sec  <<< ERROR!
java.lang.ArrayIndexOutOfBoundsException: -1
	at org.joda.time.TimeOfDay.getFieldType(TimeOfDay.java:464)
	at org.joda.time.base.AbstractPartial.indexOf(AbstractPartial.java:42)
	at org.joda.time.base.AbstractPartial.indexOfSupported(AbstractPartial.java:44)
	at org.joda.time.TimeOfDay.withField(TimeOfDay.java:524)
	at org.joda.time.TestTimeOfDay_Basics.testWithField2(TestTimeOfDay_Basics.java:384)

testToString_String(org.joda.time.TestTimeOfDay_Basics)  Time elapsed: 0.001 sec  <<< ERROR!
java.lang.ArrayIndexOutOfBoundsException: -1
	at org.joda.time.TimeOfDay.getFieldType(TimeOfDay.java:464)
	at org.joda.time.base.AbstractPartial.indexOf(AbstractPartial.java:42)
	at org.joda.time.base.AbstractPartial.isSupported(AbstractPartial.java:39)
	at org.joda.time.format.DateTimeFormatterBuilder$PaddedNumber.printTo(DateTimeFormatterBuilder.java:1434)
	at org.joda.time.format.DateTimeFormatterBuilder$Composite.printTo(DateTimeFormatterBuilder.java:2446)
	at org.joda.time.format.DateTimeFormatter.printTo(DateTimeFormatter.java:609)
	at org.joda.time.format.DateTimeFormatter.print(DateTimeFormatter.java:663)
	at org.joda.time.base.BasePartial.toString(BasePartial.java:295)
	at org.joda.time.TestTimeOfDay_Basics.testToString_String(TestTimeOfDay_Basics.java:879)

testToString_String_Locale(org.joda.time.TestTimeOfDay_Basics)  Time elapsed: 0 sec  <<< ERROR!
java.lang.ArrayIndexOutOfBoundsException: -1
	at org.joda.time.TimeOfDay.getFieldType(TimeOfDay.java:464)
	at org.joda.time.base.AbstractPartial.indexOf(AbstractPartial.java:42)
	at org.joda.time.base.AbstractPartial.isSupported(AbstractPartial.java:39)
	at org.joda.time.format.DateTimeFormatterBuilder$UnpaddedNumber.printTo(DateTimeFormatterBuilder.java:1394)
	at org.joda.time.format.DateTimeFormatterBuilder$Composite.printTo(DateTimeFormatterBuilder.java:2446)
	at org.joda.time.format.DateTimeFormatter.printTo(DateTimeFormatter.java:609)
	at org.joda.time.format.DateTimeFormatter.print(DateTimeFormatter.java:663)
	at org.joda.time.base.BasePartial.toString(BasePartial.java:309)
	at org.joda.time.TestTimeOfDay_Basics.testToString_String_Locale(TestTimeOfDay_Basics.java:886)

testToString_DTFormatter(org.joda.time.TestTimeOfDay_Basics)  Time elapsed: 0.001 sec  <<< ERROR!
java.lang.ArrayIndexOutOfBoundsException: -1
	at org.joda.time.TimeOfDay.getFieldType(TimeOfDay.java:464)
	at org.joda.time.base.AbstractPartial.indexOf(AbstractPartial.java:42)
	at org.joda.time.base.AbstractPartial.isSupported(AbstractPartial.java:39)
	at org.joda.time.format.DateTimeFormatterBuilder$PaddedNumber.printTo(DateTimeFormatterBuilder.java:1434)
	at org.joda.time.format.DateTimeFormatterBuilder$Composite.printTo(DateTimeFormatterBuilder.java:2446)
	at org.joda.time.format.DateTimeFormatter.printTo(DateTimeFormatter.java:609)
	at org.joda.time.format.DateTimeFormatter.print(DateTimeFormatter.java:663)
	at org.joda.time.base.AbstractPartial.toString(AbstractPartial.java:90)
	at org.joda.time.TestTimeOfDay_Basics.testToString_DTFormatter(TestTimeOfDay_Basics.java:895)

testProperty(org.joda.time.TestTimeOfDay_Basics)  Time elapsed: 0 sec  <<< ERROR!
java.lang.ArrayIndexOutOfBoundsException: -1
	at org.joda.time.TimeOfDay.getFieldType(TimeOfDay.java:464)
	at org.joda.time.base.AbstractPartial.indexOf(AbstractPartial.java:42)
	at org.joda.time.base.AbstractPartial.indexOfSupported(AbstractPartial.java:44)
	at org.joda.time.TimeOfDay.property(TimeOfDay.java:805)
	at org.joda.time.TestTimeOfDay_Basics.testProperty(TestTimeOfDay_Basics.java:836)

testIsSupported(org.joda.time.TestTimeOfDay_Basics)  Time elapsed: 0.004 sec  <<< ERROR!
java.lang.ArrayIndexOutOfBoundsException: -1
	at org.joda.time.TimeOfDay.getFieldType(TimeOfDay.java:464)
	at org.joda.time.base.AbstractPartial.indexOf(AbstractPartial.java:42)
	at org.joda.time.base.AbstractPartial.isSupported(AbstractPartial.java:39)
	at org.joda.time.TestTimeOfDay_Basics.testIsSupported(TestTimeOfDay_Basics.java:191)

testWithField3(org.joda.time.TestTimeOfDay_Basics)  Time elapsed: 0 sec  <<< ERROR!
java.lang.ArrayIndexOutOfBoundsException: -1
	at org.joda.time.TimeOfDay.getFieldType(TimeOfDay.java:464)
	at org.joda.time.base.AbstractPartial.indexOf(AbstractPartial.java:42)
	at org.joda.time.base.AbstractPartial.indexOfSupported(AbstractPartial.java:44)
	at org.joda.time.TimeOfDay.withField(TimeOfDay.java:524)
	at org.joda.time.TestTimeOfDay_Basics.testWithField3(TestTimeOfDay_Basics.java:392)

testGet(org.joda.time.TestTimeOfDay_Basics)  Time elapsed: 0 sec  <<< ERROR!
java.lang.ArrayIndexOutOfBoundsException: -1
	at org.joda.time.TimeOfDay.getFieldType(TimeOfDay.java:464)
	at org.joda.time.base.AbstractPartial.indexOf(AbstractPartial.java:42)
	at org.joda.time.base.AbstractPartial.indexOfSupported(AbstractPartial.java:44)
	at org.joda.time.base.AbstractPartial.get(AbstractPartial.java:38)
	at org.joda.time.TestTimeOfDay_Basics.testGet(TestTimeOfDay_Basics.java:98)

testConstructor_todObject(org.joda.time.TestTimeOfDay_Constructors)  Time elapsed: 0.008 sec  <<< ERROR!
java.lang.ArrayIndexOutOfBoundsException: -1
	at org.joda.time.TimeOfDay.getFieldType(TimeOfDay.java:464)
	at org.joda.time.base.AbstractPartial.indexOf(AbstractPartial.java:42)
	at org.joda.time.base.AbstractPartial.indexOfSupported(AbstractPartial.java:44)
	at org.joda.time.base.AbstractPartial.get(AbstractPartial.java:38)
	at org.joda.time.convert.ReadablePartialConverter.getPartialValues(ReadablePartialConverter.java:91)
	at org.joda.time.convert.AbstractConverter.getPartialValues(AbstractConverter.java:123)
	at org.joda.time.base.BasePartial.<init>(BasePartial.java:163)
	at org.joda.time.TimeOfDay.<init>(TimeOfDay.java:277)
	at org.joda.time.TestTimeOfDay_Constructors.testConstructor_todObject(TestTimeOfDay_Constructors.java:356)

testPropertyCompareToMilli(org.joda.time.TestTimeOfDay_Properties)  Time elapsed: 0.001 sec  <<< ERROR!
java.lang.ArrayIndexOutOfBoundsException: -1
	at org.joda.time.TimeOfDay.getFieldType(TimeOfDay.java:464)
	at org.joda.time.base.AbstractPartial.indexOf(AbstractPartial.java:42)
	at org.joda.time.base.AbstractPartial.indexOfSupported(AbstractPartial.java:44)
	at org.joda.time.base.AbstractPartial.get(AbstractPartial.java:38)
	at org.joda.time.field.AbstractPartialFieldProperty.compareTo(AbstractPartialFieldProperty.java:304)
	at org.joda.time.TestTimeOfDay_Properties.testPropertyCompareToMilli(TestTimeOfDay_Properties.java:710)

testPropertyCompareToMinute(org.joda.time.TestTimeOfDay_Properties)  Time elapsed: 0 sec  <<< ERROR!
java.lang.ArrayIndexOutOfBoundsException: -1
	at org.joda.time.TimeOfDay.getFieldType(TimeOfDay.java:464)
	at org.joda.time.base.AbstractPartial.indexOf(AbstractPartial.java:42)
	at org.joda.time.base.AbstractPartial.indexOfSupported(AbstractPartial.java:44)
	at org.joda.time.base.AbstractPartial.get(AbstractPartial.java:38)
	at org.joda.time.field.AbstractPartialFieldProperty.compareTo(AbstractPartialFieldProperty.java:304)
	at org.joda.time.TestTimeOfDay_Properties.testPropertyCompareToMinute(TestTimeOfDay_Properties.java:384)

testPropertyCompareToSecond(org.joda.time.TestTimeOfDay_Properties)  Time elapsed: 0.001 sec  <<< ERROR!
java.lang.ArrayIndexOutOfBoundsException: -1
	at org.joda.time.TimeOfDay.getFieldType(TimeOfDay.java:464)
	at org.joda.time.base.AbstractPartial.indexOf(AbstractPartial.java:42)
	at org.joda.time.base.AbstractPartial.indexOfSupported(AbstractPartial.java:44)
	at org.joda.time.base.AbstractPartial.get(AbstractPartial.java:38)
	at org.joda.time.field.AbstractPartialFieldProperty.compareTo(AbstractPartialFieldProperty.java:304)
	at org.joda.time.TestTimeOfDay_Properties.testPropertyCompareToSecond(TestTimeOfDay_Properties.java:550)

testToString(org.joda.time.TestYearMonthDay_Basics)  Time elapsed: 0.001 sec  <<< ERROR!
java.lang.ArrayIndexOutOfBoundsException: -1
	at org.joda.time.YearMonthDay.getFieldType(YearMonthDay.java:351)
	at org.joda.time.base.AbstractPartial.indexOf(AbstractPartial.java:42)
	at org.joda.time.base.AbstractPartial.isSupported(AbstractPartial.java:39)
	at org.joda.time.format.DateTimeFormatterBuilder$PaddedNumber.printTo(DateTimeFormatterBuilder.java:1434)
	at org.joda.time.format.DateTimeFormatterBuilder$Composite.printTo(DateTimeFormatterBuilder.java:2446)
	at org.joda.time.format.DateTimeFormatter.printTo(DateTimeFormatter.java:609)
	at org.joda.time.format.DateTimeFormatter.print(DateTimeFormatter.java:663)
	at org.joda.time.YearMonthDay.toString(YearMonthDay.java:919)
	at org.joda.time.TestYearMonthDay_Basics.testToString(TestYearMonthDay_Basics.java:799)

testWithField2(org.joda.time.TestYearMonthDay_Basics)  Time elapsed: 0 sec  <<< ERROR!
java.lang.ArrayIndexOutOfBoundsException: -1
	at org.joda.time.YearMonthDay.getFieldType(YearMonthDay.java:351)
	at org.joda.time.base.AbstractPartial.indexOf(AbstractPartial.java:42)
	at org.joda.time.base.AbstractPartial.indexOfSupported(AbstractPartial.java:44)
	at org.joda.time.YearMonthDay.withField(YearMonthDay.java:411)
	at org.joda.time.TestYearMonthDay_Basics.testWithField2(TestYearMonthDay_Basics.java:385)

testToString_String(org.joda.time.TestYearMonthDay_Basics)  Time elapsed: 0.001 sec  <<< ERROR!
java.lang.ArrayIndexOutOfBoundsException: -1
	at org.joda.time.YearMonthDay.getFieldType(YearMonthDay.java:351)
	at org.joda.time.base.AbstractPartial.indexOf(AbstractPartial.java:42)
	at org.joda.time.base.AbstractPartial.isSupported(AbstractPartial.java:39)
	at org.joda.time.format.DateTimeFormatterBuilder$PaddedNumber.printTo(DateTimeFormatterBuilder.java:1434)
	at org.joda.time.format.DateTimeFormatterBuilder$Composite.printTo(DateTimeFormatterBuilder.java:2446)
	at org.joda.time.format.DateTimeFormatter.printTo(DateTimeFormatter.java:609)
	at org.joda.time.format.DateTimeFormatter.print(DateTimeFormatter.java:663)
	at org.joda.time.base.BasePartial.toString(BasePartial.java:295)
	at org.joda.time.TestYearMonthDay_Basics.testToString_String(TestYearMonthDay_Basics.java:805)

testToString_String_Locale(org.joda.time.TestYearMonthDay_Basics)  Time elapsed: 0.001 sec  <<< ERROR!
java.lang.ArrayIndexOutOfBoundsException: -1
	at org.joda.time.YearMonthDay.getFieldType(YearMonthDay.java:351)
	at org.joda.time.base.AbstractPartial.indexOf(AbstractPartial.java:42)
	at org.joda.time.base.AbstractPartial.isSupported(AbstractPartial.java:39)
	at org.joda.time.format.DateTimeFormatterBuilder$UnpaddedNumber.printTo(DateTimeFormatterBuilder.java:1394)
	at org.joda.time.format.DateTimeFormatterBuilder$Composite.printTo(DateTimeFormatterBuilder.java:2446)
	at org.joda.time.format.DateTimeFormatter.printTo(DateTimeFormatter.java:609)
	at org.joda.time.format.DateTimeFormatter.print(DateTimeFormatter.java:663)
	at org.joda.time.base.BasePartial.toString(BasePartial.java:309)
	at org.joda.time.TestYearMonthDay_Basics.testToString_String_Locale(TestYearMonthDay_Basics.java:812)

testToString_DTFormatter(org.joda.time.TestYearMonthDay_Basics)  Time elapsed: 0.001 sec  <<< ERROR!
java.lang.ArrayIndexOutOfBoundsException: -1
	at org.joda.time.YearMonthDay.getFieldType(YearMonthDay.java:351)
	at org.joda.time.base.AbstractPartial.indexOf(AbstractPartial.java:42)
	at org.joda.time.base.AbstractPartial.isSupported(AbstractPartial.java:39)
	at org.joda.time.format.DateTimeFormatterBuilder$PaddedNumber.printTo(DateTimeFormatterBuilder.java:1434)
	at org.joda.time.format.DateTimeFormatterBuilder$Composite.printTo(DateTimeFormatterBuilder.java:2446)
	at org.joda.time.format.DateTimeFormatter.printTo(DateTimeFormatter.java:609)
	at org.joda.time.format.DateTimeFormatter.print(DateTimeFormatter.java:663)
	at org.joda.time.base.AbstractPartial.toString(AbstractPartial.java:90)
	at org.joda.time.TestYearMonthDay_Basics.testToString_DTFormatter(TestYearMonthDay_Basics.java:822)

testCompareTo(org.joda.time.TestYearMonthDay_Basics)  Time elapsed: 0.001 sec  <<< ERROR!
java.lang.ArrayIndexOutOfBoundsException: -1
	at org.joda.time.Partial.getFieldType(Partial.java:369)
	at org.joda.time.base.AbstractPartial.indexOf(AbstractPartial.java:42)
	at org.joda.time.Partial.with(Partial.java:455)
	at org.joda.time.TestYearMonthDay_Basics.testCompareTo(TestYearMonthDay_Basics.java:256)

testProperty(org.joda.time.TestYearMonthDay_Basics)  Time elapsed: 0.001 sec  <<< ERROR!
java.lang.ArrayIndexOutOfBoundsException: -1
	at org.joda.time.YearMonthDay.getFieldType(YearMonthDay.java:351)
	at org.joda.time.base.AbstractPartial.indexOf(AbstractPartial.java:42)
	at org.joda.time.base.AbstractPartial.indexOfSupported(AbstractPartial.java:44)
	at org.joda.time.YearMonthDay.property(YearMonthDay.java:648)
	at org.joda.time.TestYearMonthDay_Basics.testProperty(TestYearMonthDay_Basics.java:763)

testIsSupported(org.joda.time.TestYearMonthDay_Basics)  Time elapsed: 0.001 sec  <<< ERROR!
java.lang.ArrayIndexOutOfBoundsException: -1
	at org.joda.time.YearMonthDay.getFieldType(YearMonthDay.java:351)
	at org.joda.time.base.AbstractPartial.indexOf(AbstractPartial.java:42)
	at org.joda.time.base.AbstractPartial.isSupported(AbstractPartial.java:39)
	at org.joda.time.TestYearMonthDay_Basics.testIsSupported(TestYearMonthDay_Basics.java:173)

testWithField3(org.joda.time.TestYearMonthDay_Basics)  Time elapsed: 0.001 sec  <<< ERROR!
java.lang.ArrayIndexOutOfBoundsException: -1
	at org.joda.time.YearMonthDay.getFieldType(YearMonthDay.java:351)
	at org.joda.time.base.AbstractPartial.indexOf(AbstractPartial.java:42)
	at org.joda.time.base.AbstractPartial.indexOfSupported(AbstractPartial.java:44)
	at org.joda.time.YearMonthDay.withField(YearMonthDay.java:411)
	at org.joda.time.TestYearMonthDay_Basics.testWithField3(TestYearMonthDay_Basics.java:393)

testGet(org.joda.time.TestYearMonthDay_Basics)  Time elapsed: 0 sec  <<< ERROR!
java.lang.ArrayIndexOutOfBoundsException: -1
	at org.joda.time.YearMonthDay.getFieldType(YearMonthDay.java:351)
	at org.joda.time.base.AbstractPartial.indexOf(AbstractPartial.java:42)
	at org.joda.time.base.AbstractPartial.indexOfSupported(AbstractPartial.java:44)
	at org.joda.time.base.AbstractPartial.get(AbstractPartial.java:38)
	at org.joda.time.TestYearMonthDay_Basics.testGet(TestYearMonthDay_Basics.java:87)

testPropertyCompareToMonth(org.joda.time.TestYearMonthDay_Properties)  Time elapsed: 0 sec  <<< ERROR!
java.lang.ArrayIndexOutOfBoundsException: -1
	at org.joda.time.YearMonthDay.getFieldType(YearMonthDay.java:351)
	at org.joda.time.base.AbstractPartial.indexOf(AbstractPartial.java:42)
	at org.joda.time.base.AbstractPartial.indexOfSupported(AbstractPartial.java:44)
	at org.joda.time.base.AbstractPartial.get(AbstractPartial.java:38)
	at org.joda.time.field.AbstractPartialFieldProperty.compareTo(AbstractPartialFieldProperty.java:304)
	at org.joda.time.TestYearMonthDay_Properties.testPropertyCompareToMonth(TestYearMonthDay_Properties.java:320)

testPropertyGetMaxMinValuesDay(org.joda.time.TestYearMonthDay_Properties)  Time elapsed: 0.001 sec  <<< ERROR!
java.lang.ArrayIndexOutOfBoundsException: -1
	at org.joda.time.YearMonthDay.getFieldType(YearMonthDay.java:351)
	at org.joda.time.base.AbstractPartial.indexOf(AbstractPartial.java:42)
	at org.joda.time.base.AbstractPartial.isSupported(AbstractPartial.java:39)
	at org.joda.time.chrono.BasicDayOfMonthDateTimeField.getMaximumValue(BasicDayOfMonthDateTimeField.java:68)
	at org.joda.time.field.AbstractPartialFieldProperty.getMaximumValue(AbstractPartialFieldProperty.java:230)
	at org.joda.time.TestYearMonthDay_Properties.testPropertyGetMaxMinValuesDay(TestYearMonthDay_Properties.java:363)

testPropertyCompareToDay(org.joda.time.TestYearMonthDay_Properties)  Time elapsed: 0 sec  <<< ERROR!
java.lang.ArrayIndexOutOfBoundsException: -1
	at org.joda.time.YearMonthDay.getFieldType(YearMonthDay.java:351)
	at org.joda.time.base.AbstractPartial.indexOf(AbstractPartial.java:42)
	at org.joda.time.base.AbstractPartial.indexOfSupported(AbstractPartial.java:44)
	at org.joda.time.base.AbstractPartial.get(AbstractPartial.java:38)
	at org.joda.time.field.AbstractPartialFieldProperty.compareTo(AbstractPartialFieldProperty.java:304)
	at org.joda.time.TestYearMonthDay_Properties.testPropertyCompareToDay(TestYearMonthDay_Properties.java:476)

testPropertyAddWrapFieldDay(org.joda.time.TestYearMonthDay_Properties)  Time elapsed: 0 sec  <<< ERROR!
java.lang.ArrayIndexOutOfBoundsException: -1
	at org.joda.time.YearMonthDay.getFieldType(YearMonthDay.java:351)
	at org.joda.time.base.AbstractPartial.indexOf(AbstractPartial.java:42)
	at org.joda.time.base.AbstractPartial.isSupported(AbstractPartial.java:39)
	at org.joda.time.chrono.BasicDayOfMonthDateTimeField.getMaximumValue(BasicDayOfMonthDateTimeField.java:68)
	at org.joda.time.field.BaseDateTimeField.addWrapField(BaseDateTimeField.java:496)
	at org.joda.time.YearMonthDay$Property.addWrapFieldToCopy(YearMonthDay.java:1035)
	at org.joda.time.TestYearMonthDay_Properties.testPropertyAddWrapFieldDay(TestYearMonthDay_Properties.java:412)

testPropertyWithMaximumValueDayOfMonth(org.joda.time.TestYearMonthDay_Properties)  Time elapsed: 0.001 sec  <<< ERROR!
java.lang.ArrayIndexOutOfBoundsException: -1
	at org.joda.time.YearMonthDay.getFieldType(YearMonthDay.java:351)
	at org.joda.time.base.AbstractPartial.indexOf(AbstractPartial.java:42)
	at org.joda.time.base.AbstractPartial.isSupported(AbstractPartial.java:39)
	at org.joda.time.chrono.BasicDayOfMonthDateTimeField.getMaximumValue(BasicDayOfMonthDateTimeField.java:68)
	at org.joda.time.field.AbstractPartialFieldProperty.getMaximumValue(AbstractPartialFieldProperty.java:230)
	at org.joda.time.YearMonthDay$Property.withMaximumValue(YearMonthDay.java:1104)
	at org.joda.time.TestYearMonthDay_Properties.testPropertyWithMaximumValueDayOfMonth(TestYearMonthDay_Properties.java:461)

testToString(org.joda.time.TestYearMonth_Basics)  Time elapsed: 0.001 sec  <<< ERROR!
java.lang.ArrayIndexOutOfBoundsException: -1
	at org.joda.time.YearMonth.getFieldType(YearMonth.java:418)
	at org.joda.time.base.AbstractPartial.indexOf(AbstractPartial.java:42)
	at org.joda.time.base.AbstractPartial.isSupported(AbstractPartial.java:39)
	at org.joda.time.format.DateTimeFormatterBuilder$PaddedNumber.printTo(DateTimeFormatterBuilder.java:1434)
	at org.joda.time.format.DateTimeFormatterBuilder$Composite.printTo(DateTimeFormatterBuilder.java:2446)
	at org.joda.time.format.DateTimeFormatter.printTo(DateTimeFormatter.java:609)
	at org.joda.time.format.DateTimeFormatter.print(DateTimeFormatter.java:663)
	at org.joda.time.YearMonth.toString(YearMonth.java:797)
	at org.joda.time.TestYearMonth_Basics.testToString(TestYearMonth_Basics.java:623)

testToString_String(org.joda.time.TestYearMonth_Basics)  Time elapsed: 0.001 sec  <<< ERROR!
java.lang.ArrayIndexOutOfBoundsException: -1
	at org.joda.time.YearMonth.getFieldType(YearMonth.java:418)
	at org.joda.time.base.AbstractPartial.indexOf(AbstractPartial.java:42)
	at org.joda.time.base.AbstractPartial.isSupported(AbstractPartial.java:39)
	at org.joda.time.format.DateTimeFormatterBuilder$PaddedNumber.printTo(DateTimeFormatterBuilder.java:1434)
	at org.joda.time.format.DateTimeFormatterBuilder$Composite.printTo(DateTimeFormatterBuilder.java:2446)
	at org.joda.time.format.DateTimeFormatter.printTo(DateTimeFormatter.java:609)
	at org.joda.time.format.DateTimeFormatter.print(DateTimeFormatter.java:663)
	at org.joda.time.YearMonth.toString(YearMonth.java:810)
	at org.joda.time.TestYearMonth_Basics.testToString_String(TestYearMonth_Basics.java:629)

testToString_String_Locale(org.joda.time.TestYearMonth_Basics)  Time elapsed: 0.001 sec  <<< ERROR!
java.lang.ArrayIndexOutOfBoundsException: -1
	at org.joda.time.YearMonth.getFieldType(YearMonth.java:418)
	at org.joda.time.base.AbstractPartial.indexOf(AbstractPartial.java:42)
	at org.joda.time.base.AbstractPartial.isSupported(AbstractPartial.java:39)
	at org.joda.time.format.DateTimeFormatterBuilder$UnpaddedNumber.printTo(DateTimeFormatterBuilder.java:1394)
	at org.joda.time.format.DateTimeFormatterBuilder$Composite.printTo(DateTimeFormatterBuilder.java:2446)
	at org.joda.time.format.DateTimeFormatter.printTo(DateTimeFormatter.java:609)
	at org.joda.time.format.DateTimeFormatter.print(DateTimeFormatter.java:663)
	at org.joda.time.YearMonth.toString(YearMonth.java:824)
	at org.joda.time.TestYearMonth_Basics.testToString_String_Locale(TestYearMonth_Basics.java:636)

testToString_DTFormatter(org.joda.time.TestYearMonth_Basics)  Time elapsed: 0.001 sec  <<< ERROR!
java.lang.ArrayIndexOutOfBoundsException: -1
	at org.joda.time.YearMonth.getFieldType(YearMonth.java:418)
	at org.joda.time.base.AbstractPartial.indexOf(AbstractPartial.java:42)
	at org.joda.time.base.AbstractPartial.isSupported(AbstractPartial.java:39)
	at org.joda.time.format.DateTimeFormatterBuilder$PaddedNumber.printTo(DateTimeFormatterBuilder.java:1434)
	at org.joda.time.format.DateTimeFormatterBuilder$Composite.printTo(DateTimeFormatterBuilder.java:2446)
	at org.joda.time.format.DateTimeFormatter.printTo(DateTimeFormatter.java:609)
	at org.joda.time.format.DateTimeFormatter.print(DateTimeFormatter.java:663)
	at org.joda.time.base.AbstractPartial.toString(AbstractPartial.java:90)
	at org.joda.time.TestYearMonth_Basics.testToString_DTFormatter(TestYearMonth_Basics.java:646)

testCompareTo(org.joda.time.TestYearMonth_Basics)  Time elapsed: 0.001 sec  <<< ERROR!
java.lang.ArrayIndexOutOfBoundsException: -1
	at org.joda.time.Partial.getFieldType(Partial.java:369)
	at org.joda.time.base.AbstractPartial.indexOf(AbstractPartial.java:42)
	at org.joda.time.Partial.with(Partial.java:455)
	at org.joda.time.TestYearMonth_Basics.testCompareTo(TestYearMonth_Basics.java:250)

testProperty(org.joda.time.TestYearMonth_Basics)  Time elapsed: 0.001 sec  <<< ERROR!
java.lang.ArrayIndexOutOfBoundsException: -1
	at org.joda.time.YearMonth.getFieldType(YearMonth.java:418)
	at org.joda.time.base.AbstractPartial.indexOf(AbstractPartial.java:42)
	at org.joda.time.base.AbstractPartial.indexOfSupported(AbstractPartial.java:44)
	at org.joda.time.YearMonth.property(YearMonth.java:767)
	at org.joda.time.TestYearMonth_Basics.testProperty(TestYearMonth_Basics.java:588)

testIsSupported(org.joda.time.TestYearMonth_Basics)  Time elapsed: 0 sec  <<< ERROR!
java.lang.ArrayIndexOutOfBoundsException: -1
	at org.joda.time.YearMonth.getFieldType(YearMonth.java:418)
	at org.joda.time.base.AbstractPartial.indexOf(AbstractPartial.java:42)
	at org.joda.time.base.AbstractPartial.isSupported(AbstractPartial.java:39)
	at org.joda.time.TestYearMonth_Basics.testIsSupported(TestYearMonth_Basics.java:173)

testGet(org.joda.time.TestYearMonth_Basics)  Time elapsed: 0 sec  <<< ERROR!
java.lang.ArrayIndexOutOfBoundsException: -1
	at org.joda.time.YearMonth.getFieldType(YearMonth.java:418)
	at org.joda.time.base.AbstractPartial.indexOf(AbstractPartial.java:42)
	at org.joda.time.base.AbstractPartial.indexOfSupported(AbstractPartial.java:44)
	at org.joda.time.base.AbstractPartial.get(AbstractPartial.java:38)
	at org.joda.time.TestYearMonth_Basics.testGet(TestYearMonth_Basics.java:91)

testWithField_nullField(org.joda.time.TestYearMonth_Basics)  Time elapsed: 0.001 sec  <<< ERROR!
java.lang.ArrayIndexOutOfBoundsException: -1
	at org.joda.time.YearMonth.getFieldType(YearMonth.java:418)
	at org.joda.time.base.AbstractPartial.indexOf(AbstractPartial.java:42)
	at org.joda.time.base.AbstractPartial.indexOfSupported(AbstractPartial.java:44)
	at org.joda.time.YearMonth.withField(YearMonth.java:478)
	at org.joda.time.TestYearMonth_Basics.testWithField_nullField(TestYearMonth_Basics.java:379)

testWithField_unknownField(org.joda.time.TestYearMonth_Basics)  Time elapsed: 0 sec  <<< ERROR!
java.lang.ArrayIndexOutOfBoundsException: -1
	at org.joda.time.YearMonth.getFieldType(YearMonth.java:418)
	at org.joda.time.base.AbstractPartial.indexOf(AbstractPartial.java:42)
	at org.joda.time.base.AbstractPartial.indexOfSupported(AbstractPartial.java:44)
	at org.joda.time.YearMonth.withField(YearMonth.java:478)
	at org.joda.time.TestYearMonth_Basics.testWithField_unknownField(TestYearMonth_Basics.java:387)

testPropertyCompareToMonth(org.joda.time.TestYearMonth_Properties)  Time elapsed: 0.001 sec  <<< ERROR!
java.lang.ArrayIndexOutOfBoundsException: -1
	at org.joda.time.YearMonth.getFieldType(YearMonth.java:418)
	at org.joda.time.base.AbstractPartial.indexOf(AbstractPartial.java:42)
	at org.joda.time.base.AbstractPartial.indexOfSupported(AbstractPartial.java:44)
	at org.joda.time.base.AbstractPartial.get(AbstractPartial.java:38)
	at org.joda.time.field.AbstractPartialFieldProperty.compareTo(AbstractPartialFieldProperty.java:304)
	at org.joda.time.TestYearMonth_Properties.testPropertyCompareToMonth(TestYearMonth_Properties.java:287)

testToString(org.joda.time.TestMonthDay_Basics)  Time elapsed: 0.001 sec  <<< ERROR!
java.lang.ArrayIndexOutOfBoundsException: -1
	at org.joda.time.MonthDay.getFieldType(MonthDay.java:426)
	at org.joda.time.base.AbstractPartial.indexOf(AbstractPartial.java:42)
	at org.joda.time.base.AbstractPartial.isSupported(AbstractPartial.java:39)
	at org.joda.time.format.DateTimeFormatterBuilder$PaddedNumber.printTo(DateTimeFormatterBuilder.java:1434)
	at org.joda.time.format.DateTimeFormatterBuilder$Composite.printTo(DateTimeFormatterBuilder.java:2446)
	at org.joda.time.format.DateTimeFormatter.printTo(DateTimeFormatter.java:609)
	at org.joda.time.format.DateTimeFormatter.print(DateTimeFormatter.java:663)
	at org.joda.time.MonthDay.toString(MonthDay.java:786)
	at org.joda.time.TestMonthDay_Basics.testToString(TestMonthDay_Basics.java:789)

testToString_String(org.joda.time.TestMonthDay_Basics)  Time elapsed: 0.005 sec  <<< ERROR!
java.lang.ArrayIndexOutOfBoundsException: -1
	at org.joda.time.MonthDay.getFieldType(MonthDay.java:426)
	at org.joda.time.base.AbstractPartial.indexOf(AbstractPartial.java:42)
	at org.joda.time.base.AbstractPartial.isSupported(AbstractPartial.java:39)
	at org.joda.time.format.DateTimeFormatterBuilder$PaddedNumber.printTo(DateTimeFormatterBuilder.java:1434)
	at org.joda.time.format.DateTimeFormatterBuilder$Composite.printTo(DateTimeFormatterBuilder.java:2446)
	at org.joda.time.format.DateTimeFormatter.printTo(DateTimeFormatter.java:609)
	at org.joda.time.format.DateTimeFormatter.print(DateTimeFormatter.java:663)
	at org.joda.time.MonthDay.toString(MonthDay.java:799)
	at org.joda.time.TestMonthDay_Basics.testToString_String(TestMonthDay_Basics.java:795)

testToString_String_Locale(org.joda.time.TestMonthDay_Basics)  Time elapsed: 0 sec  <<< ERROR!
java.lang.ArrayIndexOutOfBoundsException: -1
	at org.joda.time.MonthDay.getFieldType(MonthDay.java:426)
	at org.joda.time.base.AbstractPartial.indexOf(AbstractPartial.java:42)
	at org.joda.time.base.AbstractPartial.isSupported(AbstractPartial.java:39)
	at org.joda.time.format.DateTimeFormatterBuilder$UnpaddedNumber.printTo(DateTimeFormatterBuilder.java:1394)
	at org.joda.time.format.DateTimeFormatterBuilder$Composite.printTo(DateTimeFormatterBuilder.java:2446)
	at org.joda.time.format.DateTimeFormatter.printTo(DateTimeFormatter.java:609)
	at org.joda.time.format.DateTimeFormatter.print(DateTimeFormatter.java:663)
	at org.joda.time.MonthDay.toString(MonthDay.java:813)
	at org.joda.time.TestMonthDay_Basics.testToString_String_Locale(TestMonthDay_Basics.java:802)

testToString_DTFormatter(org.joda.time.TestMonthDay_Basics)  Time elapsed: 0 sec  <<< ERROR!
java.lang.ArrayIndexOutOfBoundsException: -1
	at org.joda.time.MonthDay.getFieldType(MonthDay.java:426)
	at org.joda.time.base.AbstractPartial.indexOf(AbstractPartial.java:42)
	at org.joda.time.base.AbstractPartial.isSupported(AbstractPartial.java:39)
	at org.joda.time.format.DateTimeFormatterBuilder$PaddedNumber.printTo(DateTimeFormatterBuilder.java:1434)
	at org.joda.time.format.DateTimeFormatterBuilder$Composite.printTo(DateTimeFormatterBuilder.java:2446)
	at org.joda.time.format.DateTimeFormatter.printTo(DateTimeFormatter.java:609)
	at org.joda.time.format.DateTimeFormatter.print(DateTimeFormatter.java:663)
	at org.joda.time.base.AbstractPartial.toString(AbstractPartial.java:90)
	at org.joda.time.TestMonthDay_Basics.testToString_DTFormatter(TestMonthDay_Basics.java:812)

testCompareTo(org.joda.time.TestMonthDay_Basics)  Time elapsed: 0 sec  <<< ERROR!
java.lang.ArrayIndexOutOfBoundsException: -1
	at org.joda.time.Partial.getFieldType(Partial.java:369)
	at org.joda.time.base.AbstractPartial.indexOf(AbstractPartial.java:42)
	at org.joda.time.Partial.with(Partial.java:455)
	at org.joda.time.TestMonthDay_Basics.testCompareTo(TestMonthDay_Basics.java:255)

testProperty(org.joda.time.TestMonthDay_Basics)  Time elapsed: 0.001 sec  <<< ERROR!
java.lang.ArrayIndexOutOfBoundsException: -1
	at org.joda.time.MonthDay.getFieldType(MonthDay.java:426)
	at org.joda.time.base.AbstractPartial.indexOf(AbstractPartial.java:42)
	at org.joda.time.base.AbstractPartial.indexOfSupported(AbstractPartial.java:44)
	at org.joda.time.MonthDay.property(MonthDay.java:753)
	at org.joda.time.TestMonthDay_Basics.testProperty(TestMonthDay_Basics.java:754)

testIsSupported(org.joda.time.TestMonthDay_Basics)  Time elapsed: 0.001 sec  <<< ERROR!
java.lang.ArrayIndexOutOfBoundsException: -1
	at org.joda.time.MonthDay.getFieldType(MonthDay.java:426)
	at org.joda.time.base.AbstractPartial.indexOf(AbstractPartial.java:42)
	at org.joda.time.base.AbstractPartial.isSupported(AbstractPartial.java:39)
	at org.joda.time.TestMonthDay_Basics.testIsSupported(TestMonthDay_Basics.java:171)

testGet(org.joda.time.TestMonthDay_Basics)  Time elapsed: 0 sec  <<< ERROR!
java.lang.ArrayIndexOutOfBoundsException: -1
	at org.joda.time.MonthDay.getFieldType(MonthDay.java:426)
	at org.joda.time.base.AbstractPartial.indexOf(AbstractPartial.java:42)
	at org.joda.time.base.AbstractPartial.indexOfSupported(AbstractPartial.java:44)
	at org.joda.time.base.AbstractPartial.get(AbstractPartial.java:38)
	at org.joda.time.TestMonthDay_Basics.testGet(TestMonthDay_Basics.java:89)

testWithField_nullField(org.joda.time.TestMonthDay_Basics)  Time elapsed: 0.001 sec  <<< ERROR!
java.lang.ArrayIndexOutOfBoundsException: -1
	at org.joda.time.MonthDay.getFieldType(MonthDay.java:426)
	at org.joda.time.base.AbstractPartial.indexOf(AbstractPartial.java:42)
	at org.joda.time.base.AbstractPartial.indexOfSupported(AbstractPartial.java:44)
	at org.joda.time.MonthDay.withField(MonthDay.java:486)
	at org.joda.time.TestMonthDay_Basics.testWithField_nullField(TestMonthDay_Basics.java:374)

testWithField_unknownField(org.joda.time.TestMonthDay_Basics)  Time elapsed: 0 sec  <<< ERROR!
java.lang.ArrayIndexOutOfBoundsException: -1
	at org.joda.time.MonthDay.getFieldType(MonthDay.java:426)
	at org.joda.time.base.AbstractPartial.indexOf(AbstractPartial.java:42)
	at org.joda.time.base.AbstractPartial.indexOfSupported(AbstractPartial.java:44)
	at org.joda.time.MonthDay.withField(MonthDay.java:486)
	at org.joda.time.TestMonthDay_Basics.testWithField_unknownField(TestMonthDay_Basics.java:382)

testPropertyCompareToDayOfMonth(org.joda.time.TestMonthDay_Properties)  Time elapsed: 0.001 sec  <<< ERROR!
java.lang.ArrayIndexOutOfBoundsException: -1
	at org.joda.time.MonthDay.getFieldType(MonthDay.java:426)
	at org.joda.time.base.AbstractPartial.indexOf(AbstractPartial.java:42)
	at org.joda.time.base.AbstractPartial.indexOfSupported(AbstractPartial.java:44)
	at org.joda.time.base.AbstractPartial.get(AbstractPartial.java:38)
	at org.joda.time.field.AbstractPartialFieldProperty.compareTo(AbstractPartialFieldProperty.java:304)
	at org.joda.time.TestMonthDay_Properties.testPropertyCompareToDayOfMonth(TestMonthDay_Properties.java:269)

testPropertyGetMaxMinValuesDayOfMonth(org.joda.time.TestMonthDay_Properties)  Time elapsed: 0.001 sec  <<< ERROR!
java.lang.ArrayIndexOutOfBoundsException: -1
	at org.joda.time.MonthDay.getFieldType(MonthDay.java:426)
	at org.joda.time.base.AbstractPartial.indexOf(AbstractPartial.java:42)
	at org.joda.time.base.AbstractPartial.isSupported(AbstractPartial.java:39)
	at org.joda.time.chrono.BasicDayOfMonthDateTimeField.getMaximumValue(BasicDayOfMonthDateTimeField.java:70)
	at org.joda.time.field.AbstractPartialFieldProperty.getMaximumValue(AbstractPartialFieldProperty.java:230)
	at org.joda.time.TestMonthDay_Properties.testPropertyGetMaxMinValuesDayOfMonth(TestMonthDay_Properties.java:202)

testPropertyAddWrapFieldDayOfMonth(org.joda.time.TestMonthDay_Properties)  Time elapsed: 0.001 sec  <<< ERROR!
java.lang.ArrayIndexOutOfBoundsException: -1
	at org.joda.time.MonthDay.getFieldType(MonthDay.java:426)
	at org.joda.time.base.AbstractPartial.indexOf(AbstractPartial.java:42)
	at org.joda.time.base.AbstractPartial.isSupported(AbstractPartial.java:39)
	at org.joda.time.chrono.BasicDayOfMonthDateTimeField.getMaximumValue(BasicDayOfMonthDateTimeField.java:70)
	at org.joda.time.field.BaseDateTimeField.addWrapField(BaseDateTimeField.java:496)
	at org.joda.time.MonthDay$Property.addWrapFieldToCopy(MonthDay.java:924)
	at org.joda.time.TestMonthDay_Properties.testPropertyAddWrapFieldDayOfMonth(TestMonthDay_Properties.java:224)

testWithField1(org.joda.time.TestPartial_Basics)  Time elapsed: 0.001 sec  <<< ERROR!
java.lang.ArrayIndexOutOfBoundsException: -1
	at org.joda.time.Partial.getFieldType(Partial.java:369)
	at org.joda.time.base.AbstractPartial.indexOf(AbstractPartial.java:42)
	at org.joda.time.base.AbstractPartial.isSupported(AbstractPartial.java:39)
	at org.joda.time.format.DateTimeFormatterBuilder$PaddedNumber.printTo(DateTimeFormatterBuilder.java:1434)
	at org.joda.time.format.DateTimeFormatterBuilder$Composite.printTo(DateTimeFormatterBuilder.java:2446)
	at org.joda.time.format.DateTimeFormatter.printTo(DateTimeFormatter.java:609)
	at org.joda.time.format.DateTimeFormatter.print(DateTimeFormatter.java:663)
	at org.joda.time.Partial.toString(Partial.java:781)
	at org.joda.time.TestPartial_Basics.check(TestPartial_Basics.java:927)
	at org.joda.time.TestPartial_Basics.testWithField1(TestPartial_Basics.java:521)

testWithField2(org.joda.time.TestPartial_Basics)  Time elapsed: 0 sec  <<< ERROR!
java.lang.ArrayIndexOutOfBoundsException: -1
	at org.joda.time.Partial.getFieldType(Partial.java:369)
	at org.joda.time.base.AbstractPartial.indexOf(AbstractPartial.java:42)
	at org.joda.time.base.AbstractPartial.indexOfSupported(AbstractPartial.java:44)
	at org.joda.time.Partial.withField(Partial.java:547)
	at org.joda.time.TestPartial_Basics.testWithField2(TestPartial_Basics.java:528)

testWithFieldAdded1(org.joda.time.TestPartial_Basics)  Time elapsed: 0.001 sec  <<< ERROR!
java.lang.ArrayIndexOutOfBoundsException: -1
	at org.joda.time.Partial.getFieldType(Partial.java:369)
	at org.joda.time.base.AbstractPartial.indexOf(AbstractPartial.java:42)
	at org.joda.time.base.AbstractPartial.isSupported(AbstractPartial.java:39)
	at org.joda.time.format.DateTimeFormatterBuilder$PaddedNumber.printTo(DateTimeFormatterBuilder.java:1434)
	at org.joda.time.format.DateTimeFormatterBuilder$Composite.printTo(DateTimeFormatterBuilder.java:2446)
	at org.joda.time.format.DateTimeFormatter.printTo(DateTimeFormatter.java:609)
	at org.joda.time.format.DateTimeFormatter.print(DateTimeFormatter.java:663)
	at org.joda.time.Partial.toString(Partial.java:781)
	at org.joda.time.TestPartial_Basics.check(TestPartial_Basics.java:927)
	at org.joda.time.TestPartial_Basics.testWithFieldAdded1(TestPartial_Basics.java:555)

testWithFieldAdded2(org.joda.time.TestPartial_Basics)  Time elapsed: 0 sec  <<< ERROR!
java.lang.ArrayIndexOutOfBoundsException: -1
	at org.joda.time.Partial.getFieldType(Partial.java:369)
	at org.joda.time.base.AbstractPartial.indexOf(AbstractPartial.java:42)
	at org.joda.time.base.AbstractPartial.isSupported(AbstractPartial.java:39)
	at org.joda.time.format.DateTimeFormatterBuilder$PaddedNumber.printTo(DateTimeFormatterBuilder.java:1434)
	at org.joda.time.format.DateTimeFormatterBuilder$Composite.printTo(DateTimeFormatterBuilder.java:2446)
	at org.joda.time.format.DateTimeFormatter.printTo(DateTimeFormatter.java:609)
	at org.joda.time.format.DateTimeFormatter.print(DateTimeFormatter.java:663)
	at org.joda.time.Partial.toString(Partial.java:781)
	at org.joda.time.TestPartial_Basics.check(TestPartial_Basics.java:927)
	at org.joda.time.TestPartial_Basics.testWithFieldAdded2(TestPartial_Basics.java:565)

testWithFieldAdded3(org.joda.time.TestPartial_Basics)  Time elapsed: 0.001 sec  <<< ERROR!
java.lang.ArrayIndexOutOfBoundsException: -1
	at org.joda.time.Partial.getFieldType(Partial.java:369)
	at org.joda.time.base.AbstractPartial.indexOf(AbstractPartial.java:42)
	at org.joda.time.base.AbstractPartial.isSupported(AbstractPartial.java:39)
	at org.joda.time.format.DateTimeFormatterBuilder$PaddedNumber.printTo(DateTimeFormatterBuilder.java:1434)
	at org.joda.time.format.DateTimeFormatterBuilder$Composite.printTo(DateTimeFormatterBuilder.java:2446)
	at org.joda.time.format.DateTimeFormatter.printTo(DateTimeFormatter.java:609)
	at org.joda.time.format.DateTimeFormatter.print(DateTimeFormatter.java:663)
	at org.joda.time.Partial.toString(Partial.java:781)
	at org.joda.time.TestPartial_Basics.check(TestPartial_Basics.java:927)
	at org.joda.time.TestPartial_Basics.testWithFieldAdded3(TestPartial_Basics.java:574)

testPlus_RP(org.joda.time.TestPartial_Basics)  Time elapsed: 0 sec  <<< ERROR!
java.lang.ArrayIndexOutOfBoundsException: -1
	at org.joda.time.Partial.getFieldType(Partial.java:369)
	at org.joda.time.base.AbstractPartial.indexOf(AbstractPartial.java:42)
	at org.joda.time.base.AbstractPartial.isSupported(AbstractPartial.java:39)
	at org.joda.time.format.DateTimeFormatterBuilder$PaddedNumber.printTo(DateTimeFormatterBuilder.java:1434)
	at org.joda.time.format.DateTimeFormatterBuilder$Composite.printTo(DateTimeFormatterBuilder.java:2446)
	at org.joda.time.format.DateTimeFormatter.printTo(DateTimeFormatter.java:609)
	at org.joda.time.format.DateTimeFormatter.print(DateTimeFormatter.java:663)
	at org.joda.time.Partial.toString(Partial.java:781)
	at org.joda.time.TestPartial_Basics.check(TestPartial_Basics.java:927)
	at org.joda.time.TestPartial_Basics.testPlus_RP(TestPartial_Basics.java:723)

testToString_String(org.joda.time.TestPartial_Basics)  Time elapsed: 0.001 sec  <<< ERROR!
java.lang.ArrayIndexOutOfBoundsException: -1
	at org.joda.time.Partial.getFieldType(Partial.java:369)
	at org.joda.time.base.AbstractPartial.indexOf(AbstractPartial.java:42)
	at org.joda.time.base.AbstractPartial.isSupported(AbstractPartial.java:39)
	at org.joda.time.format.DateTimeFormatterBuilder$PaddedNumber.printTo(DateTimeFormatterBuilder.java:1434)
	at org.joda.time.format.DateTimeFormatterBuilder$Composite.printTo(DateTimeFormatterBuilder.java:2446)
	at org.joda.time.format.DateTimeFormatter.printTo(DateTimeFormatter.java:609)
	at org.joda.time.format.DateTimeFormatter.print(DateTimeFormatter.java:663)
	at org.joda.time.Partial.toString(Partial.java:820)
	at org.joda.time.TestPartial_Basics.testToString_String(TestPartial_Basics.java:877)

testToString_String_Locale(org.joda.time.TestPartial_Basics)  Time elapsed: 0 sec  <<< ERROR!
java.lang.ArrayIndexOutOfBoundsException: -1
	at org.joda.time.Partial.getFieldType(Partial.java:369)
	at org.joda.time.base.AbstractPartial.indexOf(AbstractPartial.java:42)
	at org.joda.time.base.AbstractPartial.isSupported(AbstractPartial.java:39)
	at org.joda.time.format.DateTimeFormatterBuilder$UnpaddedNumber.printTo(DateTimeFormatterBuilder.java:1394)
	at org.joda.time.format.DateTimeFormatterBuilder$Composite.printTo(DateTimeFormatterBuilder.java:2446)
	at org.joda.time.format.DateTimeFormatter.printTo(DateTimeFormatter.java:609)
	at org.joda.time.format.DateTimeFormatter.print(DateTimeFormatter.java:663)
	at org.joda.time.Partial.toString(Partial.java:835)
	at org.joda.time.TestPartial_Basics.testToString_String_Locale(TestPartial_Basics.java:884)

testToString_DTFormatter(org.joda.time.TestPartial_Basics)  Time elapsed: 0.001 sec  <<< ERROR!
java.lang.ArrayIndexOutOfBoundsException: -1
	at org.joda.time.Partial.getFieldType(Partial.java:369)
	at org.joda.time.base.AbstractPartial.indexOf(AbstractPartial.java:42)
	at org.joda.time.base.AbstractPartial.isSupported(AbstractPartial.java:39)
	at org.joda.time.format.DateTimeFormatterBuilder$PaddedNumber.printTo(DateTimeFormatterBuilder.java:1434)
	at org.joda.time.format.DateTimeFormatterBuilder$Composite.printTo(DateTimeFormatterBuilder.java:2446)
	at org.joda.time.format.DateTimeFormatter.printTo(DateTimeFormatter.java:609)
	at org.joda.time.format.DateTimeFormatter.print(DateTimeFormatter.java:663)
	at org.joda.time.base.AbstractPartial.toString(AbstractPartial.java:90)
	at org.joda.time.TestPartial_Basics.testToString_DTFormatter(TestPartial_Basics.java:893)

testMinus_RP(org.joda.time.TestPartial_Basics)  Time elapsed: 0.001 sec  <<< ERROR!
java.lang.ArrayIndexOutOfBoundsException: -1
	at org.joda.time.Partial.getFieldType(Partial.java:369)
	at org.joda.time.base.AbstractPartial.indexOf(AbstractPartial.java:42)
	at org.joda.time.base.AbstractPartial.isSupported(AbstractPartial.java:39)
	at org.joda.time.format.DateTimeFormatterBuilder$PaddedNumber.printTo(DateTimeFormatterBuilder.java:1434)
	at org.joda.time.format.DateTimeFormatterBuilder$Composite.printTo(DateTimeFormatterBuilder.java:2446)
	at org.joda.time.format.DateTimeFormatter.printTo(DateTimeFormatter.java:609)
	at org.joda.time.format.DateTimeFormatter.print(DateTimeFormatter.java:663)
	at org.joda.time.Partial.toString(Partial.java:781)
	at org.joda.time.TestPartial_Basics.check(TestPartial_Basics.java:927)
	at org.joda.time.TestPartial_Basics.testMinus_RP(TestPartial_Basics.java:734)

testProperty(org.joda.time.TestPartial_Basics)  Time elapsed: 0 sec  <<< ERROR!
java.lang.ArrayIndexOutOfBoundsException: -1
	at org.joda.time.Partial.getFieldType(Partial.java:369)
	at org.joda.time.base.AbstractPartial.indexOf(AbstractPartial.java:42)
	at org.joda.time.base.AbstractPartial.indexOfSupported(AbstractPartial.java:44)
	at org.joda.time.Partial.property(Partial.java:673)
	at org.joda.time.TestPartial_Basics.testProperty(TestPartial_Basics.java:766)

testIsSupported(org.joda.time.TestPartial_Basics)  Time elapsed: 0 sec  <<< ERROR!
java.lang.ArrayIndexOutOfBoundsException: -1
	at org.joda.time.Partial.getFieldType(Partial.java:369)
	at org.joda.time.base.AbstractPartial.indexOf(AbstractPartial.java:42)
	at org.joda.time.base.AbstractPartial.isSupported(AbstractPartial.java:39)
	at org.joda.time.TestPartial_Basics.testIsSupported(TestPartial_Basics.java:176)

testWithField3(org.joda.time.TestPartial_Basics)  Time elapsed: 0 sec  <<< ERROR!
java.lang.ArrayIndexOutOfBoundsException: -1
	at org.joda.time.Partial.getFieldType(Partial.java:369)
	at org.joda.time.base.AbstractPartial.indexOf(AbstractPartial.java:42)
	at org.joda.time.base.AbstractPartial.indexOfSupported(AbstractPartial.java:44)
	at org.joda.time.Partial.withField(Partial.java:547)
	at org.joda.time.TestPartial_Basics.testWithField3(TestPartial_Basics.java:537)

testGet(org.joda.time.TestPartial_Basics)  Time elapsed: 0.001 sec  <<< ERROR!
java.lang.ArrayIndexOutOfBoundsException: -1
	at org.joda.time.Partial.getFieldType(Partial.java:369)
	at org.joda.time.base.AbstractPartial.indexOf(AbstractPartial.java:42)
	at org.joda.time.base.AbstractPartial.indexOfSupported(AbstractPartial.java:44)
	at org.joda.time.base.AbstractPartial.get(AbstractPartial.java:38)
	at org.joda.time.TestPartial_Basics.testGet(TestPartial_Basics.java:94)

testToDateTime_RI(org.joda.time.TestPartial_Basics)  Time elapsed: 0 sec  <<< ERROR!
java.lang.ArrayIndexOutOfBoundsException: -1
	at org.joda.time.Partial.getFieldType(Partial.java:369)
	at org.joda.time.base.AbstractPartial.indexOf(AbstractPartial.java:42)
	at org.joda.time.base.AbstractPartial.isSupported(AbstractPartial.java:39)
	at org.joda.time.format.DateTimeFormatterBuilder$PaddedNumber.printTo(DateTimeFormatterBuilder.java:1434)
	at org.joda.time.format.DateTimeFormatterBuilder$Composite.printTo(DateTimeFormatterBuilder.java:2446)
	at org.joda.time.format.DateTimeFormatter.printTo(DateTimeFormatter.java:609)
	at org.joda.time.format.DateTimeFormatter.print(DateTimeFormatter.java:663)
	at org.joda.time.Partial.toString(Partial.java:781)
	at org.joda.time.TestPartial_Basics.check(TestPartial_Basics.java:927)
	at org.joda.time.TestPartial_Basics.testToDateTime_RI(TestPartial_Basics.java:748)

testToDateTime_nullRI(org.joda.time.TestPartial_Basics)  Time elapsed: 0 sec  <<< ERROR!
java.lang.ArrayIndexOutOfBoundsException: -1
	at org.joda.time.Partial.getFieldType(Partial.java:369)
	at org.joda.time.base.AbstractPartial.indexOf(AbstractPartial.java:42)
	at org.joda.time.base.AbstractPartial.isSupported(AbstractPartial.java:39)
	at org.joda.time.format.DateTimeFormatterBuilder$PaddedNumber.printTo(DateTimeFormatterBuilder.java:1434)
	at org.joda.time.format.DateTimeFormatterBuilder$Composite.printTo(DateTimeFormatterBuilder.java:2446)
	at org.joda.time.format.DateTimeFormatter.printTo(DateTimeFormatter.java:609)
	at org.joda.time.format.DateTimeFormatter.print(DateTimeFormatter.java:663)
	at org.joda.time.Partial.toString(Partial.java:781)
	at org.joda.time.TestPartial_Basics.check(TestPartial_Basics.java:927)
	at org.joda.time.TestPartial_Basics.testToDateTime_nullRI(TestPartial_Basics.java:758)

testWithChronologyRetainFields_nullChrono(org.joda.time.TestPartial_Basics)  Time elapsed: 0.001 sec  <<< ERROR!
java.lang.ArrayIndexOutOfBoundsException: -1
	at org.joda.time.Partial.getFieldType(Partial.java:369)
	at org.joda.time.base.AbstractPartial.indexOf(AbstractPartial.java:42)
	at org.joda.time.base.AbstractPartial.isSupported(AbstractPartial.java:39)
	at org.joda.time.format.DateTimeFormatterBuilder$PaddedNumber.printTo(DateTimeFormatterBuilder.java:1434)
	at org.joda.time.format.DateTimeFormatterBuilder$Composite.printTo(DateTimeFormatterBuilder.java:2446)
	at org.joda.time.format.DateTimeFormatter.printTo(DateTimeFormatter.java:609)
	at org.joda.time.format.DateTimeFormatter.print(DateTimeFormatter.java:663)
	at org.joda.time.Partial.toString(Partial.java:781)
	at org.joda.time.TestPartial_Basics.check(TestPartial_Basics.java:927)
	at org.joda.time.TestPartial_Basics.testWithChronologyRetainFields_nullChrono(TestPartial_Basics.java:337)

testWithFieldAdded5(org.joda.time.TestPartial_Basics)  Time elapsed: 0.001 sec  <<< ERROR!
java.lang.ArrayIndexOutOfBoundsException: -1
	at org.joda.time.Partial.getFieldType(Partial.java:369)
	at org.joda.time.base.AbstractPartial.indexOf(AbstractPartial.java:42)
	at org.joda.time.base.AbstractPartial.isSupported(AbstractPartial.java:39)
	at org.joda.time.format.DateTimeFormatterBuilder$PaddedNumber.printTo(DateTimeFormatterBuilder.java:1434)
	at org.joda.time.format.DateTimeFormatterBuilder$Composite.printTo(DateTimeFormatterBuilder.java:2446)
	at org.joda.time.format.DateTimeFormatter.printTo(DateTimeFormatter.java:609)
	at org.joda.time.format.DateTimeFormatter.print(DateTimeFormatter.java:663)
	at org.joda.time.Partial.toString(Partial.java:781)
	at org.joda.time.TestPartial_Basics.check(TestPartial_Basics.java:927)
	at org.joda.time.TestPartial_Basics.testWithFieldAdded5(TestPartial_Basics.java:589)

testWithFieldAdded6(org.joda.time.TestPartial_Basics)  Time elapsed: 0 sec  <<< ERROR!
java.lang.ArrayIndexOutOfBoundsException: -1
	at org.joda.time.Partial.getFieldType(Partial.java:369)
	at org.joda.time.base.AbstractPartial.indexOf(AbstractPartial.java:42)
	at org.joda.time.base.AbstractPartial.isSupported(AbstractPartial.java:39)
	at org.joda.time.format.DateTimeFormatterBuilder$PaddedNumber.printTo(DateTimeFormatterBuilder.java:1434)
	at org.joda.time.format.DateTimeFormatterBuilder$Composite.printTo(DateTimeFormatterBuilder.java:2446)
	at org.joda.time.format.DateTimeFormatter.printTo(DateTimeFormatter.java:609)
	at org.joda.time.format.DateTimeFormatter.print(DateTimeFormatter.java:663)
	at org.joda.time.Partial.toString(Partial.java:781)
	at org.joda.time.TestPartial_Basics.check(TestPartial_Basics.java:927)
	at org.joda.time.TestPartial_Basics.testWithFieldAdded6(TestPartial_Basics.java:600)

testWithFieldAdded7(org.joda.time.TestPartial_Basics)  Time elapsed: 0.001 sec  <<< ERROR!
java.lang.ArrayIndexOutOfBoundsException: -1
	at org.joda.time.Partial.getFieldType(Partial.java:369)
	at org.joda.time.base.AbstractPartial.indexOf(AbstractPartial.java:42)
	at org.joda.time.base.AbstractPartial.isSupported(AbstractPartial.java:39)
	at org.joda.time.format.DateTimeFormatterBuilder$PaddedNumber.printTo(DateTimeFormatterBuilder.java:1434)
	at org.joda.time.format.DateTimeFormatterBuilder$Composite.printTo(DateTimeFormatterBuilder.java:2446)
	at org.joda.time.format.DateTimeFormatter.printTo(DateTimeFormatter.java:609)
	at org.joda.time.format.DateTimeFormatter.print(DateTimeFormatter.java:663)
	at org.joda.time.Partial.toString(Partial.java:781)
	at org.joda.time.TestPartial_Basics.check(TestPartial_Basics.java:927)
	at org.joda.time.TestPartial_Basics.testWithFieldAdded7(TestPartial_Basics.java:611)

testWithFieldAdded8(org.joda.time.TestPartial_Basics)  Time elapsed: 0 sec  <<< ERROR!
java.lang.ArrayIndexOutOfBoundsException: -1
	at org.joda.time.Partial.getFieldType(Partial.java:369)
	at org.joda.time.base.AbstractPartial.indexOf(AbstractPartial.java:42)
	at org.joda.time.base.AbstractPartial.isSupported(AbstractPartial.java:39)
	at org.joda.time.format.DateTimeFormatterBuilder$PaddedNumber.printTo(DateTimeFormatterBuilder.java:1434)
	at org.joda.time.format.DateTimeFormatterBuilder$Composite.printTo(DateTimeFormatterBuilder.java:2446)
	at org.joda.time.format.DateTimeFormatter.printTo(DateTimeFormatter.java:609)
	at org.joda.time.format.DateTimeFormatter.print(DateTimeFormatter.java:663)
	at org.joda.time.Partial.toString(Partial.java:781)
	at org.joda.time.TestPartial_Basics.check(TestPartial_Basics.java:927)
	at org.joda.time.TestPartial_Basics.testWithFieldAdded8(TestPartial_Basics.java:631)

testWith_baseAndArgHaveNoRange(org.joda.time.TestPartial_Basics)  Time elapsed: 0.001 sec  <<< ERROR!
java.lang.ArrayIndexOutOfBoundsException: -1
	at org.joda.time.Partial.getFieldType(Partial.java:369)
	at org.joda.time.base.AbstractPartial.indexOf(AbstractPartial.java:42)
	at org.joda.time.Partial.with(Partial.java:455)
	at org.joda.time.TestPartial_Basics.testWith_baseAndArgHaveNoRange(TestPartial_Basics.java:469)

testWithout1(org.joda.time.TestPartial_Basics)  Time elapsed: 0 sec  <<< ERROR!
java.lang.ArrayIndexOutOfBoundsException: -1
	at org.joda.time.Partial.getFieldType(Partial.java:369)
	at org.joda.time.base.AbstractPartial.indexOf(AbstractPartial.java:42)
	at org.joda.time.Partial.without(Partial.java:516)
	at org.joda.time.TestPartial_Basics.testWithout1(TestPartial_Basics.java:478)

testWithout2(org.joda.time.TestPartial_Basics)  Time elapsed: 0 sec  <<< ERROR!
java.lang.ArrayIndexOutOfBoundsException: -1
	at org.joda.time.Partial.getFieldType(Partial.java:369)
	at org.joda.time.base.AbstractPartial.indexOf(AbstractPartial.java:42)
	at org.joda.time.Partial.without(Partial.java:516)
	at org.joda.time.TestPartial_Basics.testWithout2(TestPartial_Basics.java:485)

testWithout3(org.joda.time.TestPartial_Basics)  Time elapsed: 0.001 sec  <<< ERROR!
java.lang.ArrayIndexOutOfBoundsException: -1
	at org.joda.time.Partial.getFieldType(Partial.java:369)
	at org.joda.time.base.AbstractPartial.indexOf(AbstractPartial.java:42)
	at org.joda.time.base.AbstractPartial.isSupported(AbstractPartial.java:39)
	at org.joda.time.format.DateTimeFormatterBuilder$PaddedNumber.printTo(DateTimeFormatterBuilder.java:1434)
	at org.joda.time.format.DateTimeFormatterBuilder$Composite.printTo(DateTimeFormatterBuilder.java:2446)
	at org.joda.time.format.DateTimeFormatter.printTo(DateTimeFormatter.java:609)
	at org.joda.time.format.DateTimeFormatter.print(DateTimeFormatter.java:663)
	at org.joda.time.Partial.toString(Partial.java:781)
	at org.joda.time.TestPartial_Basics.check(TestPartial_Basics.java:927)
	at org.joda.time.TestPartial_Basics.testWithout3(TestPartial_Basics.java:493)

testWithout4(org.joda.time.TestPartial_Basics)  Time elapsed: 0 sec  <<< ERROR!
java.lang.ArrayIndexOutOfBoundsException: -1
	at org.joda.time.Partial.getFieldType(Partial.java:369)
	at org.joda.time.base.AbstractPartial.indexOf(AbstractPartial.java:42)
	at org.joda.time.Partial.without(Partial.java:516)
	at org.joda.time.TestPartial_Basics.testWithout4(TestPartial_Basics.java:502)

testWithFieldAddWrapped1(org.joda.time.TestPartial_Basics)  Time elapsed: 0.001 sec  <<< ERROR!
java.lang.ArrayIndexOutOfBoundsException: -1
	at org.joda.time.Partial.getFieldType(Partial.java:369)
	at org.joda.time.base.AbstractPartial.indexOf(AbstractPartial.java:42)
	at org.joda.time.base.AbstractPartial.isSupported(AbstractPartial.java:39)
	at org.joda.time.format.DateTimeFormatterBuilder$PaddedNumber.printTo(DateTimeFormatterBuilder.java:1434)
	at org.joda.time.format.DateTimeFormatterBuilder$Composite.printTo(DateTimeFormatterBuilder.java:2446)
	at org.joda.time.format.DateTimeFormatter.printTo(DateTimeFormatter.java:609)
	at org.joda.time.format.DateTimeFormatter.print(DateTimeFormatter.java:663)
	at org.joda.time.Partial.toString(Partial.java:781)
	at org.joda.time.TestPartial_Basics.check(TestPartial_Basics.java:927)
	at org.joda.time.TestPartial_Basics.testWithFieldAddWrapped1(TestPartial_Basics.java:649)

testWithFieldAddWrapped2(org.joda.time.TestPartial_Basics)  Time elapsed: 0 sec  <<< ERROR!
java.lang.ArrayIndexOutOfBoundsException: -1
	at org.joda.time.Partial.getFieldType(Partial.java:369)
	at org.joda.time.base.AbstractPartial.indexOf(AbstractPartial.java:42)
	at org.joda.time.base.AbstractPartial.isSupported(AbstractPartial.java:39)
	at org.joda.time.format.DateTimeFormatterBuilder$PaddedNumber.printTo(DateTimeFormatterBuilder.java:1434)
	at org.joda.time.format.DateTimeFormatterBuilder$Composite.printTo(DateTimeFormatterBuilder.java:2446)
	at org.joda.time.format.DateTimeFormatter.printTo(DateTimeFormatter.java:609)
	at org.joda.time.format.DateTimeFormatter.print(DateTimeFormatter.java:663)
	at org.joda.time.Partial.toString(Partial.java:781)
	at org.joda.time.TestPartial_Basics.check(TestPartial_Basics.java:927)
	at org.joda.time.TestPartial_Basics.testWithFieldAddWrapped2(TestPartial_Basics.java:659)

testWithFieldAddWrapped3(org.joda.time.TestPartial_Basics)  Time elapsed: 0.001 sec  <<< ERROR!
java.lang.ArrayIndexOutOfBoundsException: -1
	at org.joda.time.Partial.getFieldType(Partial.java:369)
	at org.joda.time.base.AbstractPartial.indexOf(AbstractPartial.java:42)
	at org.joda.time.base.AbstractPartial.isSupported(AbstractPartial.java:39)
	at org.joda.time.format.DateTimeFormatterBuilder$PaddedNumber.printTo(DateTimeFormatterBuilder.java:1434)
	at org.joda.time.format.DateTimeFormatterBuilder$Composite.printTo(DateTimeFormatterBuilder.java:2446)
	at org.joda.time.format.DateTimeFormatter.printTo(DateTimeFormatter.java:609)
	at org.joda.time.format.DateTimeFormatter.print(DateTimeFormatter.java:663)
	at org.joda.time.Partial.toString(Partial.java:781)
	at org.joda.time.TestPartial_Basics.check(TestPartial_Basics.java:927)
	at org.joda.time.TestPartial_Basics.testWithFieldAddWrapped3(TestPartial_Basics.java:668)

testWithChronologyRetainFields_Chrono(org.joda.time.TestPartial_Basics)  Time elapsed: 0.001 sec  <<< ERROR!
java.lang.ArrayIndexOutOfBoundsException: -1
	at org.joda.time.Partial.getFieldType(Partial.java:369)
	at org.joda.time.base.AbstractPartial.indexOf(AbstractPartial.java:42)
	at org.joda.time.base.AbstractPartial.isSupported(AbstractPartial.java:39)
	at org.joda.time.format.DateTimeFormatterBuilder$PaddedNumber.printTo(DateTimeFormatterBuilder.java:1434)
	at org.joda.time.format.DateTimeFormatterBuilder$Composite.printTo(DateTimeFormatterBuilder.java:2446)
	at org.joda.time.format.DateTimeFormatter.printTo(DateTimeFormatter.java:609)
	at org.joda.time.format.DateTimeFormatter.print(DateTimeFormatter.java:663)
	at org.joda.time.Partial.toString(Partial.java:781)
	at org.joda.time.TestPartial_Basics.check(TestPartial_Basics.java:927)
	at org.joda.time.TestPartial_Basics.testWithChronologyRetainFields_Chrono(TestPartial_Basics.java:322)

testWithFieldAddWrapped5(org.joda.time.TestPartial_Basics)  Time elapsed: 0 sec  <<< ERROR!
java.lang.ArrayIndexOutOfBoundsException: -1
	at org.joda.time.Partial.getFieldType(Partial.java:369)
	at org.joda.time.base.AbstractPartial.indexOf(AbstractPartial.java:42)
	at org.joda.time.base.AbstractPartial.isSupported(AbstractPartial.java:39)
	at org.joda.time.format.DateTimeFormatterBuilder$PaddedNumber.printTo(DateTimeFormatterBuilder.java:1434)
	at org.joda.time.format.DateTimeFormatterBuilder$Composite.printTo(DateTimeFormatterBuilder.java:2446)
	at org.joda.time.format.DateTimeFormatter.printTo(DateTimeFormatter.java:609)
	at org.joda.time.format.DateTimeFormatter.print(DateTimeFormatter.java:663)
	at org.joda.time.Partial.toString(Partial.java:781)
	at org.joda.time.TestPartial_Basics.check(TestPartial_Basics.java:927)
	at org.joda.time.TestPartial_Basics.testWithFieldAddWrapped5(TestPartial_Basics.java:683)

testWithFieldAddWrapped6(org.joda.time.TestPartial_Basics)  Time elapsed: 0 sec  <<< ERROR!
java.lang.ArrayIndexOutOfBoundsException: -1
	at org.joda.time.Partial.getFieldType(Partial.java:369)
	at org.joda.time.base.AbstractPartial.indexOf(AbstractPartial.java:42)
	at org.joda.time.base.AbstractPartial.isSupported(AbstractPartial.java:39)
	at org.joda.time.format.DateTimeFormatterBuilder$PaddedNumber.printTo(DateTimeFormatterBuilder.java:1434)
	at org.joda.time.format.DateTimeFormatterBuilder$Composite.printTo(DateTimeFormatterBuilder.java:2446)
	at org.joda.time.format.DateTimeFormatter.printTo(DateTimeFormatter.java:609)
	at org.joda.time.format.DateTimeFormatter.print(DateTimeFormatter.java:663)
	at org.joda.time.Partial.toString(Partial.java:781)
	at org.joda.time.TestPartial_Basics.check(TestPartial_Basics.java:927)
	at org.joda.time.TestPartial_Basics.testWithFieldAddWrapped6(TestPartial_Basics.java:691)

testWithFieldAddWrapped7(org.joda.time.TestPartial_Basics)  Time elapsed: 0 sec  <<< ERROR!
java.lang.ArrayIndexOutOfBoundsException: -1
	at org.joda.time.Partial.getFieldType(Partial.java:369)
	at org.joda.time.base.AbstractPartial.indexOf(AbstractPartial.java:42)
	at org.joda.time.base.AbstractPartial.isSupported(AbstractPartial.java:39)
	at org.joda.time.format.DateTimeFormatterBuilder$PaddedNumber.printTo(DateTimeFormatterBuilder.java:1434)
	at org.joda.time.format.DateTimeFormatterBuilder$Composite.printTo(DateTimeFormatterBuilder.java:2446)
	at org.joda.time.format.DateTimeFormatter.printTo(DateTimeFormatter.java:609)
	at org.joda.time.format.DateTimeFormatter.print(DateTimeFormatter.java:663)
	at org.joda.time.Partial.toString(Partial.java:781)
	at org.joda.time.TestPartial_Basics.check(TestPartial_Basics.java:927)
	at org.joda.time.TestPartial_Basics.testWithFieldAddWrapped7(TestPartial_Basics.java:698)

testWithFieldAddWrapped8(org.joda.time.TestPartial_Basics)  Time elapsed: 0 sec  <<< ERROR!
java.lang.ArrayIndexOutOfBoundsException: -1
	at org.joda.time.Partial.getFieldType(Partial.java:369)
	at org.joda.time.base.AbstractPartial.indexOf(AbstractPartial.java:42)
	at org.joda.time.base.AbstractPartial.isSupported(AbstractPartial.java:39)
	at org.joda.time.format.DateTimeFormatterBuilder$PaddedNumber.printTo(DateTimeFormatterBuilder.java:1434)
	at org.joda.time.format.DateTimeFormatterBuilder$Composite.printTo(DateTimeFormatterBuilder.java:2446)
	at org.joda.time.format.DateTimeFormatter.printTo(DateTimeFormatter.java:609)
	at org.joda.time.format.DateTimeFormatter.print(DateTimeFormatter.java:663)
	at org.joda.time.Partial.toString(Partial.java:781)
	at org.joda.time.TestPartial_Basics.check(TestPartial_Basics.java:927)
	at org.joda.time.TestPartial_Basics.testWithFieldAddWrapped8(TestPartial_Basics.java:710)

testGetFormatter1(org.joda.time.TestPartial_Basics)  Time elapsed: 0.001 sec  <<< ERROR!
java.lang.ArrayIndexOutOfBoundsException: -1
	at org.joda.time.Partial.getFieldType(Partial.java:369)
	at org.joda.time.base.AbstractPartial.indexOf(AbstractPartial.java:42)
	at org.joda.time.Partial.with(Partial.java:455)
	at org.joda.time.TestPartial_Basics.testGetFormatter1(TestPartial_Basics.java:803)

testGetFormatter2(org.joda.time.TestPartial_Basics)  Time elapsed: 0 sec  <<< ERROR!
java.lang.ArrayIndexOutOfBoundsException: -1
	at org.joda.time.Partial.getFieldType(Partial.java:369)
	at org.joda.time.base.AbstractPartial.indexOf(AbstractPartial.java:42)
	at org.joda.time.Partial.with(Partial.java:455)
	at org.joda.time.TestPartial_Basics.testGetFormatter2(TestPartial_Basics.java:820)

testGetFormatter3(org.joda.time.TestPartial_Basics)  Time elapsed: 0.001 sec  <<< ERROR!
java.lang.ArrayIndexOutOfBoundsException: -1
	at org.joda.time.Partial.getFieldType(Partial.java:369)
	at org.joda.time.base.AbstractPartial.indexOf(AbstractPartial.java:42)
	at org.joda.time.Partial.with(Partial.java:455)
	at org.joda.time.TestPartial_Basics.testGetFormatter3(TestPartial_Basics.java:829)

testToString1(org.joda.time.TestPartial_Basics)  Time elapsed: 0 sec  <<< ERROR!
java.lang.ArrayIndexOutOfBoundsException: -1
	at org.joda.time.Partial.getFieldType(Partial.java:369)
	at org.joda.time.base.AbstractPartial.indexOf(AbstractPartial.java:42)
	at org.joda.time.base.AbstractPartial.isSupported(AbstractPartial.java:39)
	at org.joda.time.format.DateTimeFormatterBuilder$PaddedNumber.printTo(DateTimeFormatterBuilder.java:1434)
	at org.joda.time.format.DateTimeFormatterBuilder$Composite.printTo(DateTimeFormatterBuilder.java:2446)
	at org.joda.time.format.DateTimeFormatter.printTo(DateTimeFormatter.java:609)
	at org.joda.time.format.DateTimeFormatter.print(DateTimeFormatter.java:663)
	at org.joda.time.Partial.toString(Partial.java:781)
	at org.joda.time.TestPartial_Basics.testToString1(TestPartial_Basics.java:836)

testToString3(org.joda.time.TestPartial_Basics)  Time elapsed: 0.001 sec  <<< ERROR!
java.lang.ArrayIndexOutOfBoundsException: -1
	at org.joda.time.Partial.getFieldType(Partial.java:369)
	at org.joda.time.base.AbstractPartial.indexOf(AbstractPartial.java:42)
	at org.joda.time.Partial.with(Partial.java:455)
	at org.joda.time.TestPartial_Basics.testToString3(TestPartial_Basics.java:848)

testWith1(org.joda.time.TestPartial_Basics)  Time elapsed: 0 sec  <<< ERROR!
java.lang.ArrayIndexOutOfBoundsException: -1
	at org.joda.time.Partial.getFieldType(Partial.java:369)
	at org.joda.time.base.AbstractPartial.indexOf(AbstractPartial.java:42)
	at org.joda.time.base.AbstractPartial.isSupported(AbstractPartial.java:39)
	at org.joda.time.format.DateTimeFormatterBuilder$PaddedNumber.printTo(DateTimeFormatterBuilder.java:1434)
	at org.joda.time.format.DateTimeFormatterBuilder$Composite.printTo(DateTimeFormatterBuilder.java:2446)
	at org.joda.time.format.DateTimeFormatter.printTo(DateTimeFormatter.java:609)
	at org.joda.time.format.DateTimeFormatter.print(DateTimeFormatter.java:663)
	at org.joda.time.Partial.toString(Partial.java:781)
	at org.joda.time.TestPartial_Basics.check(TestPartial_Basics.java:927)
	at org.joda.time.TestPartial_Basics.testWith1(TestPartial_Basics.java:347)

testWith2(org.joda.time.TestPartial_Basics)  Time elapsed: 0.001 sec  <<< ERROR!
java.lang.ArrayIndexOutOfBoundsException: -1
	at org.joda.time.Partial.getFieldType(Partial.java:369)
	at org.joda.time.base.AbstractPartial.indexOf(AbstractPartial.java:42)
	at org.joda.time.base.AbstractPartial.isSupported(AbstractPartial.java:39)
	at org.joda.time.format.DateTimeFormatterBuilder$PaddedNumber.printTo(DateTimeFormatterBuilder.java:1434)
	at org.joda.time.format.DateTimeFormatterBuilder$Composite.printTo(DateTimeFormatterBuilder.java:2446)
	at org.joda.time.format.DateTimeFormatter.printTo(DateTimeFormatter.java:609)
	at org.joda.time.format.DateTimeFormatter.print(DateTimeFormatter.java:663)
	at org.joda.time.Partial.toString(Partial.java:781)
	at org.joda.time.TestPartial_Basics.check(TestPartial_Basics.java:927)
	at org.joda.time.TestPartial_Basics.testWith2(TestPartial_Basics.java:357)

testWith3(org.joda.time.TestPartial_Basics)  Time elapsed: 0 sec  <<< ERROR!
java.lang.ArrayIndexOutOfBoundsException: -1
	at org.joda.time.Partial.getFieldType(Partial.java:369)
	at org.joda.time.base.AbstractPartial.indexOf(AbstractPartial.java:42)
	at org.joda.time.Partial.with(Partial.java:455)
	at org.joda.time.TestPartial_Basics.testWith3(TestPartial_Basics.java:363)

testWith3a(org.joda.time.TestPartial_Basics)  Time elapsed: 0 sec  <<< ERROR!
java.lang.ArrayIndexOutOfBoundsException: -1
	at org.joda.time.Partial.getFieldType(Partial.java:369)
	at org.joda.time.base.AbstractPartial.indexOf(AbstractPartial.java:42)
	at org.joda.time.Partial.with(Partial.java:455)
	at org.joda.time.TestPartial_Basics.testWith3a(TestPartial_Basics.java:371)

testWith3b(org.joda.time.TestPartial_Basics)  Time elapsed: 0.001 sec  <<< ERROR!
java.lang.ArrayIndexOutOfBoundsException: -1
	at org.joda.time.Partial.getFieldType(Partial.java:369)
	at org.joda.time.base.AbstractPartial.indexOf(AbstractPartial.java:42)
	at org.joda.time.Partial.with(Partial.java:455)
	at org.joda.time.TestPartial_Basics.testWith3b(TestPartial_Basics.java:387)

testWith3c(org.joda.time.TestPartial_Basics)  Time elapsed: 0 sec  <<< ERROR!
java.lang.ArrayIndexOutOfBoundsException: -1
	at org.joda.time.Partial.getFieldType(Partial.java:369)
	at org.joda.time.base.AbstractPartial.indexOf(AbstractPartial.java:42)
	at org.joda.time.Partial.with(Partial.java:455)
	at org.joda.time.TestPartial_Basics.testWith3c(TestPartial_Basics.java:403)

testWith3d(org.joda.time.TestPartial_Basics)  Time elapsed: 0 sec  <<< ERROR!
java.lang.ArrayIndexOutOfBoundsException: -1
	at org.joda.time.Partial.getFieldType(Partial.java:369)
	at org.joda.time.base.AbstractPartial.indexOf(AbstractPartial.java:42)
	at org.joda.time.Partial.with(Partial.java:455)
	at org.joda.time.TestPartial_Basics.testWith3d(TestPartial_Basics.java:419)

testWith3e(org.joda.time.TestPartial_Basics)  Time elapsed: 0.001 sec  <<< ERROR!
java.lang.ArrayIndexOutOfBoundsException: -1
	at org.joda.time.Partial.getFieldType(Partial.java:369)
	at org.joda.time.base.AbstractPartial.indexOf(AbstractPartial.java:42)
	at org.joda.time.Partial.with(Partial.java:455)
	at org.joda.time.TestPartial_Basics.testWith3e(TestPartial_Basics.java:427)

testWith3f(org.joda.time.TestPartial_Basics)  Time elapsed: 0 sec  <<< ERROR!
java.lang.ArrayIndexOutOfBoundsException: -1
	at org.joda.time.Partial.getFieldType(Partial.java:369)
	at org.joda.time.base.AbstractPartial.indexOf(AbstractPartial.java:42)
	at org.joda.time.Partial.with(Partial.java:455)
	at org.joda.time.TestPartial_Basics.testWith3f(TestPartial_Basics.java:437)

testWith_baseHasNoRange(org.joda.time.TestPartial_Basics)  Time elapsed: 0 sec  <<< ERROR!
java.lang.ArrayIndexOutOfBoundsException: -1
	at org.joda.time.Partial.getFieldType(Partial.java:369)
	at org.joda.time.base.AbstractPartial.indexOf(AbstractPartial.java:42)
	at org.joda.time.Partial.with(Partial.java:455)
	at org.joda.time.TestPartial_Basics.testWith_baseHasNoRange(TestPartial_Basics.java:453)

testWith_argHasNoRange(org.joda.time.TestPartial_Basics)  Time elapsed: 0.001 sec  <<< ERROR!
java.lang.ArrayIndexOutOfBoundsException: -1
	at org.joda.time.Partial.getFieldType(Partial.java:369)
	at org.joda.time.base.AbstractPartial.indexOf(AbstractPartial.java:42)
	at org.joda.time.Partial.with(Partial.java:455)
	at org.joda.time.TestPartial_Basics.testWith_argHasNoRange(TestPartial_Basics.java:461)

testToString4(org.joda.time.TestPartial_Basics)  Time elapsed: 0 sec  <<< ERROR!
java.lang.ArrayIndexOutOfBoundsException: -1
	at org.joda.time.Partial.getFieldType(Partial.java:369)
	at org.joda.time.base.AbstractPartial.indexOf(AbstractPartial.java:42)
	at org.joda.time.Partial.with(Partial.java:455)
	at org.joda.time.TestPartial_Basics.testToString4(TestPartial_Basics.java:862)

testToString5(org.joda.time.TestPartial_Basics)  Time elapsed: 0.001 sec  <<< ERROR!
java.lang.ArrayIndexOutOfBoundsException: -1
	at org.joda.time.Partial.getFieldType(Partial.java:369)
	at org.joda.time.base.AbstractPartial.indexOf(AbstractPartial.java:42)
	at org.joda.time.Partial.with(Partial.java:455)
	at org.joda.time.TestPartial_Basics.testToString5(TestPartial_Basics.java:870)

testConstructor_TypeArray_intArray(org.joda.time.TestPartial_Constructors)  Time elapsed: 0.001 sec  <<< ERROR!
java.lang.ArrayIndexOutOfBoundsException: -1
	at org.joda.time.Partial.getFieldType(Partial.java:369)
	at org.joda.time.base.AbstractPartial.indexOf(AbstractPartial.java:42)
	at org.joda.time.base.AbstractPartial.indexOfSupported(AbstractPartial.java:44)
	at org.joda.time.base.AbstractPartial.get(AbstractPartial.java:38)
	at org.joda.time.TestPartial_Constructors.testConstructor_TypeArray_intArray(TestPartial_Constructors.java:186)

testConstructor_TypeArray_intArray_year_weekyear(org.joda.time.TestPartial_Constructors)  Time elapsed: 0 sec  <<< ERROR!
java.lang.ArrayIndexOutOfBoundsException: -1
	at org.joda.time.Partial.getFieldType(Partial.java:369)
	at org.joda.time.base.AbstractPartial.indexOf(AbstractPartial.java:42)
	at org.joda.time.base.AbstractPartial.indexOfSupported(AbstractPartial.java:44)
	at org.joda.time.base.AbstractPartial.get(AbstractPartial.java:38)
	at org.joda.time.TestPartial_Constructors.testConstructor_TypeArray_intArray_year_weekyear(TestPartial_Constructors.java:208)

testConstructor_TypeArray_intArray_Chrono(org.joda.time.TestPartial_Constructors)  Time elapsed: 0 sec  <<< ERROR!
java.lang.ArrayIndexOutOfBoundsException: -1
	at org.joda.time.Partial.getFieldType(Partial.java:369)
	at org.joda.time.base.AbstractPartial.indexOf(AbstractPartial.java:42)
	at org.joda.time.base.AbstractPartial.indexOfSupported(AbstractPartial.java:44)
	at org.joda.time.base.AbstractPartial.get(AbstractPartial.java:38)
	at org.joda.time.TestPartial_Constructors.testConstructor_TypeArray_intArray_Chrono(TestPartial_Constructors.java:431)

testConstructor_Partial(org.joda.time.TestPartial_Constructors)  Time elapsed: 0.001 sec  <<< ERROR!
java.lang.ArrayIndexOutOfBoundsException: -1
	at org.joda.time.Partial.getFieldType(Partial.java:369)
	at org.joda.time.base.AbstractPartial.indexOf(AbstractPartial.java:42)
	at org.joda.time.base.AbstractPartial.indexOfSupported(AbstractPartial.java:44)
	at org.joda.time.base.AbstractPartial.get(AbstractPartial.java:38)
	at org.joda.time.TestPartial_Constructors.testConstructor_Partial(TestPartial_Constructors.java:451)

testPropertySetHour(org.joda.time.TestPartial_Properties)  Time elapsed: 0.001 sec  <<< ERROR!
java.lang.ArrayIndexOutOfBoundsException: -1
	at org.joda.time.Partial.getFieldType(Partial.java:369)
	at org.joda.time.base.AbstractPartial.indexOf(AbstractPartial.java:42)
	at org.joda.time.base.AbstractPartial.indexOfSupported(AbstractPartial.java:44)
	at org.joda.time.base.AbstractPartial.get(AbstractPartial.java:38)
	at org.joda.time.TestPartial_Properties.check(TestPartial_Properties.java:412)
	at org.joda.time.TestPartial_Properties.testPropertySetHour(TestPartial_Properties.java:181)

testPropertySetTextHour(org.joda.time.TestPartial_Properties)  Time elapsed: 0 sec  <<< ERROR!
java.lang.ArrayIndexOutOfBoundsException: -1
	at org.joda.time.Partial.getFieldType(Partial.java:369)
	at org.joda.time.base.AbstractPartial.indexOf(AbstractPartial.java:42)
	at org.joda.time.base.AbstractPartial.indexOfSupported(AbstractPartial.java:44)
	at org.joda.time.base.AbstractPartial.get(AbstractPartial.java:38)
	at org.joda.time.TestPartial_Properties.check(TestPartial_Properties.java:412)
	at org.joda.time.TestPartial_Properties.testPropertySetTextHour(TestPartial_Properties.java:197)

testPropertyWithMaximumValueHour(org.joda.time.TestPartial_Properties)  Time elapsed: 0 sec  <<< ERROR!
java.lang.ArrayIndexOutOfBoundsException: -1
	at org.joda.time.Partial.getFieldType(Partial.java:369)
	at org.joda.time.base.AbstractPartial.indexOf(AbstractPartial.java:42)
	at org.joda.time.base.AbstractPartial.indexOfSupported(AbstractPartial.java:44)
	at org.joda.time.base.AbstractPartial.get(AbstractPartial.java:38)
	at org.joda.time.TestPartial_Properties.check(TestPartial_Properties.java:412)
	at org.joda.time.TestPartial_Properties.testPropertyWithMaximumValueHour(TestPartial_Properties.java:204)

testPropertyWithMinimumValueHour(org.joda.time.TestPartial_Properties)  Time elapsed: 0.001 sec  <<< ERROR!
java.lang.ArrayIndexOutOfBoundsException: -1
	at org.joda.time.Partial.getFieldType(Partial.java:369)
	at org.joda.time.base.AbstractPartial.indexOf(AbstractPartial.java:42)
	at org.joda.time.base.AbstractPartial.indexOfSupported(AbstractPartial.java:44)
	at org.joda.time.base.AbstractPartial.get(AbstractPartial.java:38)
	at org.joda.time.TestPartial_Properties.check(TestPartial_Properties.java:412)
	at org.joda.time.TestPartial_Properties.testPropertyWithMinimumValueHour(TestPartial_Properties.java:211)

testPropertyGetMinute(org.joda.time.TestPartial_Properties)  Time elapsed: 0 sec  <<< ERROR!
java.lang.ArrayIndexOutOfBoundsException: -1
	at org.joda.time.Partial.getFieldType(Partial.java:369)
	at org.joda.time.base.AbstractPartial.indexOf(AbstractPartial.java:42)
	at org.joda.time.base.AbstractPartial.indexOfSupported(AbstractPartial.java:44)
	at org.joda.time.Partial.property(Partial.java:673)
	at org.joda.time.TestPartial_Properties.testPropertyGetMinute(TestPartial_Properties.java:240)

testPropertyGetMaxMinValuesMinute(org.joda.time.TestPartial_Properties)  Time elapsed: 0.001 sec  <<< ERROR!
java.lang.ArrayIndexOutOfBoundsException: -1
	at org.joda.time.Partial.getFieldType(Partial.java:369)
	at org.joda.time.base.AbstractPartial.indexOf(AbstractPartial.java:42)
	at org.joda.time.base.AbstractPartial.indexOfSupported(AbstractPartial.java:44)
	at org.joda.time.Partial.property(Partial.java:673)
	at org.joda.time.TestPartial_Properties.testPropertyGetMaxMinValuesMinute(TestPartial_Properties.java:259)

testPropertySetMinute(org.joda.time.TestPartial_Properties)  Time elapsed: 0 sec  <<< ERROR!
java.lang.ArrayIndexOutOfBoundsException: -1
	at org.joda.time.Partial.getFieldType(Partial.java:369)
	at org.joda.time.base.AbstractPartial.indexOf(AbstractPartial.java:42)
	at org.joda.time.base.AbstractPartial.indexOfSupported(AbstractPartial.java:44)
	at org.joda.time.Partial.property(Partial.java:673)
	at org.joda.time.TestPartial_Properties.testPropertySetMinute(TestPartial_Properties.java:366)

testPropertySetTextMinute(org.joda.time.TestPartial_Properties)  Time elapsed: 0.001 sec  <<< ERROR!
java.lang.ArrayIndexOutOfBoundsException: -1
	at org.joda.time.Partial.getFieldType(Partial.java:369)
	at org.joda.time.base.AbstractPartial.indexOf(AbstractPartial.java:42)
	at org.joda.time.base.AbstractPartial.indexOfSupported(AbstractPartial.java:44)
	at org.joda.time.Partial.property(Partial.java:673)
	at org.joda.time.TestPartial_Properties.testPropertySetTextMinute(TestPartial_Properties.java:382)

testPropertyCompareToMinute(org.joda.time.TestPartial_Properties)  Time elapsed: 0 sec  <<< ERROR!
java.lang.ArrayIndexOutOfBoundsException: -1
	at org.joda.time.Partial.getFieldType(Partial.java:369)
	at org.joda.time.base.AbstractPartial.indexOf(AbstractPartial.java:42)
	at org.joda.time.base.AbstractPartial.indexOfSupported(AbstractPartial.java:44)
	at org.joda.time.Partial.property(Partial.java:673)
	at org.joda.time.TestPartial_Properties.testPropertyCompareToMinute(TestPartial_Properties.java:390)

testPropertyAddHour(org.joda.time.TestPartial_Properties)  Time elapsed: 0 sec  <<< ERROR!
java.lang.ArrayIndexOutOfBoundsException: -1
	at org.joda.time.Partial.getFieldType(Partial.java:369)
	at org.joda.time.base.AbstractPartial.indexOf(AbstractPartial.java:42)
	at org.joda.time.base.AbstractPartial.indexOfSupported(AbstractPartial.java:44)
	at org.joda.time.base.AbstractPartial.get(AbstractPartial.java:38)
	at org.joda.time.TestPartial_Properties.check(TestPartial_Properties.java:412)
	at org.joda.time.TestPartial_Properties.testPropertyAddHour(TestPartial_Properties.java:137)

testPropertyAddWrapFieldHour(org.joda.time.TestPartial_Properties)  Time elapsed: 0.001 sec  <<< ERROR!
java.lang.ArrayIndexOutOfBoundsException: -1
	at org.joda.time.Partial.getFieldType(Partial.java:369)
	at org.joda.time.base.AbstractPartial.indexOf(AbstractPartial.java:42)
	at org.joda.time.base.AbstractPartial.indexOfSupported(AbstractPartial.java:44)
	at org.joda.time.base.AbstractPartial.get(AbstractPartial.java:38)
	at org.joda.time.TestPartial_Properties.check(TestPartial_Properties.java:412)
	at org.joda.time.TestPartial_Properties.testPropertyAddWrapFieldHour(TestPartial_Properties.java:165)

testPropertyAddMinute(org.joda.time.TestPartial_Properties)  Time elapsed: 0 sec  <<< ERROR!
java.lang.ArrayIndexOutOfBoundsException: -1
	at org.joda.time.Partial.getFieldType(Partial.java:369)
	at org.joda.time.base.AbstractPartial.indexOf(AbstractPartial.java:42)
	at org.joda.time.base.AbstractPartial.indexOfSupported(AbstractPartial.java:44)
	at org.joda.time.Partial.property(Partial.java:673)
	at org.joda.time.TestPartial_Properties.testPropertyAddMinute(TestPartial_Properties.java:307)

testPropertyAddWrapFieldMinute(org.joda.time.TestPartial_Properties)  Time elapsed: 0.001 sec  <<< ERROR!
java.lang.ArrayIndexOutOfBoundsException: -1
	at org.joda.time.Partial.getFieldType(Partial.java:369)
	at org.joda.time.base.AbstractPartial.indexOf(AbstractPartial.java:42)
	at org.joda.time.base.AbstractPartial.indexOfSupported(AbstractPartial.java:44)
	at org.joda.time.Partial.property(Partial.java:673)
	at org.joda.time.TestPartial_Properties.testPropertyAddWrapFieldMinute(TestPartial_Properties.java:353)

testIsContiguous_RP(org.joda.time.TestDateTimeUtils)  Time elapsed: 0.001 sec  <<< ERROR!
java.lang.ArrayIndexOutOfBoundsException: -1
	at org.joda.time.Partial.getFieldType(Partial.java:369)
	at org.joda.time.base.AbstractPartial.indexOf(AbstractPartial.java:42)
	at org.joda.time.Partial.with(Partial.java:455)
	at org.joda.time.TestDateTimeUtils.testIsContiguous_RP(TestDateTimeUtils.java:438)

testIsContiguous_RP_GJChronology(org.joda.time.TestDateTimeUtils)  Time elapsed: 0 sec  <<< ERROR!
java.lang.ArrayIndexOutOfBoundsException: -1
	at org.joda.time.Partial.getFieldType(Partial.java:369)
	at org.joda.time.base.AbstractPartial.indexOf(AbstractPartial.java:42)
	at org.joda.time.Partial.with(Partial.java:455)
	at org.joda.time.TestDateTimeUtils.testIsContiguous_RP_GJChronology(TestDateTimeUtils.java:462)

testMonthDay(org.joda.time.TestStringConvert)  Time elapsed: 0.037 sec  <<< ERROR!
java.lang.ArrayIndexOutOfBoundsException: -1
	at org.joda.time.MonthDay.getFieldType(MonthDay.java:426)
	at org.joda.time.base.AbstractPartial.indexOf(AbstractPartial.java:42)
	at org.joda.time.base.AbstractPartial.isSupported(AbstractPartial.java:39)
	at org.joda.time.format.DateTimeFormatterBuilder$PaddedNumber.printTo(DateTimeFormatterBuilder.java:1434)
	at org.joda.time.format.DateTimeFormatterBuilder$Composite.printTo(DateTimeFormatterBuilder.java:2446)
	at org.joda.time.format.DateTimeFormatter.printTo(DateTimeFormatter.java:609)
	at org.joda.time.format.DateTimeFormatter.print(DateTimeFormatter.java:663)
	at org.joda.time.MonthDay.toString(MonthDay.java:786)
	at sun.reflect.NativeMethodAccessorImpl.invoke0(Native Method)
	at sun.reflect.NativeMethodAccessorImpl.invoke(NativeMethodAccessorImpl.java:57)
	at sun.reflect.DelegatingMethodAccessorImpl.invoke(DelegatingMethodAccessorImpl.java:43)
	at java.lang.reflect.Method.invoke(Method.java:606)
	at org.joda.convert.ReflectionStringConverter.convertToString(ReflectionStringConverter.java:63)
	at org.joda.convert.StringConvert.convertToString(StringConvert.java:124)
	at org.joda.time.TestStringConvert.testMonthDay(TestStringConvert.java:104)

testMonthDay_leapDay(org.joda.time.TestStringConvert)  Time elapsed: 0.001 sec  <<< ERROR!
java.lang.ArrayIndexOutOfBoundsException: -1
	at org.joda.time.MonthDay.getFieldType(MonthDay.java:426)
	at org.joda.time.base.AbstractPartial.indexOf(AbstractPartial.java:42)
	at org.joda.time.base.AbstractPartial.isSupported(AbstractPartial.java:39)
	at org.joda.time.format.DateTimeFormatterBuilder$PaddedNumber.printTo(DateTimeFormatterBuilder.java:1434)
	at org.joda.time.format.DateTimeFormatterBuilder$Composite.printTo(DateTimeFormatterBuilder.java:2446)
	at org.joda.time.format.DateTimeFormatter.printTo(DateTimeFormatter.java:609)
	at org.joda.time.format.DateTimeFormatter.print(DateTimeFormatter.java:663)
	at org.joda.time.MonthDay.toString(MonthDay.java:786)
	at sun.reflect.NativeMethodAccessorImpl.invoke0(Native Method)
	at sun.reflect.NativeMethodAccessorImpl.invoke(NativeMethodAccessorImpl.java:57)
	at sun.reflect.DelegatingMethodAccessorImpl.invoke(DelegatingMethodAccessorImpl.java:43)
	at java.lang.reflect.Method.invoke(Method.java:606)
	at org.joda.convert.ReflectionStringConverter.convertToString(ReflectionStringConverter.java:63)
	at org.joda.convert.StringConvert.convertToString(StringConvert.java:124)
	at org.joda.time.TestStringConvert.testMonthDay_leapDay(TestStringConvert.java:111)

testYearMonth(org.joda.time.TestStringConvert)  Time elapsed: 0.002 sec  <<< ERROR!
java.lang.ArrayIndexOutOfBoundsException: -1
	at org.joda.time.YearMonth.getFieldType(YearMonth.java:418)
	at org.joda.time.base.AbstractPartial.indexOf(AbstractPartial.java:42)
	at org.joda.time.base.AbstractPartial.isSupported(AbstractPartial.java:39)
	at org.joda.time.format.DateTimeFormatterBuilder$PaddedNumber.printTo(DateTimeFormatterBuilder.java:1434)
	at org.joda.time.format.DateTimeFormatterBuilder$Composite.printTo(DateTimeFormatterBuilder.java:2446)
	at org.joda.time.format.DateTimeFormatter.printTo(DateTimeFormatter.java:609)
	at org.joda.time.format.DateTimeFormatter.print(DateTimeFormatter.java:663)
	at org.joda.time.YearMonth.toString(YearMonth.java:797)
	at sun.reflect.NativeMethodAccessorImpl.invoke0(Native Method)
	at sun.reflect.NativeMethodAccessorImpl.invoke(NativeMethodAccessorImpl.java:57)
	at sun.reflect.DelegatingMethodAccessorImpl.invoke(DelegatingMethodAccessorImpl.java:43)
	at java.lang.reflect.Method.invoke(Method.java:606)
	at org.joda.convert.ReflectionStringConverter.convertToString(ReflectionStringConverter.java:63)
	at org.joda.convert.StringConvert.convertToString(StringConvert.java:124)
	at org.joda.time.TestStringConvert.testYearMonth(TestStringConvert.java:97)

testMaximumValue(org.joda.time.chrono.TestGregorianChronology)  Time elapsed: 0 sec  <<< ERROR!
java.lang.ArrayIndexOutOfBoundsException

testMaximumValue(org.joda.time.chrono.TestISOChronology)  Time elapsed: 0.001 sec  <<< ERROR!
java.lang.ArrayIndexOutOfBoundsException

testPartialDayOfYearAdd(org.joda.time.chrono.TestISOChronology)  Time elapsed: 0.001 sec  <<< ERROR!
java.lang.ArrayIndexOutOfBoundsException: -1
	at org.joda.time.Partial.getFieldType(Partial.java:369)
	at org.joda.time.base.AbstractPartial.indexOf(AbstractPartial.java:42)
	at org.joda.time.Partial.with(Partial.java:455)
	at org.joda.time.chrono.TestISOChronology.testPartialDayOfYearAdd(TestISOChronology.java:440)

testGetPartialValues(org.joda.time.convert.TestReadablePartialConverter)  Time elapsed: 0.001 sec  <<< ERROR!
java.lang.ArrayIndexOutOfBoundsException: -1
	at org.joda.time.TimeOfDay.getFieldType(TimeOfDay.java:464)
	at org.joda.time.base.AbstractPartial.indexOf(AbstractPartial.java:42)
	at org.joda.time.base.AbstractPartial.indexOfSupported(AbstractPartial.java:44)
	at org.joda.time.base.AbstractPartial.get(AbstractPartial.java:38)
	at org.joda.time.convert.ReadablePartialConverter.getPartialValues(ReadablePartialConverter.java:91)
	at org.joda.time.convert.TestReadablePartialConverter.testGetPartialValues(TestReadablePartialConverter.java:110)

test_getAsText_RP_Locale(org.joda.time.field.TestBaseDateTimeField)  Time elapsed: 0 sec  <<< ERROR!
java.lang.ArrayIndexOutOfBoundsException: -1
	at org.joda.time.TimeOfDay.getFieldType(TimeOfDay.java:464)
	at org.joda.time.base.AbstractPartial.indexOf(AbstractPartial.java:42)
	at org.joda.time.base.AbstractPartial.indexOfSupported(AbstractPartial.java:44)
	at org.joda.time.base.AbstractPartial.get(AbstractPartial.java:38)
	at org.joda.time.field.BaseDateTimeField.getAsText(BaseDateTimeField.java:136)
	at org.joda.time.field.TestBaseDateTimeField.test_getAsText_RP_Locale(TestBaseDateTimeField.java:115)

test_getAsShortText_RP_Locale(org.joda.time.field.TestBaseDateTimeField)  Time elapsed: 0 sec  <<< ERROR!
java.lang.ArrayIndexOutOfBoundsException: -1
	at org.joda.time.TimeOfDay.getFieldType(TimeOfDay.java:464)
	at org.joda.time.base.AbstractPartial.indexOf(AbstractPartial.java:42)
	at org.joda.time.base.AbstractPartial.indexOfSupported(AbstractPartial.java:44)
	at org.joda.time.base.AbstractPartial.get(AbstractPartial.java:38)
	at org.joda.time.field.BaseDateTimeField.getAsShortText(BaseDateTimeField.java:210)
	at org.joda.time.field.TestBaseDateTimeField.test_getAsShortText_RP_Locale(TestBaseDateTimeField.java:145)

test_getAsText_RP_Locale(org.joda.time.field.TestOffsetDateTimeField)  Time elapsed: 0.001 sec  <<< ERROR!
java.lang.ArrayIndexOutOfBoundsException: -1
	at org.joda.time.TimeOfDay.getFieldType(TimeOfDay.java:464)
	at org.joda.time.base.AbstractPartial.indexOf(AbstractPartial.java:42)
	at org.joda.time.base.AbstractPartial.indexOfSupported(AbstractPartial.java:44)
	at org.joda.time.base.AbstractPartial.get(AbstractPartial.java:38)
	at org.joda.time.field.BaseDateTimeField.getAsText(BaseDateTimeField.java:136)
	at org.joda.time.field.TestOffsetDateTimeField.test_getAsText_RP_Locale(TestOffsetDateTimeField.java:167)

test_getAsShortText_RP_Locale(org.joda.time.field.TestOffsetDateTimeField)  Time elapsed: 0.001 sec  <<< ERROR!
java.lang.ArrayIndexOutOfBoundsException: -1
	at org.joda.time.TimeOfDay.getFieldType(TimeOfDay.java:464)
	at org.joda.time.base.AbstractPartial.indexOf(AbstractPartial.java:42)
	at org.joda.time.base.AbstractPartial.indexOfSupported(AbstractPartial.java:44)
	at org.joda.time.base.AbstractPartial.get(AbstractPartial.java:38)
	at org.joda.time.field.BaseDateTimeField.getAsShortText(BaseDateTimeField.java:210)
	at org.joda.time.field.TestOffsetDateTimeField.test_getAsShortText_RP_Locale(TestOffsetDateTimeField.java:197)

test_getAsText_RP_Locale(org.joda.time.field.TestPreciseDurationDateTimeField)  Time elapsed: 0 sec  <<< ERROR!
java.lang.ArrayIndexOutOfBoundsException: -1
	at org.joda.time.TimeOfDay.getFieldType(TimeOfDay.java:464)
	at org.joda.time.base.AbstractPartial.indexOf(AbstractPartial.java:42)
	at org.joda.time.base.AbstractPartial.indexOfSupported(AbstractPartial.java:44)
	at org.joda.time.base.AbstractPartial.get(AbstractPartial.java:38)
	at org.joda.time.field.BaseDateTimeField.getAsText(BaseDateTimeField.java:136)
	at org.joda.time.field.TestPreciseDurationDateTimeField.test_getAsText_RP_Locale(TestPreciseDurationDateTimeField.java:132)

test_getAsShortText_RP_Locale(org.joda.time.field.TestPreciseDurationDateTimeField)  Time elapsed: 0 sec  <<< ERROR!
java.lang.ArrayIndexOutOfBoundsException: -1
	at org.joda.time.TimeOfDay.getFieldType(TimeOfDay.java:464)
	at org.joda.time.base.AbstractPartial.indexOf(AbstractPartial.java:42)
	at org.joda.time.base.AbstractPartial.indexOfSupported(AbstractPartial.java:44)
	at org.joda.time.base.AbstractPartial.get(AbstractPartial.java:38)
	at org.joda.time.field.BaseDateTimeField.getAsShortText(BaseDateTimeField.java:210)
	at org.joda.time.field.TestPreciseDurationDateTimeField.test_getAsShortText_RP_Locale(TestPreciseDurationDateTimeField.java:162)

test_getAsText_RP_Locale(org.joda.time.field.TestPreciseDateTimeField)  Time elapsed: 0 sec  <<< ERROR!
java.lang.ArrayIndexOutOfBoundsException: -1
	at org.joda.time.TimeOfDay.getFieldType(TimeOfDay.java:464)
	at org.joda.time.base.AbstractPartial.indexOf(AbstractPartial.java:42)
	at org.joda.time.base.AbstractPartial.indexOfSupported(AbstractPartial.java:44)
	at org.joda.time.base.AbstractPartial.get(AbstractPartial.java:38)
	at org.joda.time.field.BaseDateTimeField.getAsText(BaseDateTimeField.java:136)
	at org.joda.time.field.TestPreciseDateTimeField.test_getAsText_RP_Locale(TestPreciseDateTimeField.java:161)

test_getAsShortText_RP_Locale(org.joda.time.field.TestPreciseDateTimeField)  Time elapsed: 0.001 sec  <<< ERROR!
java.lang.ArrayIndexOutOfBoundsException: -1
	at org.joda.time.TimeOfDay.getFieldType(TimeOfDay.java:464)
	at org.joda.time.base.AbstractPartial.indexOf(AbstractPartial.java:42)
	at org.joda.time.base.AbstractPartial.indexOfSupported(AbstractPartial.java:44)
	at org.joda.time.base.AbstractPartial.get(AbstractPartial.java:38)
	at org.joda.time.field.BaseDateTimeField.getAsShortText(BaseDateTimeField.java:210)
	at org.joda.time.field.TestPreciseDateTimeField.test_getAsShortText_RP_Locale(TestPreciseDateTimeField.java:191)

testPrint_bufferMethods(org.joda.time.format.TestDateTimeFormatter)  Time elapsed: 0 sec  <<< ERROR!
java.lang.ArrayIndexOutOfBoundsException

testPrint_writerMethods(org.joda.time.format.TestDateTimeFormatter)  Time elapsed: 0.001 sec  <<< ERROR!
java.lang.ArrayIndexOutOfBoundsException

testFormat_timeNoMillis_partial(org.joda.time.format.TestISODateTimeFormat)  Time elapsed: 0.001 sec  <<< ERROR!
java.lang.ArrayIndexOutOfBoundsException: -1
	at org.joda.time.Partial.getFieldType(Partial.java:369)
	at org.joda.time.base.AbstractPartial.indexOf(AbstractPartial.java:42)
	at org.joda.time.base.AbstractPartial.isSupported(AbstractPartial.java:39)
	at org.joda.time.format.DateTimeFormatterBuilder$PaddedNumber.printTo(DateTimeFormatterBuilder.java:1434)
	at org.joda.time.format.DateTimeFormatterBuilder$Composite.printTo(DateTimeFormatterBuilder.java:2446)
	at org.joda.time.format.DateTimeFormatter.printTo(DateTimeFormatter.java:609)
	at org.joda.time.format.DateTimeFormatter.print(DateTimeFormatter.java:663)
	at org.joda.time.format.TestISODateTimeFormat.testFormat_timeNoMillis_partial(TestISODateTimeFormat.java:149)

testFormat_date_partial(org.joda.time.format.TestISODateTimeFormat)  Time elapsed: 0.001 sec  <<< ERROR!
java.lang.ArrayIndexOutOfBoundsException: -1
	at org.joda.time.Partial.getFieldType(Partial.java:369)
	at org.joda.time.base.AbstractPartial.indexOf(AbstractPartial.java:42)
	at org.joda.time.base.AbstractPartial.isSupported(AbstractPartial.java:39)
	at org.joda.time.format.DateTimeFormatterBuilder$PaddedNumber.printTo(DateTimeFormatterBuilder.java:1434)
	at org.joda.time.format.DateTimeFormatterBuilder$Composite.printTo(DateTimeFormatterBuilder.java:2446)
	at org.joda.time.format.DateTimeFormatter.printTo(DateTimeFormatter.java:609)
	at org.joda.time.format.DateTimeFormatter.print(DateTimeFormatter.java:663)
	at org.joda.time.format.TestISODateTimeFormat.testFormat_date_partial(TestISODateTimeFormat.java:111)

testFormat_time_partial(org.joda.time.format.TestISODateTimeFormat)  Time elapsed: 0 sec  <<< ERROR!
java.lang.ArrayIndexOutOfBoundsException: -1
	at org.joda.time.Partial.getFieldType(Partial.java:369)
	at org.joda.time.base.AbstractPartial.indexOf(AbstractPartial.java:42)
	at org.joda.time.base.AbstractPartial.isSupported(AbstractPartial.java:39)
	at org.joda.time.format.DateTimeFormatterBuilder$PaddedNumber.printTo(DateTimeFormatterBuilder.java:1434)
	at org.joda.time.format.DateTimeFormatterBuilder$Composite.printTo(DateTimeFormatterBuilder.java:2446)
	at org.joda.time.format.DateTimeFormatter.printTo(DateTimeFormatter.java:609)
	at org.joda.time.format.DateTimeFormatter.print(DateTimeFormatter.java:663)
	at org.joda.time.format.TestISODateTimeFormat.testFormat_time_partial(TestISODateTimeFormat.java:130)

testForFields_calBased_YM(org.joda.time.format.TestISODateTimeFormat_Fields)  Time elapsed: 0 sec  <<< ERROR!
java.lang.ArrayIndexOutOfBoundsException: -1
	at org.joda.time.Partial.getFieldType(Partial.java:369)
	at org.joda.time.base.AbstractPartial.indexOf(AbstractPartial.java:42)
	at org.joda.time.base.AbstractPartial.isSupported(AbstractPartial.java:39)
	at org.joda.time.format.DateTimeFormatterBuilder$PaddedNumber.printTo(DateTimeFormatterBuilder.java:1434)
	at org.joda.time.format.DateTimeFormatterBuilder$Composite.printTo(DateTimeFormatterBuilder.java:2446)
	at org.joda.time.format.DateTimeFormatter.printTo(DateTimeFormatter.java:609)
	at org.joda.time.format.DateTimeFormatter.print(DateTimeFormatter.java:663)
	at org.joda.time.format.TestISODateTimeFormat_Fields.testForFields_calBased_YM(TestISODateTimeFormat_Fields.java:236)

testForFields_calBased_MD(org.joda.time.format.TestISODateTimeFormat_Fields)  Time elapsed: 0.001 sec  <<< ERROR!
java.lang.ArrayIndexOutOfBoundsException: -1
	at org.joda.time.Partial.getFieldType(Partial.java:369)
	at org.joda.time.base.AbstractPartial.indexOf(AbstractPartial.java:42)
	at org.joda.time.base.AbstractPartial.isSupported(AbstractPartial.java:39)
	at org.joda.time.format.DateTimeFormatterBuilder$PaddedNumber.printTo(DateTimeFormatterBuilder.java:1434)
	at org.joda.time.format.DateTimeFormatterBuilder$Composite.printTo(DateTimeFormatterBuilder.java:2446)
	at org.joda.time.format.DateTimeFormatter.printTo(DateTimeFormatter.java:609)
	at org.joda.time.format.DateTimeFormatter.print(DateTimeFormatter.java:663)
	at org.joda.time.format.TestISODateTimeFormat_Fields.testForFields_calBased_MD(TestISODateTimeFormat_Fields.java:264)

testForFields_calBased_YD(org.joda.time.format.TestISODateTimeFormat_Fields)  Time elapsed: 0 sec  <<< ERROR!
java.lang.ArrayIndexOutOfBoundsException: -1
	at org.joda.time.Partial.getFieldType(Partial.java:369)
	at org.joda.time.base.AbstractPartial.indexOf(AbstractPartial.java:42)
	at org.joda.time.base.AbstractPartial.isSupported(AbstractPartial.java:39)
	at org.joda.time.format.DateTimeFormatterBuilder$PaddedNumber.printTo(DateTimeFormatterBuilder.java:1434)
	at org.joda.time.format.DateTimeFormatterBuilder$Composite.printTo(DateTimeFormatterBuilder.java:2446)
	at org.joda.time.format.DateTimeFormatter.printTo(DateTimeFormatter.java:609)
	at org.joda.time.format.DateTimeFormatter.print(DateTimeFormatter.java:663)
	at org.joda.time.format.TestISODateTimeFormat_Fields.testForFields_calBased_YD(TestISODateTimeFormat_Fields.java:292)

testForFields_weekBased_YWD(org.joda.time.format.TestISODateTimeFormat_Fields)  Time elapsed: 0.001 sec  <<< ERROR!
java.lang.ArrayIndexOutOfBoundsException: -1
	at org.joda.time.Partial.getFieldType(Partial.java:369)
	at org.joda.time.base.AbstractPartial.indexOf(AbstractPartial.java:42)
	at org.joda.time.base.AbstractPartial.isSupported(AbstractPartial.java:39)
	at org.joda.time.format.DateTimeFormatterBuilder$PaddedNumber.printTo(DateTimeFormatterBuilder.java:1434)
	at org.joda.time.format.DateTimeFormatterBuilder$Composite.printTo(DateTimeFormatterBuilder.java:2446)
	at org.joda.time.format.DateTimeFormatter.printTo(DateTimeFormatter.java:609)
	at org.joda.time.format.DateTimeFormatter.print(DateTimeFormatter.java:663)
	at org.joda.time.format.TestISODateTimeFormat_Fields.testForFields_weekBased_YWD(TestISODateTimeFormat_Fields.java:325)

testForFields_weekBased_YW(org.joda.time.format.TestISODateTimeFormat_Fields)  Time elapsed: 0 sec  <<< ERROR!
java.lang.ArrayIndexOutOfBoundsException: -1
	at org.joda.time.Partial.getFieldType(Partial.java:369)
	at org.joda.time.base.AbstractPartial.indexOf(AbstractPartial.java:42)
	at org.joda.time.base.AbstractPartial.isSupported(AbstractPartial.java:39)
	at org.joda.time.format.DateTimeFormatterBuilder$PaddedNumber.printTo(DateTimeFormatterBuilder.java:1434)
	at org.joda.time.format.DateTimeFormatterBuilder$Composite.printTo(DateTimeFormatterBuilder.java:2446)
	at org.joda.time.format.DateTimeFormatter.printTo(DateTimeFormatter.java:609)
	at org.joda.time.format.DateTimeFormatter.print(DateTimeFormatter.java:663)
	at org.joda.time.format.TestISODateTimeFormat_Fields.testForFields_weekBased_YW(TestISODateTimeFormat_Fields.java:434)

testForFields_weekBased_WD(org.joda.time.format.TestISODateTimeFormat_Fields)  Time elapsed: 0.001 sec  <<< ERROR!
java.lang.ArrayIndexOutOfBoundsException: -1
	at org.joda.time.Partial.getFieldType(Partial.java:369)
	at org.joda.time.base.AbstractPartial.indexOf(AbstractPartial.java:42)
	at org.joda.time.base.AbstractPartial.isSupported(AbstractPartial.java:39)
	at org.joda.time.format.DateTimeFormatterBuilder$UnpaddedNumber.printTo(DateTimeFormatterBuilder.java:1394)
	at org.joda.time.format.DateTimeFormatterBuilder$Composite.printTo(DateTimeFormatterBuilder.java:2446)
	at org.joda.time.format.DateTimeFormatter.printTo(DateTimeFormatter.java:609)
	at org.joda.time.format.DateTimeFormatter.print(DateTimeFormatter.java:663)
	at org.joda.time.format.TestISODateTimeFormat_Fields.testForFields_weekBased_WD(TestISODateTimeFormat_Fields.java:462)

testForFields_weekBased_YD(org.joda.time.format.TestISODateTimeFormat_Fields)  Time elapsed: 0.001 sec  <<< ERROR!
java.lang.ArrayIndexOutOfBoundsException: -1
	at org.joda.time.Partial.getFieldType(Partial.java:369)
	at org.joda.time.base.AbstractPartial.indexOf(AbstractPartial.java:42)
	at org.joda.time.base.AbstractPartial.isSupported(AbstractPartial.java:39)
	at org.joda.time.format.DateTimeFormatterBuilder$UnpaddedNumber.printTo(DateTimeFormatterBuilder.java:1394)
	at org.joda.time.format.DateTimeFormatterBuilder$Composite.printTo(DateTimeFormatterBuilder.java:2446)
	at org.joda.time.format.DateTimeFormatter.printTo(DateTimeFormatter.java:609)
	at org.joda.time.format.DateTimeFormatter.print(DateTimeFormatter.java:663)
	at org.joda.time.format.TestISODateTimeFormat_Fields.testForFields_weekBased_YD(TestISODateTimeFormat_Fields.java:490)

testForFields_ordinalBased_YD(org.joda.time.format.TestISODateTimeFormat_Fields)  Time elapsed: 0.002 sec  <<< ERROR!
java.lang.ArrayIndexOutOfBoundsException: -1
	at org.joda.time.Partial.getFieldType(Partial.java:369)
	at org.joda.time.base.AbstractPartial.indexOf(AbstractPartial.java:42)
	at org.joda.time.base.AbstractPartial.isSupported(AbstractPartial.java:39)
	at org.joda.time.format.DateTimeFormatterBuilder$PaddedNumber.printTo(DateTimeFormatterBuilder.java:1434)
	at org.joda.time.format.DateTimeFormatterBuilder$Composite.printTo(DateTimeFormatterBuilder.java:2446)
	at org.joda.time.format.DateTimeFormatter.printTo(DateTimeFormatter.java:609)
	at org.joda.time.format.DateTimeFormatter.print(DateTimeFormatter.java:663)
	at org.joda.time.format.TestISODateTimeFormat_Fields.testForFields_ordinalBased_YD(TestISODateTimeFormat_Fields.java:522)

testForFields_calBased_YMD(org.joda.time.format.TestISODateTimeFormat_Fields)  Time elapsed: 0.001 sec  <<< ERROR!
java.lang.ArrayIndexOutOfBoundsException: -1
	at org.joda.time.Partial.getFieldType(Partial.java:369)
	at org.joda.time.base.AbstractPartial.indexOf(AbstractPartial.java:42)
	at org.joda.time.base.AbstractPartial.isSupported(AbstractPartial.java:39)
	at org.joda.time.format.DateTimeFormatterBuilder$PaddedNumber.printTo(DateTimeFormatterBuilder.java:1434)
	at org.joda.time.format.DateTimeFormatterBuilder$Composite.printTo(DateTimeFormatterBuilder.java:2446)
	at org.joda.time.format.DateTimeFormatter.printTo(DateTimeFormatter.java:609)
	at org.joda.time.format.DateTimeFormatter.print(DateTimeFormatter.java:663)
	at org.joda.time.format.TestISODateTimeFormat_Fields.testForFields_calBased_YMD(TestISODateTimeFormat_Fields.java:83)

testForFields_calBased_YMD_unmodifiable(org.joda.time.format.TestISODateTimeFormat_Fields)  Time elapsed: 0.001 sec  <<< ERROR!
java.lang.ArrayIndexOutOfBoundsException: -1
	at org.joda.time.Partial.getFieldType(Partial.java:369)
	at org.joda.time.base.AbstractPartial.indexOf(AbstractPartial.java:42)
	at org.joda.time.base.AbstractPartial.isSupported(AbstractPartial.java:39)
	at org.joda.time.format.DateTimeFormatterBuilder$PaddedNumber.printTo(DateTimeFormatterBuilder.java:1434)
	at org.joda.time.format.DateTimeFormatterBuilder$Composite.printTo(DateTimeFormatterBuilder.java:2446)
	at org.joda.time.format.DateTimeFormatter.printTo(DateTimeFormatter.java:609)
	at org.joda.time.format.DateTimeFormatter.print(DateTimeFormatter.java:663)
	at org.joda.time.format.TestISODateTimeFormat_Fields.testForFields_calBased_YMD_unmodifiable(TestISODateTimeFormat_Fields.java:112)

testForFields_calBased_YMD_duplicates(org.joda.time.format.TestISODateTimeFormat_Fields)  Time elapsed: 0.001 sec  <<< ERROR!
java.lang.ArrayIndexOutOfBoundsException: -1
	at org.joda.time.Partial.getFieldType(Partial.java:369)
	at org.joda.time.base.AbstractPartial.indexOf(AbstractPartial.java:42)
	at org.joda.time.base.AbstractPartial.isSupported(AbstractPartial.java:39)
	at org.joda.time.format.DateTimeFormatterBuilder$PaddedNumber.printTo(DateTimeFormatterBuilder.java:1434)
	at org.joda.time.format.DateTimeFormatterBuilder$Composite.printTo(DateTimeFormatterBuilder.java:2446)
	at org.joda.time.format.DateTimeFormatter.printTo(DateTimeFormatter.java:609)
	at org.joda.time.format.DateTimeFormatter.print(DateTimeFormatter.java:663)
	at org.joda.time.format.TestISODateTimeFormat_Fields.testForFields_calBased_YMD_duplicates(TestISODateTimeFormat_Fields.java:137)

testForFields_time_HMSm(org.joda.time.format.TestISODateTimeFormat_Fields)  Time elapsed: 0.001 sec  <<< ERROR!
java.lang.ArrayIndexOutOfBoundsException: -1
	at org.joda.time.Partial.getFieldType(Partial.java:369)
	at org.joda.time.base.AbstractPartial.indexOf(AbstractPartial.java:42)
	at org.joda.time.base.AbstractPartial.isSupported(AbstractPartial.java:39)
	at org.joda.time.format.DateTimeFormatterBuilder$PaddedNumber.printTo(DateTimeFormatterBuilder.java:1434)
	at org.joda.time.format.DateTimeFormatterBuilder$Composite.printTo(DateTimeFormatterBuilder.java:2446)
	at org.joda.time.format.DateTimeFormatter.printTo(DateTimeFormatter.java:609)
	at org.joda.time.format.DateTimeFormatter.print(DateTimeFormatter.java:663)
	at org.joda.time.format.TestISODateTimeFormat_Fields.testForFields_time_HMSm(TestISODateTimeFormat_Fields.java:608)

testForFields_time_HMS(org.joda.time.format.TestISODateTimeFormat_Fields)  Time elapsed: 0 sec  <<< ERROR!
java.lang.ArrayIndexOutOfBoundsException: -1
	at org.joda.time.Partial.getFieldType(Partial.java:369)
	at org.joda.time.base.AbstractPartial.indexOf(AbstractPartial.java:42)
	at org.joda.time.base.AbstractPartial.isSupported(AbstractPartial.java:39)
	at org.joda.time.format.DateTimeFormatterBuilder$PaddedNumber.printTo(DateTimeFormatterBuilder.java:1434)
	at org.joda.time.format.DateTimeFormatterBuilder$Composite.printTo(DateTimeFormatterBuilder.java:2446)
	at org.joda.time.format.DateTimeFormatter.printTo(DateTimeFormatter.java:609)
	at org.joda.time.format.DateTimeFormatter.print(DateTimeFormatter.java:663)
	at org.joda.time.format.TestISODateTimeFormat_Fields.testForFields_time_HMS(TestISODateTimeFormat_Fields.java:637)

testForFields_time_HM(org.joda.time.format.TestISODateTimeFormat_Fields)  Time elapsed: 0.001 sec  <<< ERROR!
java.lang.ArrayIndexOutOfBoundsException: -1
	at org.joda.time.Partial.getFieldType(Partial.java:369)
	at org.joda.time.base.AbstractPartial.indexOf(AbstractPartial.java:42)
	at org.joda.time.base.AbstractPartial.isSupported(AbstractPartial.java:39)
	at org.joda.time.format.DateTimeFormatterBuilder$PaddedNumber.printTo(DateTimeFormatterBuilder.java:1434)
	at org.joda.time.format.DateTimeFormatterBuilder$Composite.printTo(DateTimeFormatterBuilder.java:2446)
	at org.joda.time.format.DateTimeFormatter.printTo(DateTimeFormatter.java:609)
	at org.joda.time.format.DateTimeFormatter.print(DateTimeFormatter.java:663)
	at org.joda.time.format.TestISODateTimeFormat_Fields.testForFields_time_HM(TestISODateTimeFormat_Fields.java:665)

testForFields_time_MSm(org.joda.time.format.TestISODateTimeFormat_Fields)  Time elapsed: 0.001 sec  <<< ERROR!
java.lang.ArrayIndexOutOfBoundsException: -1
	at org.joda.time.Partial.getFieldType(Partial.java:369)
	at org.joda.time.base.AbstractPartial.indexOf(AbstractPartial.java:42)
	at org.joda.time.base.AbstractPartial.isSupported(AbstractPartial.java:39)
	at org.joda.time.format.DateTimeFormatterBuilder$PaddedNumber.printTo(DateTimeFormatterBuilder.java:1434)
	at org.joda.time.format.DateTimeFormatterBuilder$Composite.printTo(DateTimeFormatterBuilder.java:2446)
	at org.joda.time.format.DateTimeFormatter.printTo(DateTimeFormatter.java:609)
	at org.joda.time.format.DateTimeFormatter.print(DateTimeFormatter.java:663)
	at org.joda.time.format.TestISODateTimeFormat_Fields.testForFields_time_MSm(TestISODateTimeFormat_Fields.java:721)

testForFields_time_MS(org.joda.time.format.TestISODateTimeFormat_Fields)  Time elapsed: 0 sec  <<< ERROR!
java.lang.ArrayIndexOutOfBoundsException: -1
	at org.joda.time.Partial.getFieldType(Partial.java:369)
	at org.joda.time.base.AbstractPartial.indexOf(AbstractPartial.java:42)
	at org.joda.time.base.AbstractPartial.isSupported(AbstractPartial.java:39)
	at org.joda.time.format.DateTimeFormatterBuilder$PaddedNumber.printTo(DateTimeFormatterBuilder.java:1434)
	at org.joda.time.format.DateTimeFormatterBuilder$Composite.printTo(DateTimeFormatterBuilder.java:2446)
	at org.joda.time.format.DateTimeFormatter.printTo(DateTimeFormatter.java:609)
	at org.joda.time.format.DateTimeFormatter.print(DateTimeFormatter.java:663)
	at org.joda.time.format.TestISODateTimeFormat_Fields.testForFields_time_MS(TestISODateTimeFormat_Fields.java:749)

testForFields_time_Sm(org.joda.time.format.TestISODateTimeFormat_Fields)  Time elapsed: 0 sec  <<< ERROR!
java.lang.ArrayIndexOutOfBoundsException: -1
	at org.joda.time.Partial.getFieldType(Partial.java:369)
	at org.joda.time.base.AbstractPartial.indexOf(AbstractPartial.java:42)
	at org.joda.time.base.AbstractPartial.isSupported(AbstractPartial.java:39)
	at org.joda.time.format.DateTimeFormatterBuilder$PaddedNumber.printTo(DateTimeFormatterBuilder.java:1434)
	at org.joda.time.format.DateTimeFormatterBuilder$Composite.printTo(DateTimeFormatterBuilder.java:2446)
	at org.joda.time.format.DateTimeFormatter.printTo(DateTimeFormatter.java:609)
	at org.joda.time.format.DateTimeFormatter.print(DateTimeFormatter.java:663)
	at org.joda.time.format.TestISODateTimeFormat_Fields.testForFields_time_Sm(TestISODateTimeFormat_Fields.java:804)

testForFields_time_Hm(org.joda.time.format.TestISODateTimeFormat_Fields)  Time elapsed: 0.001 sec  <<< ERROR!
java.lang.ArrayIndexOutOfBoundsException: -1
	at org.joda.time.Partial.getFieldType(Partial.java:369)
	at org.joda.time.base.AbstractPartial.indexOf(AbstractPartial.java:42)
	at org.joda.time.base.AbstractPartial.isSupported(AbstractPartial.java:39)
	at org.joda.time.format.DateTimeFormatterBuilder$PaddedNumber.printTo(DateTimeFormatterBuilder.java:1434)
	at org.joda.time.format.DateTimeFormatterBuilder$Composite.printTo(DateTimeFormatterBuilder.java:2446)
	at org.joda.time.format.DateTimeFormatter.printTo(DateTimeFormatter.java:609)
	at org.joda.time.format.DateTimeFormatter.print(DateTimeFormatter.java:663)
	at org.joda.time.format.TestISODateTimeFormat_Fields.testForFields_time_Hm(TestISODateTimeFormat_Fields.java:888)

testForFields_time_HS(org.joda.time.format.TestISODateTimeFormat_Fields)  Time elapsed: 0 sec  <<< ERROR!
java.lang.ArrayIndexOutOfBoundsException: -1
	at org.joda.time.Partial.getFieldType(Partial.java:369)
	at org.joda.time.base.AbstractPartial.indexOf(AbstractPartial.java:42)
	at org.joda.time.base.AbstractPartial.isSupported(AbstractPartial.java:39)
	at org.joda.time.format.DateTimeFormatterBuilder$PaddedNumber.printTo(DateTimeFormatterBuilder.java:1434)
	at org.joda.time.format.DateTimeFormatterBuilder$Composite.printTo(DateTimeFormatterBuilder.java:2446)
	at org.joda.time.format.DateTimeFormatter.printTo(DateTimeFormatter.java:609)
	at org.joda.time.format.DateTimeFormatter.print(DateTimeFormatter.java:663)
	at org.joda.time.format.TestISODateTimeFormat_Fields.testForFields_time_HS(TestISODateTimeFormat_Fields.java:918)

testForFields_time_Mm(org.joda.time.format.TestISODateTimeFormat_Fields)  Time elapsed: 0.001 sec  <<< ERROR!
java.lang.ArrayIndexOutOfBoundsException: -1
	at org.joda.time.Partial.getFieldType(Partial.java:369)
	at org.joda.time.base.AbstractPartial.indexOf(AbstractPartial.java:42)
	at org.joda.time.base.AbstractPartial.isSupported(AbstractPartial.java:39)
	at org.joda.time.format.DateTimeFormatterBuilder$PaddedNumber.printTo(DateTimeFormatterBuilder.java:1434)
	at org.joda.time.format.DateTimeFormatterBuilder$Composite.printTo(DateTimeFormatterBuilder.java:2446)
	at org.joda.time.format.DateTimeFormatter.printTo(DateTimeFormatter.java:609)
	at org.joda.time.format.DateTimeFormatter.print(DateTimeFormatter.java:663)
	at org.joda.time.format.TestISODateTimeFormat_Fields.testForFields_time_Mm(TestISODateTimeFormat_Fields.java:948)

testForFields_time_HSm(org.joda.time.format.TestISODateTimeFormat_Fields)  Time elapsed: 0 sec  <<< ERROR!
java.lang.ArrayIndexOutOfBoundsException: -1
	at org.joda.time.Partial.getFieldType(Partial.java:369)
	at org.joda.time.base.AbstractPartial.indexOf(AbstractPartial.java:42)
	at org.joda.time.base.AbstractPartial.isSupported(AbstractPartial.java:39)
	at org.joda.time.format.DateTimeFormatterBuilder$PaddedNumber.printTo(DateTimeFormatterBuilder.java:1434)
	at org.joda.time.format.DateTimeFormatterBuilder$Composite.printTo(DateTimeFormatterBuilder.java:2446)
	at org.joda.time.format.DateTimeFormatter.printTo(DateTimeFormatter.java:609)
	at org.joda.time.format.DateTimeFormatter.print(DateTimeFormatter.java:663)
	at org.joda.time.format.TestISODateTimeFormat_Fields.testForFields_time_HSm(TestISODateTimeFormat_Fields.java:979)

testForFields_time_HMm(org.joda.time.format.TestISODateTimeFormat_Fields)  Time elapsed: 0.001 sec  <<< ERROR!
java.lang.ArrayIndexOutOfBoundsException: -1
	at org.joda.time.Partial.getFieldType(Partial.java:369)
	at org.joda.time.base.AbstractPartial.indexOf(AbstractPartial.java:42)
	at org.joda.time.base.AbstractPartial.isSupported(AbstractPartial.java:39)
	at org.joda.time.format.DateTimeFormatterBuilder$PaddedNumber.printTo(DateTimeFormatterBuilder.java:1434)
	at org.joda.time.format.DateTimeFormatterBuilder$Composite.printTo(DateTimeFormatterBuilder.java:2446)
	at org.joda.time.format.DateTimeFormatter.printTo(DateTimeFormatter.java:609)
	at org.joda.time.format.DateTimeFormatter.print(DateTimeFormatter.java:663)
	at org.joda.time.format.TestISODateTimeFormat_Fields.testForFields_time_HMm(TestISODateTimeFormat_Fields.java:1010)

testForFields_datetime_YMDH(org.joda.time.format.TestISODateTimeFormat_Fields)  Time elapsed: 0 sec  <<< ERROR!
java.lang.ArrayIndexOutOfBoundsException: -1
	at org.joda.time.Partial.getFieldType(Partial.java:369)
	at org.joda.time.base.AbstractPartial.indexOf(AbstractPartial.java:42)
	at org.joda.time.base.AbstractPartial.isSupported(AbstractPartial.java:39)
	at org.joda.time.format.DateTimeFormatterBuilder$PaddedNumber.printTo(DateTimeFormatterBuilder.java:1434)
	at org.joda.time.format.DateTimeFormatterBuilder$Composite.printTo(DateTimeFormatterBuilder.java:2446)
	at org.joda.time.format.DateTimeFormatter.printTo(DateTimeFormatter.java:609)
	at org.joda.time.format.DateTimeFormatter.print(DateTimeFormatter.java:663)
	at org.joda.time.format.TestISODateTimeFormat_Fields.testForFields_datetime_YMDH(TestISODateTimeFormat_Fields.java:1044)

testForFields_datetime_DH(org.joda.time.format.TestISODateTimeFormat_Fields)  Time elapsed: 0.001 sec  <<< ERROR!
java.lang.ArrayIndexOutOfBoundsException: -1
	at org.joda.time.Partial.getFieldType(Partial.java:369)
	at org.joda.time.base.AbstractPartial.indexOf(AbstractPartial.java:42)
	at org.joda.time.base.AbstractPartial.isSupported(AbstractPartial.java:39)
	at org.joda.time.format.DateTimeFormatterBuilder$PaddedNumber.printTo(DateTimeFormatterBuilder.java:1434)
	at org.joda.time.format.DateTimeFormatterBuilder$Composite.printTo(DateTimeFormatterBuilder.java:2446)
	at org.joda.time.format.DateTimeFormatter.printTo(DateTimeFormatter.java:609)
	at org.joda.time.format.DateTimeFormatter.print(DateTimeFormatter.java:663)
	at org.joda.time.format.TestISODateTimeFormat_Fields.testForFields_datetime_DH(TestISODateTimeFormat_Fields.java:1072)

testForFields_datetime_YH(org.joda.time.format.TestISODateTimeFormat_Fields)  Time elapsed: 0.001 sec  <<< ERROR!
java.lang.ArrayIndexOutOfBoundsException: -1
	at org.joda.time.Partial.getFieldType(Partial.java:369)
	at org.joda.time.base.AbstractPartial.indexOf(AbstractPartial.java:42)
	at org.joda.time.base.AbstractPartial.isSupported(AbstractPartial.java:39)
	at org.joda.time.format.DateTimeFormatterBuilder$PaddedNumber.printTo(DateTimeFormatterBuilder.java:1434)
	at org.joda.time.format.DateTimeFormatterBuilder$Composite.printTo(DateTimeFormatterBuilder.java:2446)
	at org.joda.time.format.DateTimeFormatter.printTo(DateTimeFormatter.java:609)
	at org.joda.time.format.DateTimeFormatter.print(DateTimeFormatter.java:663)
	at org.joda.time.format.TestISODateTimeFormat_Fields.testForFields_datetime_YH(TestISODateTimeFormat_Fields.java:1100)

testForFields_datetime_DM(org.joda.time.format.TestISODateTimeFormat_Fields)  Time elapsed: 0 sec  <<< ERROR!
java.lang.ArrayIndexOutOfBoundsException: -1
	at org.joda.time.Partial.getFieldType(Partial.java:369)
	at org.joda.time.base.AbstractPartial.indexOf(AbstractPartial.java:42)
	at org.joda.time.base.AbstractPartial.isSupported(AbstractPartial.java:39)
	at org.joda.time.format.DateTimeFormatterBuilder$PaddedNumber.printTo(DateTimeFormatterBuilder.java:1434)
	at org.joda.time.format.DateTimeFormatterBuilder$Composite.printTo(DateTimeFormatterBuilder.java:2446)
	at org.joda.time.format.DateTimeFormatter.printTo(DateTimeFormatter.java:609)
	at org.joda.time.format.DateTimeFormatter.print(DateTimeFormatter.java:663)
	at org.joda.time.format.TestISODateTimeFormat_Fields.testForFields_datetime_DM(TestISODateTimeFormat_Fields.java:1130)


Results :

Tests in error: 
  org.joda.time.TestDateTimeUtils#testIsContiguous_RP ArrayIndexOutOfBoundsException
  org.joda.time.TestDateTimeUtils#testIsContiguous_RP_GJChronology ArrayIndexOutOfBoundsException
  org.joda.time.TestLocalDateTime_Basics#testCompareTo ArrayIndexOutOfBoundsException
  org.joda.time.TestLocalDate_Basics#testCompareTo ArrayIndexOutOfBoundsException
  org.joda.time.TestLocalDate_Constructors#testConstructor_ObjectYearMonthDay ArrayIndexOutOfBoundsException
  org.joda.time.TestLocalTime_Constructors#testConstructor_ObjectTimeOfDay ArrayIndexOutOfBoundsException
  org.joda.time.TestMonthDay_Basics#testCompareTo ArrayIndexOutOfBoundsException
  org.joda.time.TestMonthDay_Basics#testGet ArrayIndexOutOfBoundsException -1
  org.joda.time.TestMonthDay_Basics#testIsSupported ArrayIndexOutOfBoundsException
  org.joda.time.TestMonthDay_Basics#testProperty ArrayIndexOutOfBoundsException ...
  org.joda.time.TestMonthDay_Basics#testToString ArrayIndexOutOfBoundsException ...
  org.joda.time.TestMonthDay_Basics#testToString_DTFormatter ArrayIndexOutOfBoundsException
  org.joda.time.TestMonthDay_Basics#testToString_String ArrayIndexOutOfBoundsException
  org.joda.time.TestMonthDay_Basics#testToString_String_Locale ArrayIndexOutOfBoundsException
  org.joda.time.TestMonthDay_Basics#testWithField_nullField ArrayIndexOutOfBoundsException
  org.joda.time.TestMonthDay_Basics#testWithField_unknownField ArrayIndexOutOfBoundsException
  org.joda.time.TestMonthDay_Properties#testPropertyAddWrapFieldDayOfMonth ArrayIndexOutOfBoundsException
  org.joda.time.TestMonthDay_Properties#testPropertyCompareToDayOfMonth ArrayIndexOutOfBoundsException
  org.joda.time.TestMonthDay_Properties#testPropertyGetMaxMinValuesDayOfMonth ArrayIndexOutOfBoundsException
  org.joda.time.TestPartial_Basics#testGet ArrayIndexOutOfBoundsException -1
  org.joda.time.TestPartial_Basics#testGetFormatter1 ArrayIndexOutOfBoundsException
  org.joda.time.TestPartial_Basics#testGetFormatter2 ArrayIndexOutOfBoundsException
  org.joda.time.TestPartial_Basics#testGetFormatter3 ArrayIndexOutOfBoundsException
  org.joda.time.TestPartial_Basics#testIsSupported ArrayIndexOutOfBoundsException
  org.joda.time.TestPartial_Basics#testMinus_RP ArrayIndexOutOfBoundsException -...
  org.joda.time.TestPartial_Basics#testPlus_RP ArrayIndexOutOfBoundsException -1
  org.joda.time.TestPartial_Basics#testProperty ArrayIndexOutOfBoundsException -...
  org.joda.time.TestPartial_Basics#testToDateTime_RI ArrayIndexOutOfBoundsException
  org.joda.time.TestPartial_Basics#testToDateTime_nullRI ArrayIndexOutOfBoundsException
  org.joda.time.TestPartial_Basics#testToString1 ArrayIndexOutOfBoundsException ...
  org.joda.time.TestPartial_Basics#testToString3 ArrayIndexOutOfBoundsException ...
  org.joda.time.TestPartial_Basics#testToString4 ArrayIndexOutOfBoundsException ...
  org.joda.time.TestPartial_Basics#testToString5 ArrayIndexOutOfBoundsException ...
  org.joda.time.TestPartial_Basics#testToString_DTFormatter ArrayIndexOutOfBoundsException
  org.joda.time.TestPartial_Basics#testToString_String ArrayIndexOutOfBoundsException
  org.joda.time.TestPartial_Basics#testToString_String_Locale ArrayIndexOutOfBoundsException
  org.joda.time.TestPartial_Basics#testWith1 ArrayIndexOutOfBoundsException -1
  org.joda.time.TestPartial_Basics#testWith2 ArrayIndexOutOfBoundsException -1
  org.joda.time.TestPartial_Basics#testWith3 ArrayIndexOutOfBoundsException -1
  org.joda.time.TestPartial_Basics#testWith3a ArrayIndexOutOfBoundsException -1
  org.joda.time.TestPartial_Basics#testWith3b ArrayIndexOutOfBoundsException -1
  org.joda.time.TestPartial_Basics#testWith3c ArrayIndexOutOfBoundsException -1
  org.joda.time.TestPartial_Basics#testWith3d ArrayIndexOutOfBoundsException -1
  org.joda.time.TestPartial_Basics#testWith3e ArrayIndexOutOfBoundsException -1
  org.joda.time.TestPartial_Basics#testWith3f ArrayIndexOutOfBoundsException -1
  org.joda.time.TestPartial_Basics#testWithChronologyRetainFields_Chrono ArrayIndexOutOfBoundsException
  org.joda.time.TestPartial_Basics#testWithChronologyRetainFields_nullChrono ArrayIndexOutOfBoundsException
  org.joda.time.TestPartial_Basics#testWithField1 ArrayIndexOutOfBoundsException
  org.joda.time.TestPartial_Basics#testWithField2 ArrayIndexOutOfBoundsException
  org.joda.time.TestPartial_Basics#testWithField3 ArrayIndexOutOfBoundsException
  org.joda.time.TestPartial_Basics#testWithFieldAddWrapped1 ArrayIndexOutOfBoundsException
  org.joda.time.TestPartial_Basics#testWithFieldAddWrapped2 ArrayIndexOutOfBoundsException
  org.joda.time.TestPartial_Basics#testWithFieldAddWrapped3 ArrayIndexOutOfBoundsException
  org.joda.time.TestPartial_Basics#testWithFieldAddWrapped5 ArrayIndexOutOfBoundsException
  org.joda.time.TestPartial_Basics#testWithFieldAddWrapped6 ArrayIndexOutOfBoundsException
  org.joda.time.TestPartial_Basics#testWithFieldAddWrapped7 ArrayIndexOutOfBoundsException
  org.joda.time.TestPartial_Basics#testWithFieldAddWrapped8 ArrayIndexOutOfBoundsException
  org.joda.time.TestPartial_Basics#testWithFieldAdded1 ArrayIndexOutOfBoundsException
  org.joda.time.TestPartial_Basics#testWithFieldAdded2 ArrayIndexOutOfBoundsException
  org.joda.time.TestPartial_Basics#testWithFieldAdded3 ArrayIndexOutOfBoundsException
  org.joda.time.TestPartial_Basics#testWithFieldAdded5 ArrayIndexOutOfBoundsException
  org.joda.time.TestPartial_Basics#testWithFieldAdded6 ArrayIndexOutOfBoundsException
  org.joda.time.TestPartial_Basics#testWithFieldAdded7 ArrayIndexOutOfBoundsException
  org.joda.time.TestPartial_Basics#testWithFieldAdded8 ArrayIndexOutOfBoundsException
  org.joda.time.TestPartial_Basics#testWith_argHasNoRange ArrayIndexOutOfBoundsException
  org.joda.time.TestPartial_Basics#testWith_baseAndArgHaveNoRange ArrayIndexOutOfBoundsException
  org.joda.time.TestPartial_Basics#testWith_baseHasNoRange ArrayIndexOutOfBoundsException
  org.joda.time.TestPartial_Basics#testWithout1 ArrayIndexOutOfBoundsException -...
  org.joda.time.TestPartial_Basics#testWithout2 ArrayIndexOutOfBoundsException -...
  org.joda.time.TestPartial_Basics#testWithout3 ArrayIndexOutOfBoundsException -...
  org.joda.time.TestPartial_Basics#testWithout4 ArrayIndexOutOfBoundsException -...
  org.joda.time.TestPartial_Constructors#testConstructor_Partial ArrayIndexOutOfBoundsException
  org.joda.time.TestPartial_Constructors#testConstructor_TypeArray_intArray ArrayIndexOutOfBoundsException
  org.joda.time.TestPartial_Constructors#testConstructor_TypeArray_intArray_Chrono ArrayIndexOutOfBoundsException
  org.joda.time.TestPartial_Constructors#testConstructor_TypeArray_intArray_year_weekyear ArrayIndexOutOfBoundsException
  org.joda.time.TestPartial_Properties#testPropertyAddHour ArrayIndexOutOfBoundsException
  org.joda.time.TestPartial_Properties#testPropertyAddMinute ArrayIndexOutOfBoundsException
  org.joda.time.TestPartial_Properties#testPropertyAddWrapFieldHour ArrayIndexOutOfBoundsException
  org.joda.time.TestPartial_Properties#testPropertyAddWrapFieldMinute ArrayIndexOutOfBoundsException
  org.joda.time.TestPartial_Properties#testPropertyCompareToMinute ArrayIndexOutOfBoundsException
  org.joda.time.TestPartial_Properties#testPropertyGetMaxMinValuesMinute ArrayIndexOutOfBoundsException
  org.joda.time.TestPartial_Properties#testPropertyGetMinute ArrayIndexOutOfBoundsException
  org.joda.time.TestPartial_Properties#testPropertySetHour ArrayIndexOutOfBoundsException
  org.joda.time.TestPartial_Properties#testPropertySetMinute ArrayIndexOutOfBoundsException
  org.joda.time.TestPartial_Properties#testPropertySetTextHour ArrayIndexOutOfBoundsException
  org.joda.time.TestPartial_Properties#testPropertySetTextMinute ArrayIndexOutOfBoundsException
  org.joda.time.TestPartial_Properties#testPropertyWithMaximumValueHour ArrayIndexOutOfBoundsException
  org.joda.time.TestPartial_Properties#testPropertyWithMinimumValueHour ArrayIndexOutOfBoundsException
  org.joda.time.TestPeriod_Constructors#testConstructor_RP_RP7 ArrayIndexOutOfBoundsException
  org.joda.time.TestPeriod_Constructors#testConstructor_RP_RP8 ArrayIndexOutOfBoundsException
  org.joda.time.TestPeriod_Constructors#testConstructor_RP_RP_PeriodType7 ArrayIndexOutOfBoundsException
  org.joda.time.TestPeriod_Constructors#testConstructor_RP_RP_PeriodType8 ArrayIndexOutOfBoundsException
  org.joda.time.TestStringConvert#testMonthDay ArrayIndexOutOfBoundsException -1
  org.joda.time.TestStringConvert#testMonthDay_leapDay ArrayIndexOutOfBoundsException
  org.joda.time.TestStringConvert#testYearMonth ArrayIndexOutOfBoundsException -...
  org.joda.time.TestTimeOfDay_Basics#testGet ArrayIndexOutOfBoundsException -1
  org.joda.time.TestTimeOfDay_Basics#testIsSupported ArrayIndexOutOfBoundsException
  org.joda.time.TestTimeOfDay_Basics#testProperty ArrayIndexOutOfBoundsException
  org.joda.time.TestTimeOfDay_Basics#testToString ArrayIndexOutOfBoundsException
  org.joda.time.TestTimeOfDay_Basics#testToString_DTFormatter ArrayIndexOutOfBoundsException
  org.joda.time.TestTimeOfDay_Basics#testToString_String ArrayIndexOutOfBoundsException
  org.joda.time.TestTimeOfDay_Basics#testToString_String_Locale ArrayIndexOutOfBoundsException
  org.joda.time.TestTimeOfDay_Basics#testWithField2 ArrayIndexOutOfBoundsException
  org.joda.time.TestTimeOfDay_Basics#testWithField3 ArrayIndexOutOfBoundsException
  org.joda.time.TestTimeOfDay_Constructors#testConstructor_todObject ArrayIndexOutOfBoundsException
  org.joda.time.TestTimeOfDay_Properties#testPropertyCompareToMilli ArrayIndexOutOfBoundsException
  org.joda.time.TestTimeOfDay_Properties#testPropertyCompareToMinute ArrayIndexOutOfBoundsException
  org.joda.time.TestTimeOfDay_Properties#testPropertyCompareToSecond ArrayIndexOutOfBoundsException
  org.joda.time.TestYearMonthDay_Basics#testCompareTo ArrayIndexOutOfBoundsException
  org.joda.time.TestYearMonthDay_Basics#testGet ArrayIndexOutOfBoundsException -...
  org.joda.time.TestYearMonthDay_Basics#testIsSupported ArrayIndexOutOfBoundsException
  org.joda.time.TestYearMonthDay_Basics#testProperty ArrayIndexOutOfBoundsException
  org.joda.time.TestYearMonthDay_Basics#testToString ArrayIndexOutOfBoundsException
  org.joda.time.TestYearMonthDay_Basics#testToString_DTFormatter ArrayIndexOutOfBoundsException
  org.joda.time.TestYearMonthDay_Basics#testToString_String ArrayIndexOutOfBoundsException
  org.joda.time.TestYearMonthDay_Basics#testToString_String_Locale ArrayIndexOutOfBoundsException
  org.joda.time.TestYearMonthDay_Basics#testWithField2 ArrayIndexOutOfBoundsException
  org.joda.time.TestYearMonthDay_Basics#testWithField3 ArrayIndexOutOfBoundsException
  org.joda.time.TestYearMonthDay_Properties#testPropertyAddWrapFieldDay ArrayIndexOutOfBoundsException
  org.joda.time.TestYearMonthDay_Properties#testPropertyCompareToDay ArrayIndexOutOfBoundsException
  org.joda.time.TestYearMonthDay_Properties#testPropertyCompareToMonth ArrayIndexOutOfBoundsException
  org.joda.time.TestYearMonthDay_Properties#testPropertyGetMaxMinValuesDay ArrayIndexOutOfBoundsException
  org.joda.time.TestYearMonthDay_Properties#testPropertyWithMaximumValueDayOfMonth ArrayIndexOutOfBoundsException
  org.joda.time.TestYearMonth_Basics#testCompareTo ArrayIndexOutOfBoundsException
  org.joda.time.TestYearMonth_Basics#testGet ArrayIndexOutOfBoundsException -1
  org.joda.time.TestYearMonth_Basics#testIsSupported ArrayIndexOutOfBoundsException
  org.joda.time.TestYearMonth_Basics#testProperty ArrayIndexOutOfBoundsException
  org.joda.time.TestYearMonth_Basics#testToString ArrayIndexOutOfBoundsException
  org.joda.time.TestYearMonth_Basics#testToString_DTFormatter ArrayIndexOutOfBoundsException
  org.joda.time.TestYearMonth_Basics#testToString_String ArrayIndexOutOfBoundsException
  org.joda.time.TestYearMonth_Basics#testToString_String_Locale ArrayIndexOutOfBoundsException
  org.joda.time.TestYearMonth_Basics#testWithField_nullField ArrayIndexOutOfBoundsException
  org.joda.time.TestYearMonth_Basics#testWithField_unknownField ArrayIndexOutOfBoundsException
  org.joda.time.TestYearMonth_Properties#testPropertyCompareToMonth ArrayIndexOutOfBoundsException
  org.joda.time.chrono.TestGregorianChronology#testMaximumValue ArrayIndexOutOfBoundsException
  org.joda.time.chrono.TestISOChronology#testMaximumValue ArrayIndexOutOfBoundsException
  org.joda.time.chrono.TestISOChronology#testPartialDayOfYearAdd ArrayIndexOutOfBoundsException
  org.joda.time.convert.TestReadablePartialConverter#testGetPartialValues ArrayIndexOutOfBoundsException
  org.joda.time.field.TestBaseDateTimeField#test_getAsShortText_RP_Locale ArrayIndexOutOfBoundsException
  org.joda.time.field.TestBaseDateTimeField#test_getAsText_RP_Locale ArrayIndexOutOfBoundsException
  org.joda.time.field.TestOffsetDateTimeField#test_getAsShortText_RP_Locale ArrayIndexOutOfBoundsException
  org.joda.time.field.TestOffsetDateTimeField#test_getAsText_RP_Locale ArrayIndexOutOfBoundsException
  org.joda.time.field.TestPreciseDateTimeField#test_getAsShortText_RP_Locale ArrayIndexOutOfBoundsException
  org.joda.time.field.TestPreciseDateTimeField#test_getAsText_RP_Locale ArrayIndexOutOfBoundsException
  org.joda.time.field.TestPreciseDurationDateTimeField#test_getAsShortText_RP_Locale ArrayIndexOutOfBoundsException
  org.joda.time.field.TestPreciseDurationDateTimeField#test_getAsText_RP_Locale ArrayIndexOutOfBoundsException
  org.joda.time.format.TestDateTimeFormatter#testPrint_bufferMethods ArrayIndexOutOfBoundsException
  org.joda.time.format.TestDateTimeFormatter#testPrint_writerMethods ArrayIndexOutOfBoundsException
  org.joda.time.format.TestISODateTimeFormat#testFormat_date_partial ArrayIndexOutOfBoundsException
  org.joda.time.format.TestISODateTimeFormat#testFormat_timeNoMillis_partial ArrayIndexOutOfBoundsException
  org.joda.time.format.TestISODateTimeFormat#testFormat_time_partial ArrayIndexOutOfBoundsException
  org.joda.time.format.TestISODateTimeFormat_Fields#testForFields_calBased_MD ArrayIndexOutOfBoundsException
  org.joda.time.format.TestISODateTimeFormat_Fields#testForFields_calBased_YD ArrayIndexOutOfBoundsException
  org.joda.time.format.TestISODateTimeFormat_Fields#testForFields_calBased_YM ArrayIndexOutOfBoundsException
  org.joda.time.format.TestISODateTimeFormat_Fields#testForFields_calBased_YMD ArrayIndexOutOfBoundsException
  org.joda.time.format.TestISODateTimeFormat_Fields#testForFields_calBased_YMD_duplicates ArrayIndexOutOfBoundsException
  org.joda.time.format.TestISODateTimeFormat_Fields#testForFields_calBased_YMD_unmodifiable ArrayIndexOutOfBoundsException
  org.joda.time.format.TestISODateTimeFormat_Fields#testForFields_datetime_DH ArrayIndexOutOfBoundsException
  org.joda.time.format.TestISODateTimeFormat_Fields#testForFields_datetime_DM ArrayIndexOutOfBoundsException
  org.joda.time.format.TestISODateTimeFormat_Fields#testForFields_datetime_YH ArrayIndexOutOfBoundsException
  org.joda.time.format.TestISODateTimeFormat_Fields#testForFields_datetime_YMDH ArrayIndexOutOfBoundsException
  org.joda.time.format.TestISODateTimeFormat_Fields#testForFields_ordinalBased_YD ArrayIndexOutOfBoundsException
  org.joda.time.format.TestISODateTimeFormat_Fields#testForFields_time_HM ArrayIndexOutOfBoundsException
  org.joda.time.format.TestISODateTimeFormat_Fields#testForFields_time_HMS ArrayIndexOutOfBoundsException
  org.joda.time.format.TestISODateTimeFormat_Fields#testForFields_time_HMSm ArrayIndexOutOfBoundsException
  org.joda.time.format.TestISODateTimeFormat_Fields#testForFields_time_HMm ArrayIndexOutOfBoundsException
  org.joda.time.format.TestISODateTimeFormat_Fields#testForFields_time_HS ArrayIndexOutOfBoundsException
  org.joda.time.format.TestISODateTimeFormat_Fields#testForFields_time_HSm ArrayIndexOutOfBoundsException
  org.joda.time.format.TestISODateTimeFormat_Fields#testForFields_time_Hm ArrayIndexOutOfBoundsException
  org.joda.time.format.TestISODateTimeFormat_Fields#testForFields_time_MS ArrayIndexOutOfBoundsException
  org.joda.time.format.TestISODateTimeFormat_Fields#testForFields_time_MSm ArrayIndexOutOfBoundsException
  org.joda.time.format.TestISODateTimeFormat_Fields#testForFields_time_Mm ArrayIndexOutOfBoundsException
  org.joda.time.format.TestISODateTimeFormat_Fields#testForFields_time_Sm ArrayIndexOutOfBoundsException
  org.joda.time.format.TestISODateTimeFormat_Fields#testForFields_weekBased_WD ArrayIndexOutOfBoundsException
  org.joda.time.format.TestISODateTimeFormat_Fields#testForFields_weekBased_YD ArrayIndexOutOfBoundsException
  org.joda.time.format.TestISODateTimeFormat_Fields#testForFields_weekBased_YW ArrayIndexOutOfBoundsException
  org.joda.time.format.TestISODateTimeFormat_Fields#testForFields_weekBased_YWD ArrayIndexOutOfBoundsException

Tests run: 4157, Failures: 0, Errors: 177, Skipped: 0

[INFO] ------------------------------------------------------------------------
[INFO] BUILD FAILURE
[INFO] ------------------------------------------------------------------------
[INFO] Total time: 15.276s
[INFO] Finished at: Wed Aug 05 20:41:22 BST 2015
[INFO] Final Memory: 9M/213M
[INFO] ------------------------------------------------------------------------
[ERROR] Failed to execute goal org.apache.maven.plugins:maven-surefire-plugin:2.18.1:test (default-test) on project joda-time: There are test failures.
[ERROR] 
[ERROR] Please refer to /home/perham/Study/LittleDarwin/Cases/joda-time-2.8.1/target/surefire-reports for the individual test results.
[ERROR] -> [Help 1]
[ERROR] 
[ERROR] To see the full stack trace of the errors, re-run Maven with the -e switch.
[ERROR] Re-run Maven using the -X switch to enable full debug logging.
[ERROR] 
[ERROR] For more information about the errors and possible solutions, please read the following articles:
[ERROR] [Help 1] http://cwiki.apache.org/confluence/display/MAVEN/MojoFailureException
