[INFO] Scanning for projects...
[INFO]                                                                         
[INFO] ------------------------------------------------------------------------
[INFO] Building Joda-Time 2.8.1
[INFO] ------------------------------------------------------------------------
[INFO] 
[INFO] --- maven-resources-plugin:2.7:resources (default-resources) @ joda-time ---
[INFO] Using 'UTF-8' encoding to copy filtered resources.
[INFO] Copying 2 resources to META-INF
[INFO] Copying 10 resources
[INFO] 
[INFO] --- maven-compiler-plugin:3.3:compile (default-compile) @ joda-time ---
[INFO] Changes detected - recompiling the module!
[INFO] Compiling 166 source files to /home/perham/Study/LittleDarwin/Cases/joda-time-2.8.1/target/classes
[INFO] 
[INFO] --- exec-maven-plugin:1.4.0:java (compile-tzdb) @ joda-time ---
Writing zoneinfo files
Writing ZoneInfoMap
[INFO] 
[INFO] --- maven-resources-plugin:2.7:testResources (default-testResources) @ joda-time ---
[INFO] Using 'UTF-8' encoding to copy filtered resources.
[INFO] Copying 34 resources
[INFO] 
[INFO] --- maven-compiler-plugin:3.3:testCompile (default-testCompile) @ joda-time ---
[INFO] Nothing to compile - all classes are up to date
[INFO] 
[INFO] --- maven-surefire-plugin:2.18.1:test (default-test) @ joda-time ---
[INFO] Surefire report directory: /home/perham/Study/LittleDarwin/Cases/joda-time-2.8.1/target/surefire-reports

-------------------------------------------------------
 T E S T S
-------------------------------------------------------
Running org.joda.time.TestAllPackages

TestBuddhistChronology.testCalendar

TestCopticChronology.testCalendar

TestEthiopicChronology.testCalendar

TestIslamicChronology.testCalendar

Testing Gregorian chronology over 1000 iterations
100% complete (i=1000)

Testing Julian chronology over 1000 iterations
100% complete (i=1000)
Writing zoneinfo files
Writing ZoneInfoMap
Tests run: 4157, Failures: 6, Errors: 2, Skipped: 0, Time elapsed: 5.574 sec <<< FAILURE! - in org.joda.time.TestAllPackages
testOverlaps_RInterval(org.joda.time.TestInterval_Basics)  Time elapsed: 0.004 sec  <<< FAILURE!
junit.framework.AssertionFailedError: expected:<false> but was:<true>
	at junit.framework.Assert.fail(Assert.java:47)
	at junit.framework.Assert.failNotEquals(Assert.java:280)
	at junit.framework.Assert.assertEquals(Assert.java:64)
	at junit.framework.Assert.assertEquals(Assert.java:146)
	at junit.framework.Assert.assertEquals(Assert.java:152)
	at org.joda.time.TestInterval_Basics.testOverlaps_RInterval(TestInterval_Basics.java:570)

testOverlaps_RInterval_zeroDuration(org.joda.time.TestInterval_Basics)  Time elapsed: 0.001 sec  <<< FAILURE!
junit.framework.AssertionFailedError: expected:<false> but was:<true>
	at junit.framework.Assert.fail(Assert.java:47)
	at junit.framework.Assert.failNotEquals(Assert.java:280)
	at junit.framework.Assert.assertEquals(Assert.java:64)
	at junit.framework.Assert.assertEquals(Assert.java:146)
	at junit.framework.Assert.assertEquals(Assert.java:152)
	at org.joda.time.TestInterval_Basics.testOverlaps_RInterval_zeroDuration(TestInterval_Basics.java:625)

testOverlap_RInterval(org.joda.time.TestInterval_Basics)  Time elapsed: 0.001 sec  <<< ERROR!
java.lang.IllegalArgumentException: The end instant must be greater or equal to the start
	at org.joda.time.base.AbstractInterval.checkInterval(AbstractInterval.java:22)
	at org.joda.time.base.BaseInterval.<init>(BaseInterval.java:73)
	at org.joda.time.Interval.<init>(Interval.java:109)
	at org.joda.time.Interval.overlap(Interval.java:257)
	at org.joda.time.TestInterval_Basics.testOverlap_RInterval(TestInterval_Basics.java:634)

testOverlap_RInterval_null(org.joda.time.TestInterval_Basics)  Time elapsed: 0.001 sec  <<< ERROR!
java.lang.IllegalArgumentException: The end instant must be greater or equal to the start
	at org.joda.time.base.AbstractInterval.checkInterval(AbstractInterval.java:22)
	at org.joda.time.base.BaseInterval.<init>(BaseInterval.java:73)
	at org.joda.time.Interval.<init>(Interval.java:109)
	at org.joda.time.Interval.overlap(Interval.java:257)
	at org.joda.time.TestInterval_Basics.testOverlap_RInterval_null(TestInterval_Basics.java:662)

test_useCase_ContainsOverlapAbutGap(org.joda.time.TestInterval_Basics)  Time elapsed: 0.001 sec  <<< FAILURE!
junit.framework.AssertionFailedError: expected:<false> but was:<true>
	at junit.framework.Assert.fail(Assert.java:47)
	at junit.framework.Assert.failNotEquals(Assert.java:280)
	at junit.framework.Assert.assertEquals(Assert.java:64)
	at junit.framework.Assert.assertEquals(Assert.java:146)
	at junit.framework.Assert.assertEquals(Assert.java:152)
	at org.joda.time.TestInterval_Basics.test_useCase_ContainsOverlapAbutGap(TestInterval_Basics.java:246)

test_useCase_ContainsOverlapAbutGap_zeroDuration(org.joda.time.TestInterval_Basics)  Time elapsed: 0 sec  <<< FAILURE!
junit.framework.AssertionFailedError: expected:<false> but was:<true>
	at junit.framework.Assert.fail(Assert.java:47)
	at junit.framework.Assert.failNotEquals(Assert.java:280)
	at junit.framework.Assert.assertEquals(Assert.java:64)
	at junit.framework.Assert.assertEquals(Assert.java:146)
	at junit.framework.Assert.assertEquals(Assert.java:152)
	at org.joda.time.TestInterval_Basics.test_useCase_ContainsOverlapAbutGap_zeroDuration(TestInterval_Basics.java:350)

test_useCase_ContainsOverlapAbutGap_bothZeroDuration(org.joda.time.TestInterval_Basics)  Time elapsed: 0 sec  <<< FAILURE!
junit.framework.AssertionFailedError: expected:<false> but was:<true>
	at junit.framework.Assert.fail(Assert.java:47)
	at junit.framework.Assert.failNotEquals(Assert.java:280)
	at junit.framework.Assert.assertEquals(Assert.java:64)
	at junit.framework.Assert.assertEquals(Assert.java:146)
	at junit.framework.Assert.assertEquals(Assert.java:152)
	at org.joda.time.TestInterval_Basics.test_useCase_ContainsOverlapAbutGap_bothZeroDuration(TestInterval_Basics.java:414)

testOverlaps_RInterval(org.joda.time.TestMutableInterval_Basics)  Time elapsed: 0.001 sec  <<< FAILURE!
junit.framework.AssertionFailedError: expected:<false> but was:<true>
	at junit.framework.Assert.fail(Assert.java:47)
	at junit.framework.Assert.failNotEquals(Assert.java:280)
	at junit.framework.Assert.assertEquals(Assert.java:64)
	at junit.framework.Assert.assertEquals(Assert.java:146)
	at junit.framework.Assert.assertEquals(Assert.java:152)
	at org.joda.time.TestMutableInterval_Basics.testOverlaps_RInterval(TestMutableInterval_Basics.java:266)


Results :

Failed tests: 
  org.joda.time.TestInterval_Basics#testOverlaps_RInterval AssertionFailedError ...
  org.joda.time.TestInterval_Basics#testOverlaps_RInterval_zeroDuration AssertionFailedError
  org.joda.time.TestInterval_Basics#test_useCase_ContainsOverlapAbutGap AssertionFailedError
  org.joda.time.TestInterval_Basics#test_useCase_ContainsOverlapAbutGap_bothZeroDuration AssertionFailedError
  org.joda.time.TestInterval_Basics#test_useCase_ContainsOverlapAbutGap_zeroDuration AssertionFailedError
  org.joda.time.TestMutableInterval_Basics#testOverlaps_RInterval AssertionFailedError
Tests in error: 
  org.joda.time.TestInterval_Basics#testOverlap_RInterval IllegalArgumentException
  org.joda.time.TestInterval_Basics#testOverlap_RInterval_null IllegalArgumentException

Tests run: 4157, Failures: 6, Errors: 2, Skipped: 0

[INFO] ------------------------------------------------------------------------
[INFO] BUILD FAILURE
[INFO] ------------------------------------------------------------------------
[INFO] Total time: 15.756s
[INFO] Finished at: Wed Aug 05 20:37:06 BST 2015
[INFO] Final Memory: 9M/213M
[INFO] ------------------------------------------------------------------------
[ERROR] Failed to execute goal org.apache.maven.plugins:maven-surefire-plugin:2.18.1:test (default-test) on project joda-time: There are test failures.
[ERROR] 
[ERROR] Please refer to /home/perham/Study/LittleDarwin/Cases/joda-time-2.8.1/target/surefire-reports for the individual test results.
[ERROR] -> [Help 1]
[ERROR] 
[ERROR] To see the full stack trace of the errors, re-run Maven with the -e switch.
[ERROR] Re-run Maven using the -X switch to enable full debug logging.
[ERROR] 
[ERROR] For more information about the errors and possible solutions, please read the following articles:
[ERROR] [Help 1] http://cwiki.apache.org/confluence/display/MAVEN/MojoFailureException
