[INFO] Scanning for projects...
[INFO]                                                                         
[INFO] ------------------------------------------------------------------------
[INFO] Building Joda-Time 2.8.1
[INFO] ------------------------------------------------------------------------
[INFO] 
[INFO] --- maven-resources-plugin:2.7:resources (default-resources) @ joda-time ---
[INFO] Using 'UTF-8' encoding to copy filtered resources.
[INFO] Copying 2 resources to META-INF
[INFO] Copying 10 resources
[INFO] 
[INFO] --- maven-compiler-plugin:3.3:compile (default-compile) @ joda-time ---
[INFO] Changes detected - recompiling the module!
[INFO] Compiling 166 source files to /home/perham/Study/LittleDarwin/Cases/joda-time-2.8.1/target/classes
[INFO] 
[INFO] --- exec-maven-plugin:1.4.0:java (compile-tzdb) @ joda-time ---
Writing zoneinfo files
Writing ZoneInfoMap
[INFO] 
[INFO] --- maven-resources-plugin:2.7:testResources (default-testResources) @ joda-time ---
[INFO] Using 'UTF-8' encoding to copy filtered resources.
[INFO] Copying 34 resources
[INFO] 
[INFO] --- maven-compiler-plugin:3.3:testCompile (default-testCompile) @ joda-time ---
[INFO] Nothing to compile - all classes are up to date
[INFO] 
[INFO] --- maven-surefire-plugin:2.18.1:test (default-test) @ joda-time ---
[INFO] Surefire report directory: /home/perham/Study/LittleDarwin/Cases/joda-time-2.8.1/target/surefire-reports

-------------------------------------------------------
 T E S T S
-------------------------------------------------------
Running org.joda.time.TestAllPackages

TestBuddhistChronology.testCalendar

TestCopticChronology.testCalendar

TestEthiopicChronology.testCalendar

TestIslamicChronology.testCalendar

Testing Gregorian chronology over 1000 iterations
100% complete (i=1000)

Testing Julian chronology over 1000 iterations
100% complete (i=1000)
Writing zoneinfo files
Writing ZoneInfoMap
Tests run: 4157, Failures: 48, Errors: 0, Skipped: 0, Time elapsed: 5.381 sec <<< FAILURE! - in org.joda.time.TestAllPackages
testToInterval(org.joda.time.TestDateMidnight_Basics)  Time elapsed: 0.005 sec  <<< FAILURE!
junit.framework.AssertionFailedError: expected:<1718-07-27T00:00:00.000+01:00/1718-07-28T00:00:00.000+01:00> but was:<1718-07-27T00:00:00.000+01:00/1718-07-28T00:00:00.000+01:00>
	at junit.framework.Assert.fail(Assert.java:47)
	at junit.framework.Assert.failNotEquals(Assert.java:280)
	at junit.framework.Assert.assertEquals(Assert.java:64)
	at junit.framework.Assert.assertEquals(Assert.java:71)
	at org.joda.time.TestDateMidnight_Basics.testToInterval(TestDateMidnight_Basics.java:657)

testToIntervalFrom(org.joda.time.TestDuration_Basics)  Time elapsed: 0.001 sec  <<< FAILURE!
junit.framework.AssertionFailedError: expected:<2004-06-09T00:00:00.000+01:00/2005-09-02T05:06:07.008+01:00> but was:<2004-06-09T00:00:00.000+01:00/2005-09-02T05:06:07.008+01:00>
	at junit.framework.Assert.fail(Assert.java:47)
	at junit.framework.Assert.failNotEquals(Assert.java:280)
	at junit.framework.Assert.assertEquals(Assert.java:64)
	at junit.framework.Assert.assertEquals(Assert.java:71)
	at org.joda.time.TestDuration_Basics.testToIntervalFrom(TestDuration_Basics.java:595)

testToIntervalTo(org.joda.time.TestDuration_Basics)  Time elapsed: 0.001 sec  <<< FAILURE!
junit.framework.AssertionFailedError: expected:<2003-03-16T17:53:52.992Z/2004-06-09T00:00:00.000+01:00> but was:<2003-03-16T17:53:52.992Z/2004-06-09T00:00:00.000+01:00>
	at junit.framework.Assert.fail(Assert.java:47)
	at junit.framework.Assert.failNotEquals(Assert.java:280)
	at junit.framework.Assert.assertEquals(Assert.java:64)
	at junit.framework.Assert.assertEquals(Assert.java:71)
	at org.joda.time.TestDuration_Basics.testToIntervalTo(TestDuration_Basics.java:608)

testParse_noFormatter(org.joda.time.TestInterval_Constructors)  Time elapsed: 0.002 sec  <<< FAILURE!
junit.framework.AssertionFailedError: expected:<2010-06-30T12:30:00.000+02:00/2010-07-01T14:30:00.000+02:00> but was:<2010-06-30T12:30:00.000+02:00/2010-07-01T14:30:00.000+02:00>
	at junit.framework.Assert.fail(Assert.java:47)
	at junit.framework.Assert.failNotEquals(Assert.java:280)
	at junit.framework.Assert.assertEquals(Assert.java:64)
	at junit.framework.Assert.assertEquals(Assert.java:71)
	at org.joda.time.TestInterval_Constructors.testParse_noFormatter(TestInterval_Constructors.java:108)

testEqualsHashCode(org.joda.time.TestInterval_Basics)  Time elapsed: 0 sec  <<< FAILURE!
junit.framework.AssertionFailedError: expected:<true> but was:<false>
	at junit.framework.Assert.fail(Assert.java:47)
	at junit.framework.Assert.failNotEquals(Assert.java:280)
	at junit.framework.Assert.assertEquals(Assert.java:64)
	at junit.framework.Assert.assertEquals(Assert.java:146)
	at junit.framework.Assert.assertEquals(Assert.java:152)
	at org.joda.time.TestInterval_Basics.testEqualsHashCode(TestInterval_Basics.java:146)

testSerialization(org.joda.time.TestInterval_Basics)  Time elapsed: 0.006 sec  <<< FAILURE!
junit.framework.AssertionFailedError: expected:<1718-07-27T14:24:00.000+02:00/1719-08-28T16:28:00.000+02:00> but was:<1718-07-27T14:24:00.000+02:00/1719-08-28T16:28:00.000+02:00>
	at junit.framework.Assert.fail(Assert.java:47)
	at junit.framework.Assert.failNotEquals(Assert.java:280)
	at junit.framework.Assert.assertEquals(Assert.java:64)
	at junit.framework.Assert.assertEquals(Assert.java:71)
	at org.joda.time.TestInterval_Basics.testSerialization(TestInterval_Basics.java:1038)

testEqualsHashCodeStrict(org.joda.time.TestInterval_Basics)  Time elapsed: 0.001 sec  <<< FAILURE!
junit.framework.AssertionFailedError: expected:<true> but was:<false>
	at junit.framework.Assert.fail(Assert.java:47)
	at junit.framework.Assert.failNotEquals(Assert.java:280)
	at junit.framework.Assert.assertEquals(Assert.java:64)
	at junit.framework.Assert.assertEquals(Assert.java:146)
	at junit.framework.Assert.assertEquals(Assert.java:152)
	at org.joda.time.TestInterval_Basics.testEqualsHashCodeStrict(TestInterval_Basics.java:225)

testOverlap_RInterval(org.joda.time.TestInterval_Basics)  Time elapsed: 0.001 sec  <<< FAILURE!
junit.framework.AssertionFailedError: expected:<1970-01-01T01:00:00.003+01:00/1970-01-01T01:00:00.004+01:00> but was:<1970-01-01T01:00:00.003+01:00/1970-01-01T01:00:00.004+01:00>
	at junit.framework.Assert.fail(Assert.java:47)
	at junit.framework.Assert.failNotEquals(Assert.java:280)
	at junit.framework.Assert.assertEquals(Assert.java:64)
	at junit.framework.Assert.assertEquals(Assert.java:71)
	at org.joda.time.TestInterval_Basics.testOverlap_RInterval(TestInterval_Basics.java:640)

testOverlap_RInterval_null(org.joda.time.TestInterval_Basics)  Time elapsed: 0 sec  <<< FAILURE!
junit.framework.AssertionFailedError: expected:<1970-01-01T01:00:00.004+01:00/1970-01-01T01:00:00.004+01:00> but was:<1970-01-01T01:00:00.004+01:00/1970-01-01T01:00:00.004+01:00>
	at junit.framework.Assert.fail(Assert.java:47)
	at junit.framework.Assert.failNotEquals(Assert.java:280)
	at junit.framework.Assert.assertEquals(Assert.java:64)
	at junit.framework.Assert.assertEquals(Assert.java:71)
	at org.joda.time.TestInterval_Basics.testOverlap_RInterval_null(TestInterval_Basics.java:666)

testGap_RInterval(org.joda.time.TestInterval_Basics)  Time elapsed: 0 sec  <<< FAILURE!
junit.framework.AssertionFailedError: expected:<1970-01-01T01:00:00.001+01:00/1970-01-01T01:00:00.003+01:00> but was:<1970-01-01T01:00:00.001+01:00/1970-01-01T01:00:00.003+01:00>
	at junit.framework.Assert.fail(Assert.java:47)
	at junit.framework.Assert.failNotEquals(Assert.java:280)
	at junit.framework.Assert.assertEquals(Assert.java:64)
	at junit.framework.Assert.assertEquals(Assert.java:71)
	at org.joda.time.TestInterval_Basics.testGap_RInterval(TestInterval_Basics.java:705)

testGap_RInterval_null(org.joda.time.TestInterval_Basics)  Time elapsed: 0.001 sec  <<< FAILURE!
junit.framework.AssertionFailedError: expected:<1970-01-01T01:00:00.002+01:00/1970-01-01T01:00:00.003+01:00> but was:<1970-01-01T01:00:00.002+01:00/1970-01-01T01:00:00.003+01:00>
	at junit.framework.Assert.fail(Assert.java:47)
	at junit.framework.Assert.failNotEquals(Assert.java:280)
	at junit.framework.Assert.assertEquals(Assert.java:64)
	at junit.framework.Assert.assertEquals(Assert.java:71)
	at org.joda.time.TestInterval_Basics.testGap_RInterval_null(TestInterval_Basics.java:729)

testToMutableInterval1(org.joda.time.TestInterval_Basics)  Time elapsed: 0 sec  <<< FAILURE!
junit.framework.AssertionFailedError: expected:<1718-07-27T14:24:00.000+02:00/1719-08-28T16:28:00.000+02:00> but was:<1718-07-27T14:24:00.000+02:00/1719-08-28T16:28:00.000+02:00>
	at junit.framework.Assert.fail(Assert.java:47)
	at junit.framework.Assert.failNotEquals(Assert.java:280)
	at junit.framework.Assert.assertEquals(Assert.java:64)
	at junit.framework.Assert.assertEquals(Assert.java:71)
	at org.joda.time.TestInterval_Basics.testToMutableInterval1(TestInterval_Basics.java:988)

testToString_reparse(org.joda.time.TestInterval_Basics)  Time elapsed: 0.001 sec  <<< FAILURE!
junit.framework.AssertionFailedError: expected:<2004-06-09T07:08:09.010+02:00/2005-08-13T12:14:16.018+02:00> but was:<2004-06-09T07:08:09.010+02:00/2005-08-13T12:14:16.018+02:00>
	at junit.framework.Assert.fail(Assert.java:47)
	at junit.framework.Assert.failNotEquals(Assert.java:280)
	at junit.framework.Assert.assertEquals(Assert.java:64)
	at junit.framework.Assert.assertEquals(Assert.java:71)
	at org.joda.time.TestInterval_Basics.testToString_reparse(TestInterval_Basics.java:1053)

testWithChronology1(org.joda.time.TestInterval_Basics)  Time elapsed: 0.001 sec  <<< FAILURE!
junit.framework.AssertionFailedError: expected:<2545-04-05T14:24:00.000+02:00/2546-05-06T16:28:00.000+02:00> but was:<2545-04-05T14:24:00.000+02:00/2546-05-06T16:28:00.000+02:00>
	at junit.framework.Assert.fail(Assert.java:47)
	at junit.framework.Assert.failNotEquals(Assert.java:280)
	at junit.framework.Assert.assertEquals(Assert.java:64)
	at junit.framework.Assert.assertEquals(Assert.java:71)
	at org.joda.time.TestInterval_Basics.testWithChronology1(TestInterval_Basics.java:1060)

testWithChronology2(org.joda.time.TestInterval_Basics)  Time elapsed: 0.001 sec  <<< FAILURE!
junit.framework.AssertionFailedError: expected:<2002-04-05T14:24:00.000+02:00/2003-05-06T16:28:00.000+02:00> but was:<2002-04-05T14:24:00.000+02:00/2003-05-06T16:28:00.000+02:00>
	at junit.framework.Assert.fail(Assert.java:47)
	at junit.framework.Assert.failNotEquals(Assert.java:280)
	at junit.framework.Assert.assertEquals(Assert.java:64)
	at junit.framework.Assert.assertEquals(Assert.java:71)
	at org.joda.time.TestInterval_Basics.testWithChronology2(TestInterval_Basics.java:1066)

testWithStartMillis_long1(org.joda.time.TestInterval_Basics)  Time elapsed: 0.002 sec  <<< FAILURE!
junit.framework.AssertionFailedError: expected:<1718-07-27T14:23:59.999+02:00/1719-08-28T16:28:00.000+02:00> but was:<1718-07-27T14:23:59.999+02:00/1719-08-28T16:28:00.000+02:00>
	at junit.framework.Assert.fail(Assert.java:47)
	at junit.framework.Assert.failNotEquals(Assert.java:280)
	at junit.framework.Assert.assertEquals(Assert.java:64)
	at junit.framework.Assert.assertEquals(Assert.java:71)
	at org.joda.time.TestInterval_Basics.testWithStartMillis_long1(TestInterval_Basics.java:1079)

testWithStartInstant_RI1(org.joda.time.TestInterval_Basics)  Time elapsed: 0 sec  <<< FAILURE!
junit.framework.AssertionFailedError: expected:<1718-07-27T14:23:59.999+02:00/1719-08-28T16:28:00.000+02:00> but was:<1718-07-27T14:23:59.999+02:00/1719-08-28T16:28:00.000+02:00>
	at junit.framework.Assert.fail(Assert.java:47)
	at junit.framework.Assert.failNotEquals(Assert.java:280)
	at junit.framework.Assert.assertEquals(Assert.java:64)
	at junit.framework.Assert.assertEquals(Assert.java:71)
	at org.joda.time.TestInterval_Basics.testWithStartInstant_RI1(TestInterval_Basics.java:1100)

testWithStartInstant_RI3(org.joda.time.TestInterval_Basics)  Time elapsed: 0.001 sec  <<< FAILURE!
junit.framework.AssertionFailedError: expected:<1718-10-02T02:00:00.000+02:00/1719-08-28T16:28:00.000+02:00> but was:<1718-10-02T02:00:00.000+02:00/1719-08-28T16:28:00.000+02:00>
	at junit.framework.Assert.fail(Assert.java:47)
	at junit.framework.Assert.failNotEquals(Assert.java:280)
	at junit.framework.Assert.assertEquals(Assert.java:64)
	at junit.framework.Assert.assertEquals(Assert.java:71)
	at org.joda.time.TestInterval_Basics.testWithStartInstant_RI3(TestInterval_Basics.java:1114)

testWithEndMillis_long1(org.joda.time.TestInterval_Basics)  Time elapsed: 0 sec  <<< FAILURE!
junit.framework.AssertionFailedError: expected:<1718-07-27T14:24:00.000+02:00/1719-08-28T16:27:59.999+02:00> but was:<1718-07-27T14:24:00.000+02:00/1719-08-28T16:27:59.999+02:00>
	at junit.framework.Assert.fail(Assert.java:47)
	at junit.framework.Assert.failNotEquals(Assert.java:280)
	at junit.framework.Assert.assertEquals(Assert.java:64)
	at junit.framework.Assert.assertEquals(Assert.java:71)
	at org.joda.time.TestInterval_Basics.testWithEndMillis_long1(TestInterval_Basics.java:1121)

testWithEndInstant_RI1(org.joda.time.TestInterval_Basics)  Time elapsed: 0 sec  <<< FAILURE!
junit.framework.AssertionFailedError: expected:<1718-07-27T14:24:00.000+02:00/1719-08-28T16:27:59.999+02:00> but was:<1718-07-27T14:24:00.000+02:00/1719-08-28T16:27:59.999+02:00>
	at junit.framework.Assert.fail(Assert.java:47)
	at junit.framework.Assert.failNotEquals(Assert.java:280)
	at junit.framework.Assert.assertEquals(Assert.java:64)
	at junit.framework.Assert.assertEquals(Assert.java:71)
	at org.joda.time.TestInterval_Basics.testWithEndInstant_RI1(TestInterval_Basics.java:1142)

testWithEndInstant_RI3(org.joda.time.TestInterval_Basics)  Time elapsed: 0.001 sec  <<< FAILURE!
junit.framework.AssertionFailedError: expected:<1718-07-27T14:24:00.000+02:00/1718-10-02T02:00:00.000+02:00> but was:<1718-07-27T14:24:00.000+02:00/1718-10-02T02:00:00.000+02:00>
	at junit.framework.Assert.fail(Assert.java:47)
	at junit.framework.Assert.failNotEquals(Assert.java:280)
	at junit.framework.Assert.assertEquals(Assert.java:64)
	at junit.framework.Assert.assertEquals(Assert.java:71)
	at org.joda.time.TestInterval_Basics.testWithEndInstant_RI3(TestInterval_Basics.java:1156)

testWithDurationAfterStart1(org.joda.time.TestInterval_Basics)  Time elapsed: 0.001 sec  <<< FAILURE!
junit.framework.AssertionFailedError: expected:<1718-10-02T02:00:00.000+02:00/1719-08-28T16:28:00.000+02:00> but was:<1718-10-02T02:00:00.000+02:00/1719-08-28T16:28:00.000+02:00>
	at junit.framework.Assert.fail(Assert.java:47)
	at junit.framework.Assert.failNotEquals(Assert.java:280)
	at junit.framework.Assert.assertEquals(Assert.java:64)
	at junit.framework.Assert.assertEquals(Assert.java:71)
	at org.joda.time.TestInterval_Basics.testWithDurationAfterStart1(TestInterval_Basics.java:1165)

testWithDurationAfterStart2(org.joda.time.TestInterval_Basics)  Time elapsed: 0 sec  <<< FAILURE!
junit.framework.AssertionFailedError: expected:<1718-10-02T02:00:00.000+02:00/1718-10-02T02:00:00.000+02:00> but was:<1718-10-02T02:00:00.000+02:00/1718-10-02T02:00:00.000+02:00>
	at junit.framework.Assert.fail(Assert.java:47)
	at junit.framework.Assert.failNotEquals(Assert.java:280)
	at junit.framework.Assert.assertEquals(Assert.java:64)
	at junit.framework.Assert.assertEquals(Assert.java:71)
	at org.joda.time.TestInterval_Basics.testWithDurationAfterStart2(TestInterval_Basics.java:1172)

testWithDurationBeforeEnd1(org.joda.time.TestInterval_Basics)  Time elapsed: 0 sec  <<< FAILURE!
junit.framework.AssertionFailedError: expected:<1718-07-27T14:24:00.000+02:00/1718-10-02T02:00:00.000+02:00> but was:<1718-07-27T14:24:00.000+02:00/1718-10-02T02:00:00.000+02:00>
	at junit.framework.Assert.fail(Assert.java:47)
	at junit.framework.Assert.failNotEquals(Assert.java:280)
	at junit.framework.Assert.assertEquals(Assert.java:64)
	at junit.framework.Assert.assertEquals(Assert.java:71)
	at org.joda.time.TestInterval_Basics.testWithDurationBeforeEnd1(TestInterval_Basics.java:1197)

testWithDurationBeforeEnd2(org.joda.time.TestInterval_Basics)  Time elapsed: 0.003 sec  <<< FAILURE!
junit.framework.AssertionFailedError: expected:<1719-08-28T16:28:00.000+02:00/1719-08-28T16:28:00.000+02:00> but was:<1719-08-28T16:28:00.000+02:00/1719-08-28T16:28:00.000+02:00>
	at junit.framework.Assert.fail(Assert.java:47)
	at junit.framework.Assert.failNotEquals(Assert.java:280)
	at junit.framework.Assert.assertEquals(Assert.java:64)
	at junit.framework.Assert.assertEquals(Assert.java:71)
	at org.joda.time.TestInterval_Basics.testWithDurationBeforeEnd2(TestInterval_Basics.java:1204)

testWithPeriodAfterStart1(org.joda.time.TestInterval_Basics)  Time elapsed: 0 sec  <<< FAILURE!
junit.framework.AssertionFailedError: expected:<1718-10-02T02:00:00.000+02:00/1719-03-02T03:00:00.000+01:00> but was:<1718-10-02T02:00:00.000+02:00/1719-03-02T03:00:00.000+01:00>
	at junit.framework.Assert.fail(Assert.java:47)
	at junit.framework.Assert.failNotEquals(Assert.java:280)
	at junit.framework.Assert.assertEquals(Assert.java:64)
	at junit.framework.Assert.assertEquals(Assert.java:71)
	at org.joda.time.TestInterval_Basics.testWithPeriodAfterStart1(TestInterval_Basics.java:1230)

testWithPeriodAfterStart2(org.joda.time.TestInterval_Basics)  Time elapsed: 0 sec  <<< FAILURE!
junit.framework.AssertionFailedError: expected:<1718-10-02T02:00:00.000+02:00/1718-10-02T02:00:00.000+02:00> but was:<1718-10-02T02:00:00.000+02:00/1718-10-02T02:00:00.000+02:00>
	at junit.framework.Assert.fail(Assert.java:47)
	at junit.framework.Assert.failNotEquals(Assert.java:280)
	at junit.framework.Assert.assertEquals(Assert.java:64)
	at junit.framework.Assert.assertEquals(Assert.java:71)
	at org.joda.time.TestInterval_Basics.testWithPeriodAfterStart2(TestInterval_Basics.java:1237)

testWithPeriodBeforeEnd1(org.joda.time.TestInterval_Basics)  Time elapsed: 0.001 sec  <<< FAILURE!
junit.framework.AssertionFailedError: expected:<1718-04-02T01:00:00.000+01:00/1718-10-02T02:00:00.000+02:00> but was:<1718-04-02T01:00:00.000+01:00/1718-10-02T02:00:00.000+02:00>
	at junit.framework.Assert.fail(Assert.java:47)
	at junit.framework.Assert.failNotEquals(Assert.java:280)
	at junit.framework.Assert.assertEquals(Assert.java:64)
	at junit.framework.Assert.assertEquals(Assert.java:71)
	at org.joda.time.TestInterval_Basics.testWithPeriodBeforeEnd1(TestInterval_Basics.java:1256)

testWithPeriodBeforeEnd2(org.joda.time.TestInterval_Basics)  Time elapsed: 0.001 sec  <<< FAILURE!
junit.framework.AssertionFailedError: expected:<1719-08-28T16:28:00.000+02:00/1719-08-28T16:28:00.000+02:00> but was:<1719-08-28T16:28:00.000+02:00/1719-08-28T16:28:00.000+02:00>
	at junit.framework.Assert.fail(Assert.java:47)
	at junit.framework.Assert.failNotEquals(Assert.java:280)
	at junit.framework.Assert.assertEquals(Assert.java:64)
	at junit.framework.Assert.assertEquals(Assert.java:71)
	at org.joda.time.TestInterval_Basics.testWithPeriodBeforeEnd2(TestInterval_Basics.java:1263)

testEqualsHashCodeLenient(org.joda.time.TestInterval_Basics)  Time elapsed: 0.001 sec  <<< FAILURE!
junit.framework.AssertionFailedError: expected:<true> but was:<false>
	at junit.framework.Assert.fail(Assert.java:47)
	at junit.framework.Assert.failNotEquals(Assert.java:280)
	at junit.framework.Assert.assertEquals(Assert.java:64)
	at junit.framework.Assert.assertEquals(Assert.java:146)
	at junit.framework.Assert.assertEquals(Assert.java:152)
	at org.joda.time.TestInterval_Basics.testEqualsHashCodeLenient(TestInterval_Basics.java:209)

testToInterval_Zone(org.joda.time.TestLocalDate_Basics)  Time elapsed: 0.001 sec  <<< FAILURE!
junit.framework.AssertionFailedError: expected:<2005-06-09T00:00:00.000+09:00/2005-06-10T00:00:00.000+09:00> but was:<2005-06-09T00:00:00.000+09:00/2005-06-10T00:00:00.000+09:00>
	at junit.framework.Assert.fail(Assert.java:47)
	at junit.framework.Assert.failNotEquals(Assert.java:280)
	at junit.framework.Assert.assertEquals(Assert.java:64)
	at junit.framework.Assert.assertEquals(Assert.java:71)
	at org.joda.time.TestLocalDate_Basics.testToInterval_Zone(TestLocalDate_Basics.java:977)

testToInterval_Zone_noMidnight(org.joda.time.TestLocalDate_Basics)  Time elapsed: 0 sec  <<< FAILURE!
junit.framework.AssertionFailedError: expected:<2006-04-01T01:00:00.000+03:00/2006-04-02T00:00:00.000+03:00> but was:<2006-04-01T01:00:00.000+03:00/2006-04-02T00:00:00.000+03:00>
	at junit.framework.Assert.fail(Assert.java:47)
	at junit.framework.Assert.failNotEquals(Assert.java:280)
	at junit.framework.Assert.assertEquals(Assert.java:64)
	at junit.framework.Assert.assertEquals(Assert.java:71)
	at org.joda.time.TestLocalDate_Basics.testToInterval_Zone_noMidnight(TestLocalDate_Basics.java:988)

testToInterval_nullZone(org.joda.time.TestLocalDate_Basics)  Time elapsed: 0 sec  <<< FAILURE!
junit.framework.AssertionFailedError: expected:<2005-06-09T00:00:00.000Z/2005-06-10T00:00:00.000Z> but was:<2005-06-09T00:00:00.000Z/2005-06-10T00:00:00.000Z>
	at junit.framework.Assert.fail(Assert.java:47)
	at junit.framework.Assert.failNotEquals(Assert.java:280)
	at junit.framework.Assert.assertEquals(Assert.java:64)
	at junit.framework.Assert.assertEquals(Assert.java:71)
	at org.joda.time.TestLocalDate_Basics.testToInterval_nullZone(TestLocalDate_Basics.java:998)

testToInterval(org.joda.time.TestLocalDate_Basics)  Time elapsed: 0.001 sec  <<< FAILURE!
junit.framework.AssertionFailedError: expected:<2005-06-09T00:00:00.000Z/2005-06-10T00:00:00.000Z> but was:<2005-06-09T00:00:00.000Z/2005-06-10T00:00:00.000Z>
	at junit.framework.Assert.fail(Assert.java:47)
	at junit.framework.Assert.failNotEquals(Assert.java:280)
	at junit.framework.Assert.assertEquals(Assert.java:64)
	at junit.framework.Assert.assertEquals(Assert.java:71)
	at org.joda.time.TestLocalDate_Basics.testToInterval(TestLocalDate_Basics.java:966)

testParse_noFormatter(org.joda.time.TestMutableInterval_Constructors)  Time elapsed: 0.001 sec  <<< FAILURE!
junit.framework.AssertionFailedError: expected:<2010-06-30T12:30:00.000+02:00/2010-07-01T14:30:00.000+02:00> but was:<2010-06-30T12:30:00.000+02:00/2010-07-01T14:30:00.000+02:00>
	at junit.framework.Assert.fail(Assert.java:47)
	at junit.framework.Assert.failNotEquals(Assert.java:280)
	at junit.framework.Assert.assertEquals(Assert.java:64)
	at junit.framework.Assert.assertEquals(Assert.java:71)
	at org.joda.time.TestMutableInterval_Constructors.testParse_noFormatter(TestMutableInterval_Constructors.java:114)

testEqualsHashCode(org.joda.time.TestMutableInterval_Basics)  Time elapsed: 0 sec  <<< FAILURE!
junit.framework.AssertionFailedError: expected:<true> but was:<false>
	at junit.framework.Assert.fail(Assert.java:47)
	at junit.framework.Assert.failNotEquals(Assert.java:280)
	at junit.framework.Assert.assertEquals(Assert.java:64)
	at junit.framework.Assert.assertEquals(Assert.java:146)
	at junit.framework.Assert.assertEquals(Assert.java:152)
	at org.joda.time.TestMutableInterval_Basics.testEqualsHashCode(TestMutableInterval_Basics.java:139)

testSerialization(org.joda.time.TestMutableInterval_Basics)  Time elapsed: 0.002 sec  <<< FAILURE!
junit.framework.AssertionFailedError: expected:<2002-04-05T13:24:00.000+01:00/2003-05-06T15:28:00.000+01:00> but was:<2002-04-05T13:24:00.000+01:00/2003-05-06T15:28:00.000+01:00>
	at junit.framework.Assert.fail(Assert.java:47)
	at junit.framework.Assert.failNotEquals(Assert.java:280)
	at junit.framework.Assert.assertEquals(Assert.java:64)
	at junit.framework.Assert.assertEquals(Assert.java:71)
	at org.joda.time.TestMutableInterval_Basics.testSerialization(TestMutableInterval_Basics.java:463)

testToInterval1(org.joda.time.TestMutableInterval_Basics)  Time elapsed: 0 sec  <<< FAILURE!
junit.framework.AssertionFailedError: expected:<1718-07-27T14:24:00.000+02:00/1719-08-28T16:28:00.000+02:00> but was:<1718-07-27T14:24:00.000+02:00/1719-08-28T16:28:00.000+02:00>
	at junit.framework.Assert.fail(Assert.java:47)
	at junit.framework.Assert.failNotEquals(Assert.java:280)
	at junit.framework.Assert.assertEquals(Assert.java:64)
	at junit.framework.Assert.assertEquals(Assert.java:71)
	at org.joda.time.TestMutableInterval_Basics.testToInterval1(TestMutableInterval_Basics.java:405)

testToMutableInterval1(org.joda.time.TestMutableInterval_Basics)  Time elapsed: 0.001 sec  <<< FAILURE!
junit.framework.AssertionFailedError: expected:<1718-07-27T14:24:00.000+02:00/1719-08-28T16:28:00.000+02:00> but was:<1718-07-27T14:24:00.000+02:00/1719-08-28T16:28:00.000+02:00>
	at junit.framework.Assert.fail(Assert.java:47)
	at junit.framework.Assert.failNotEquals(Assert.java:280)
	at junit.framework.Assert.assertEquals(Assert.java:64)
	at junit.framework.Assert.assertEquals(Assert.java:71)
	at org.joda.time.TestMutableInterval_Basics.testToMutableInterval1(TestMutableInterval_Basics.java:412)

testClone(org.joda.time.TestMutableInterval_Basics)  Time elapsed: 0.001 sec  <<< FAILURE!
junit.framework.AssertionFailedError: expected:<1686-04-23T01:00:00.123+01:00/1686-04-23T01:00:00.456+01:00> but was:<1686-04-23T01:00:00.123+01:00/1686-04-23T01:00:00.456+01:00>
	at junit.framework.Assert.fail(Assert.java:47)
	at junit.framework.Assert.failNotEquals(Assert.java:280)
	at junit.framework.Assert.assertEquals(Assert.java:64)
	at junit.framework.Assert.assertEquals(Assert.java:71)
	at org.joda.time.TestMutableInterval_Basics.testClone(TestMutableInterval_Basics.java:484)

testCopy(org.joda.time.TestMutableInterval_Basics)  Time elapsed: 0 sec  <<< FAILURE!
junit.framework.AssertionFailedError: expected:<1686-04-23T01:00:00.123+01:00/1686-04-23T01:00:00.456+01:00> but was:<1686-04-23T01:00:00.123+01:00/1686-04-23T01:00:00.456+01:00>
	at junit.framework.Assert.fail(Assert.java:47)
	at junit.framework.Assert.failNotEquals(Assert.java:280)
	at junit.framework.Assert.assertEquals(Assert.java:64)
	at junit.framework.Assert.assertEquals(Assert.java:71)
	at org.joda.time.TestMutableInterval_Basics.testCopy(TestMutableInterval_Basics.java:478)

testToInterval_Zone(org.joda.time.TestYearMonthDay_Basics)  Time elapsed: 0.001 sec  <<< FAILURE!
junit.framework.AssertionFailedError: expected:<2005-06-09T00:00:00.000+09:00/2005-06-10T00:00:00.000+09:00> but was:<2005-06-09T00:00:00.000+09:00/2005-06-10T00:00:00.000+09:00>
	at junit.framework.Assert.fail(Assert.java:47)
	at junit.framework.Assert.failNotEquals(Assert.java:280)
	at junit.framework.Assert.assertEquals(Assert.java:64)
	at junit.framework.Assert.assertEquals(Assert.java:71)
	at org.joda.time.TestYearMonthDay_Basics.testToInterval_Zone(TestYearMonthDay_Basics.java:730)

testToInterval_nullZone(org.joda.time.TestYearMonthDay_Basics)  Time elapsed: 0.001 sec  <<< FAILURE!
junit.framework.AssertionFailedError: expected:<2005-06-09T00:00:00.000Z/2005-06-10T00:00:00.000Z> but was:<2005-06-09T00:00:00.000Z/2005-06-10T00:00:00.000Z>
	at junit.framework.Assert.fail(Assert.java:47)
	at junit.framework.Assert.failNotEquals(Assert.java:280)
	at junit.framework.Assert.assertEquals(Assert.java:64)
	at junit.framework.Assert.assertEquals(Assert.java:71)
	at org.joda.time.TestYearMonthDay_Basics.testToInterval_nullZone(TestYearMonthDay_Basics.java:740)

testToInterval(org.joda.time.TestYearMonthDay_Basics)  Time elapsed: 0.001 sec  <<< FAILURE!
junit.framework.AssertionFailedError: expected:<2005-06-09T00:00:00.000Z/2005-06-10T00:00:00.000Z> but was:<2005-06-09T00:00:00.000Z/2005-06-10T00:00:00.000Z>
	at junit.framework.Assert.fail(Assert.java:47)
	at junit.framework.Assert.failNotEquals(Assert.java:280)
	at junit.framework.Assert.assertEquals(Assert.java:64)
	at junit.framework.Assert.assertEquals(Assert.java:71)
	at org.joda.time.TestYearMonthDay_Basics.testToInterval(TestYearMonthDay_Basics.java:719)

testToInterval_Zone(org.joda.time.TestYearMonth_Basics)  Time elapsed: 0.001 sec  <<< FAILURE!
junit.framework.AssertionFailedError: expected:<2005-06-01T00:00:00.000+09:00/2005-07-01T00:00:00.000+09:00> but was:<2005-06-01T00:00:00.000+09:00/2005-07-01T00:00:00.000+09:00>
	at junit.framework.Assert.fail(Assert.java:47)
	at junit.framework.Assert.failNotEquals(Assert.java:280)
	at junit.framework.Assert.assertEquals(Assert.java:64)
	at junit.framework.Assert.assertEquals(Assert.java:71)
	at org.joda.time.TestYearMonth_Basics.testToInterval_Zone(TestYearMonth_Basics.java:556)

testToInterval_nullZone(org.joda.time.TestYearMonth_Basics)  Time elapsed: 0.001 sec  <<< FAILURE!
junit.framework.AssertionFailedError: expected:<2005-06-01T00:00:00.000Z/2005-07-01T00:00:00.000Z> but was:<2005-06-01T00:00:00.000Z/2005-07-01T00:00:00.000Z>
	at junit.framework.Assert.fail(Assert.java:47)
	at junit.framework.Assert.failNotEquals(Assert.java:280)
	at junit.framework.Assert.assertEquals(Assert.java:64)
	at junit.framework.Assert.assertEquals(Assert.java:71)
	at org.joda.time.TestYearMonth_Basics.testToInterval_nullZone(TestYearMonth_Basics.java:566)

testToInterval(org.joda.time.TestYearMonth_Basics)  Time elapsed: 0.001 sec  <<< FAILURE!
junit.framework.AssertionFailedError: expected:<2005-06-01T00:00:00.000Z/2005-07-01T00:00:00.000Z> but was:<2005-06-01T00:00:00.000Z/2005-07-01T00:00:00.000Z>
	at junit.framework.Assert.fail(Assert.java:47)
	at junit.framework.Assert.failNotEquals(Assert.java:280)
	at junit.framework.Assert.assertEquals(Assert.java:64)
	at junit.framework.Assert.assertEquals(Assert.java:71)
	at org.joda.time.TestYearMonth_Basics.testToInterval(TestYearMonth_Basics.java:545)

testGetReadableInterval_ReadableInterval(org.joda.time.TestDateTimeUtils)  Time elapsed: 0.001 sec  <<< FAILURE!
junit.framework.AssertionFailedError: expected:<2002-06-09T01:00:00.000+01:00/2002-06-09T01:00:00.000+01:00> but was:<2002-06-09T01:00:00.000+01:00/2002-06-09T01:00:00.000+01:00>
	at junit.framework.Assert.fail(Assert.java:47)
	at junit.framework.Assert.failNotEquals(Assert.java:280)
	at junit.framework.Assert.assertEquals(Assert.java:64)
	at junit.framework.Assert.assertEquals(Assert.java:71)
	at org.joda.time.TestDateTimeUtils.testGetReadableInterval_ReadableInterval(TestDateTimeUtils.java:396)


Results :

Failed tests: 
  org.joda.time.TestDateMidnight_Basics#testToInterval AssertionFailedError expe...
  org.joda.time.TestDateTimeUtils#testGetReadableInterval_ReadableInterval AssertionFailedError
  org.joda.time.TestDuration_Basics#testToIntervalFrom AssertionFailedError expe...
  org.joda.time.TestDuration_Basics#testToIntervalTo AssertionFailedError expect...
  org.joda.time.TestInterval_Basics#testEqualsHashCode AssertionFailedError expe...
  org.joda.time.TestInterval_Basics#testEqualsHashCodeLenient AssertionFailedError
  org.joda.time.TestInterval_Basics#testEqualsHashCodeStrict AssertionFailedError
  org.joda.time.TestInterval_Basics#testGap_RInterval AssertionFailedError expec...
  org.joda.time.TestInterval_Basics#testGap_RInterval_null AssertionFailedError ...
  org.joda.time.TestInterval_Basics#testOverlap_RInterval AssertionFailedError e...
  org.joda.time.TestInterval_Basics#testOverlap_RInterval_null AssertionFailedError
  org.joda.time.TestInterval_Basics#testSerialization AssertionFailedError expec...
  org.joda.time.TestInterval_Basics#testToMutableInterval1 AssertionFailedError ...
  org.joda.time.TestInterval_Basics#testToString_reparse AssertionFailedError ex...
  org.joda.time.TestInterval_Basics#testWithChronology1 AssertionFailedError exp...
  org.joda.time.TestInterval_Basics#testWithChronology2 AssertionFailedError exp...
  org.joda.time.TestInterval_Basics#testWithDurationAfterStart1 AssertionFailedError
  org.joda.time.TestInterval_Basics#testWithDurationAfterStart2 AssertionFailedError
  org.joda.time.TestInterval_Basics#testWithDurationBeforeEnd1 AssertionFailedError
  org.joda.time.TestInterval_Basics#testWithDurationBeforeEnd2 AssertionFailedError
  org.joda.time.TestInterval_Basics#testWithEndInstant_RI1 AssertionFailedError ...
  org.joda.time.TestInterval_Basics#testWithEndInstant_RI3 AssertionFailedError ...
  org.joda.time.TestInterval_Basics#testWithEndMillis_long1 AssertionFailedError
  org.joda.time.TestInterval_Basics#testWithPeriodAfterStart1 AssertionFailedError
  org.joda.time.TestInterval_Basics#testWithPeriodAfterStart2 AssertionFailedError
  org.joda.time.TestInterval_Basics#testWithPeriodBeforeEnd1 AssertionFailedError
  org.joda.time.TestInterval_Basics#testWithPeriodBeforeEnd2 AssertionFailedError
  org.joda.time.TestInterval_Basics#testWithStartInstant_RI1 AssertionFailedError
  org.joda.time.TestInterval_Basics#testWithStartInstant_RI3 AssertionFailedError
  org.joda.time.TestInterval_Basics#testWithStartMillis_long1 AssertionFailedError
  org.joda.time.TestInterval_Constructors#testParse_noFormatter AssertionFailedError
  org.joda.time.TestLocalDate_Basics#testToInterval AssertionFailedError expecte...
  org.joda.time.TestLocalDate_Basics#testToInterval_Zone AssertionFailedError ex...
  org.joda.time.TestLocalDate_Basics#testToInterval_Zone_noMidnight AssertionFailedError
  org.joda.time.TestLocalDate_Basics#testToInterval_nullZone AssertionFailedError
  org.joda.time.TestMutableInterval_Basics#testClone AssertionFailedError expect...
  org.joda.time.TestMutableInterval_Basics#testCopy AssertionFailedError expecte...
  org.joda.time.TestMutableInterval_Basics#testEqualsHashCode AssertionFailedError
  org.joda.time.TestMutableInterval_Basics#testSerialization AssertionFailedError
  org.joda.time.TestMutableInterval_Basics#testToInterval1 AssertionFailedError ...
  org.joda.time.TestMutableInterval_Basics#testToMutableInterval1 AssertionFailedError
  org.joda.time.TestMutableInterval_Constructors#testParse_noFormatter AssertionFailedError
  org.joda.time.TestYearMonthDay_Basics#testToInterval AssertionFailedError expe...
  org.joda.time.TestYearMonthDay_Basics#testToInterval_Zone AssertionFailedError
  org.joda.time.TestYearMonthDay_Basics#testToInterval_nullZone AssertionFailedError
  org.joda.time.TestYearMonth_Basics#testToInterval AssertionFailedError expecte...
  org.joda.time.TestYearMonth_Basics#testToInterval_Zone AssertionFailedError ex...
  org.joda.time.TestYearMonth_Basics#testToInterval_nullZone AssertionFailedError

Tests run: 4157, Failures: 48, Errors: 0, Skipped: 0

[INFO] ------------------------------------------------------------------------
[INFO] BUILD FAILURE
[INFO] ------------------------------------------------------------------------
[INFO] Total time: 15.898s
[INFO] Finished at: Wed Aug 05 20:28:49 BST 2015
[INFO] Final Memory: 10M/338M
[INFO] ------------------------------------------------------------------------
[ERROR] Failed to execute goal org.apache.maven.plugins:maven-surefire-plugin:2.18.1:test (default-test) on project joda-time: There are test failures.
[ERROR] 
[ERROR] Please refer to /home/perham/Study/LittleDarwin/Cases/joda-time-2.8.1/target/surefire-reports for the individual test results.
[ERROR] -> [Help 1]
[ERROR] 
[ERROR] To see the full stack trace of the errors, re-run Maven with the -e switch.
[ERROR] Re-run Maven using the -X switch to enable full debug logging.
[ERROR] 
[ERROR] For more information about the errors and possible solutions, please read the following articles:
[ERROR] [Help 1] http://cwiki.apache.org/confluence/display/MAVEN/MojoFailureException
