[INFO] Scanning for projects...
[INFO]                                                                         
[INFO] ------------------------------------------------------------------------
[INFO] Building Joda-Time 2.8.1
[INFO] ------------------------------------------------------------------------
[INFO] 
[INFO] --- maven-resources-plugin:2.7:resources (default-resources) @ joda-time ---
[INFO] Using 'UTF-8' encoding to copy filtered resources.
[INFO] Copying 2 resources to META-INF
[INFO] Copying 10 resources
[INFO] 
[INFO] --- maven-compiler-plugin:3.3:compile (default-compile) @ joda-time ---
[INFO] Changes detected - recompiling the module!
[INFO] Compiling 166 source files to /home/perham/Study/LittleDarwin/Cases/joda-time-2.8.1/target/classes
[INFO] 
[INFO] --- exec-maven-plugin:1.4.0:java (compile-tzdb) @ joda-time ---
Writing zoneinfo files
Writing ZoneInfoMap
[INFO] 
[INFO] --- maven-resources-plugin:2.7:testResources (default-testResources) @ joda-time ---
[INFO] Using 'UTF-8' encoding to copy filtered resources.
[INFO] Copying 34 resources
[INFO] 
[INFO] --- maven-compiler-plugin:3.3:testCompile (default-testCompile) @ joda-time ---
[INFO] Nothing to compile - all classes are up to date
[INFO] 
[INFO] --- maven-surefire-plugin:2.18.1:test (default-test) @ joda-time ---
[INFO] Surefire report directory: /home/perham/Study/LittleDarwin/Cases/joda-time-2.8.1/target/surefire-reports

-------------------------------------------------------
 T E S T S
-------------------------------------------------------
Running org.joda.time.TestAllPackages

TestBuddhistChronology.testCalendar

TestCopticChronology.testCalendar

TestEthiopicChronology.testCalendar

TestIslamicChronology.testCalendar

Testing Gregorian chronology over 1000 iterations
100% complete (i=1000)

Testing Julian chronology over 1000 iterations
100% complete (i=1000)
Writing zoneinfo files
Writing ZoneInfoMap
Tests run: 4157, Failures: 15, Errors: 0, Skipped: 0, Time elapsed: 5.274 sec <<< FAILURE! - in org.joda.time.TestAllPackages
testWithFieldAdded1(org.joda.time.TestTimeOfDay_Basics)  Time elapsed: 0.004 sec  <<< FAILURE!
junit.framework.AssertionFailedError: expected:<T16:20:30.040> but was:<T10:20:30.040>
	at junit.framework.Assert.fail(Assert.java:47)
	at junit.framework.Assert.failNotEquals(Assert.java:280)
	at junit.framework.Assert.assertEquals(Assert.java:64)
	at junit.framework.Assert.assertEquals(Assert.java:71)
	at org.joda.time.TestTimeOfDay_Basics.testWithFieldAdded1(TestTimeOfDay_Basics.java:409)

testWithFieldAdded4(org.joda.time.TestTimeOfDay_Basics)  Time elapsed: 0.001 sec  <<< FAILURE!
junit.framework.AssertionFailedError: expected same:<T10:20:30.040> was not:<T10:20:30.040>
	at junit.framework.Assert.fail(Assert.java:47)
	at junit.framework.Assert.failNotSame(Assert.java:276)
	at junit.framework.Assert.assertSame(Assert.java:239)
	at junit.framework.Assert.assertSame(Assert.java:246)
	at org.joda.time.TestTimeOfDay_Basics.testWithFieldAdded4(TestTimeOfDay_Basics.java:431)

testPlusHours_int(org.joda.time.TestTimeOfDay_Basics)  Time elapsed: 0.001 sec  <<< FAILURE!
junit.framework.AssertionFailedError: expected:<T02:02:03.004> but was:<T01:02:03.004>
	at junit.framework.Assert.fail(Assert.java:47)
	at junit.framework.Assert.failNotEquals(Assert.java:280)
	at junit.framework.Assert.assertEquals(Assert.java:64)
	at junit.framework.Assert.assertEquals(Assert.java:71)
	at org.joda.time.TestTimeOfDay_Basics.testPlusHours_int(TestTimeOfDay_Basics.java:501)

testPlusMinutes_int(org.joda.time.TestTimeOfDay_Basics)  Time elapsed: 0.001 sec  <<< FAILURE!
junit.framework.AssertionFailedError: expected:<T01:03:03.004> but was:<T01:02:03.004>
	at junit.framework.Assert.fail(Assert.java:47)
	at junit.framework.Assert.failNotEquals(Assert.java:280)
	at junit.framework.Assert.assertEquals(Assert.java:64)
	at junit.framework.Assert.assertEquals(Assert.java:71)
	at org.joda.time.TestTimeOfDay_Basics.testPlusMinutes_int(TestTimeOfDay_Basics.java:511)

testPlusSeconds_int(org.joda.time.TestTimeOfDay_Basics)  Time elapsed: 0 sec  <<< FAILURE!
junit.framework.AssertionFailedError: expected:<T01:02:04.004> but was:<T01:02:03.004>
	at junit.framework.Assert.fail(Assert.java:47)
	at junit.framework.Assert.failNotEquals(Assert.java:280)
	at junit.framework.Assert.assertEquals(Assert.java:64)
	at junit.framework.Assert.assertEquals(Assert.java:71)
	at org.joda.time.TestTimeOfDay_Basics.testPlusSeconds_int(TestTimeOfDay_Basics.java:521)

testPlusMillis_int(org.joda.time.TestTimeOfDay_Basics)  Time elapsed: 0 sec  <<< FAILURE!
junit.framework.AssertionFailedError: expected:<T01:02:03.005> but was:<T01:02:03.004>
	at junit.framework.Assert.fail(Assert.java:47)
	at junit.framework.Assert.failNotEquals(Assert.java:280)
	at junit.framework.Assert.assertEquals(Assert.java:64)
	at junit.framework.Assert.assertEquals(Assert.java:71)
	at org.joda.time.TestTimeOfDay_Basics.testPlusMillis_int(TestTimeOfDay_Basics.java:531)

testMinusHours_int(org.joda.time.TestTimeOfDay_Basics)  Time elapsed: 0 sec  <<< FAILURE!
junit.framework.AssertionFailedError: expected:<T00:02:03.004> but was:<T01:02:03.004>
	at junit.framework.Assert.fail(Assert.java:47)
	at junit.framework.Assert.failNotEquals(Assert.java:280)
	at junit.framework.Assert.assertEquals(Assert.java:64)
	at junit.framework.Assert.assertEquals(Assert.java:71)
	at org.joda.time.TestTimeOfDay_Basics.testMinusHours_int(TestTimeOfDay_Basics.java:552)

testMinusMinutes_int(org.joda.time.TestTimeOfDay_Basics)  Time elapsed: 0.001 sec  <<< FAILURE!
junit.framework.AssertionFailedError: expected:<T01:01:03.004> but was:<T01:02:03.004>
	at junit.framework.Assert.fail(Assert.java:47)
	at junit.framework.Assert.failNotEquals(Assert.java:280)
	at junit.framework.Assert.assertEquals(Assert.java:64)
	at junit.framework.Assert.assertEquals(Assert.java:71)
	at org.joda.time.TestTimeOfDay_Basics.testMinusMinutes_int(TestTimeOfDay_Basics.java:562)

testMinusSeconds_int(org.joda.time.TestTimeOfDay_Basics)  Time elapsed: 0.001 sec  <<< FAILURE!
junit.framework.AssertionFailedError: expected:<T01:02:02.004> but was:<T01:02:03.004>
	at junit.framework.Assert.fail(Assert.java:47)
	at junit.framework.Assert.failNotEquals(Assert.java:280)
	at junit.framework.Assert.assertEquals(Assert.java:64)
	at junit.framework.Assert.assertEquals(Assert.java:71)
	at org.joda.time.TestTimeOfDay_Basics.testMinusSeconds_int(TestTimeOfDay_Basics.java:572)

testMinusMillis_int(org.joda.time.TestTimeOfDay_Basics)  Time elapsed: 0.001 sec  <<< FAILURE!
junit.framework.AssertionFailedError: expected:<T01:02:03.003> but was:<T01:02:03.004>
	at junit.framework.Assert.fail(Assert.java:47)
	at junit.framework.Assert.failNotEquals(Assert.java:280)
	at junit.framework.Assert.assertEquals(Assert.java:64)
	at junit.framework.Assert.assertEquals(Assert.java:71)
	at org.joda.time.TestTimeOfDay_Basics.testMinusMillis_int(TestTimeOfDay_Basics.java:582)

testWithFieldAdded6(org.joda.time.TestTimeOfDay_Basics)  Time elapsed: 0.001 sec  <<< FAILURE!
junit.framework.AssertionFailedError: expected:<T02:20:30.040> but was:<T10:20:30.040>
	at junit.framework.Assert.fail(Assert.java:47)
	at junit.framework.Assert.failNotEquals(Assert.java:280)
	at junit.framework.Assert.assertEquals(Assert.java:64)
	at junit.framework.Assert.assertEquals(Assert.java:71)
	at org.joda.time.TestTimeOfDay_Basics.testWithFieldAdded6(TestTimeOfDay_Basics.java:447)

testWithFieldAdded7(org.joda.time.TestTimeOfDay_Basics)  Time elapsed: 0.001 sec  <<< FAILURE!
junit.framework.AssertionFailedError: expected:<T00:00:00.000> but was:<T23:59:59.999>
	at junit.framework.Assert.fail(Assert.java:47)
	at junit.framework.Assert.failNotEquals(Assert.java:280)
	at junit.framework.Assert.assertEquals(Assert.java:64)
	at junit.framework.Assert.assertEquals(Assert.java:71)
	at org.joda.time.TestTimeOfDay_Basics.testWithFieldAdded7(TestTimeOfDay_Basics.java:453)

testWithFieldAdded8(org.joda.time.TestTimeOfDay_Basics)  Time elapsed: 0 sec  <<< FAILURE!
junit.framework.AssertionFailedError: expected:<T23:59:59.999> but was:<T00:00:00.000>
	at junit.framework.Assert.fail(Assert.java:47)
	at junit.framework.Assert.failNotEquals(Assert.java:280)
	at junit.framework.Assert.assertEquals(Assert.java:64)
	at junit.framework.Assert.assertEquals(Assert.java:71)
	at org.joda.time.TestTimeOfDay_Basics.testWithFieldAdded8(TestTimeOfDay_Basics.java:471)

testTimeOfDayAdd(org.joda.time.chrono.TestGJChronology)  Time elapsed: 0 sec  <<< FAILURE!
junit.framework.AssertionFailedError: expected:<T10:30:00.000> but was:<T12:30:00.000>
	at junit.framework.Assert.fail(Assert.java:47)
	at junit.framework.Assert.failNotEquals(Assert.java:280)
	at junit.framework.Assert.assertEquals(Assert.java:64)
	at junit.framework.Assert.assertEquals(Assert.java:71)
	at org.joda.time.chrono.TestGJChronology.testTimeOfDayAdd(TestGJChronology.java:504)

testTimeOfDayAdd(org.joda.time.chrono.TestISOChronology)  Time elapsed: 0.001 sec  <<< FAILURE!
junit.framework.AssertionFailedError: expected:<T10:30:00.000> but was:<T12:30:00.000>
	at junit.framework.Assert.fail(Assert.java:47)
	at junit.framework.Assert.failNotEquals(Assert.java:280)
	at junit.framework.Assert.assertEquals(Assert.java:64)
	at junit.framework.Assert.assertEquals(Assert.java:71)
	at org.joda.time.chrono.TestISOChronology.testTimeOfDayAdd(TestISOChronology.java:433)


Results :

Failed tests: 
  org.joda.time.TestTimeOfDay_Basics#testMinusHours_int AssertionFailedError exp...
  org.joda.time.TestTimeOfDay_Basics#testMinusMillis_int AssertionFailedError ex...
  org.joda.time.TestTimeOfDay_Basics#testMinusMinutes_int AssertionFailedError e...
  org.joda.time.TestTimeOfDay_Basics#testMinusSeconds_int AssertionFailedError e...
  org.joda.time.TestTimeOfDay_Basics#testPlusHours_int AssertionFailedError expe...
  org.joda.time.TestTimeOfDay_Basics#testPlusMillis_int AssertionFailedError exp...
  org.joda.time.TestTimeOfDay_Basics#testPlusMinutes_int AssertionFailedError ex...
  org.joda.time.TestTimeOfDay_Basics#testPlusSeconds_int AssertionFailedError ex...
  org.joda.time.TestTimeOfDay_Basics#testWithFieldAdded1 AssertionFailedError ex...
  org.joda.time.TestTimeOfDay_Basics#testWithFieldAdded4 AssertionFailedError ex...
  org.joda.time.TestTimeOfDay_Basics#testWithFieldAdded6 AssertionFailedError ex...
  org.joda.time.TestTimeOfDay_Basics#testWithFieldAdded7 AssertionFailedError ex...
  org.joda.time.TestTimeOfDay_Basics#testWithFieldAdded8 AssertionFailedError ex...
  org.joda.time.chrono.TestGJChronology#testTimeOfDayAdd AssertionFailedError ex...
  org.joda.time.chrono.TestISOChronology#testTimeOfDayAdd AssertionFailedError e...

Tests run: 4157, Failures: 15, Errors: 0, Skipped: 0

[INFO] ------------------------------------------------------------------------
[INFO] BUILD FAILURE
[INFO] ------------------------------------------------------------------------
[INFO] Total time: 15.123s
[INFO] Finished at: Wed Aug 05 19:47:13 BST 2015
[INFO] Final Memory: 9M/213M
[INFO] ------------------------------------------------------------------------
[ERROR] Failed to execute goal org.apache.maven.plugins:maven-surefire-plugin:2.18.1:test (default-test) on project joda-time: There are test failures.
[ERROR] 
[ERROR] Please refer to /home/perham/Study/LittleDarwin/Cases/joda-time-2.8.1/target/surefire-reports for the individual test results.
[ERROR] -> [Help 1]
[ERROR] 
[ERROR] To see the full stack trace of the errors, re-run Maven with the -e switch.
[ERROR] Re-run Maven using the -X switch to enable full debug logging.
[ERROR] 
[ERROR] For more information about the errors and possible solutions, please read the following articles:
[ERROR] [Help 1] http://cwiki.apache.org/confluence/display/MAVEN/MojoFailureException
