[INFO] Scanning for projects...
[INFO]                                                                         
[INFO] ------------------------------------------------------------------------
[INFO] Building Joda-Time 2.8.1
[INFO] ------------------------------------------------------------------------
[INFO] 
[INFO] --- maven-resources-plugin:2.7:resources (default-resources) @ joda-time ---
[INFO] Using 'UTF-8' encoding to copy filtered resources.
[INFO] Copying 2 resources to META-INF
[INFO] Copying 10 resources
[INFO] 
[INFO] --- maven-compiler-plugin:3.3:compile (default-compile) @ joda-time ---
[INFO] Changes detected - recompiling the module!
[INFO] Compiling 166 source files to /home/perham/Study/LittleDarwin/Cases/joda-time-2.8.1/target/classes
[INFO] 
[INFO] --- exec-maven-plugin:1.4.0:java (compile-tzdb) @ joda-time ---
Writing zoneinfo files
Writing ZoneInfoMap
[INFO] 
[INFO] --- maven-resources-plugin:2.7:testResources (default-testResources) @ joda-time ---
[INFO] Using 'UTF-8' encoding to copy filtered resources.
[INFO] Copying 34 resources
[INFO] 
[INFO] --- maven-compiler-plugin:3.3:testCompile (default-testCompile) @ joda-time ---
[INFO] Nothing to compile - all classes are up to date
[INFO] 
[INFO] --- maven-surefire-plugin:2.18.1:test (default-test) @ joda-time ---
[INFO] Surefire report directory: /home/perham/Study/LittleDarwin/Cases/joda-time-2.8.1/target/surefire-reports

-------------------------------------------------------
 T E S T S
-------------------------------------------------------
Running org.joda.time.TestAllPackages

TestBuddhistChronology.testCalendar

TestCopticChronology.testCalendar

TestEthiopicChronology.testCalendar

TestIslamicChronology.testCalendar

Testing Gregorian chronology over 1000 iterations
100% complete (i=1000)

Testing Julian chronology over 1000 iterations
100% complete (i=1000)
Writing zoneinfo files
Writing ZoneInfoMap
Tests run: 4157, Failures: 0, Errors: 35, Skipped: 0, Time elapsed: 5.33 sec <<< FAILURE! - in org.joda.time.TestAllPackages
testFactoryFieldDifference1(org.joda.time.TestPeriod_Constructors)  Time elapsed: 0.005 sec  <<< ERROR!
java.lang.ArrayIndexOutOfBoundsException: -1
	at org.joda.time.PeriodType.hashCode(PeriodType.java:211)
	at java.util.HashMap.hash(HashMap.java:362)
	at java.util.HashMap.put(HashMap.java:492)
	at org.joda.time.PeriodType.forFields(PeriodType.java:116)
	at org.joda.time.Period.fieldDifference(Period.java:275)
	at org.joda.time.TestPeriod_Constructors.testFactoryFieldDifference1(TestPeriod_Constructors.java:1498)

testNormalizedStandard_periodType_monthsWeeks(org.joda.time.TestPeriod_Basics)  Time elapsed: 0.001 sec  <<< ERROR!
java.lang.ArrayIndexOutOfBoundsException: -1
	at org.joda.time.PeriodType.hashCode(PeriodType.java:211)
	at java.util.HashMap.hash(HashMap.java:362)
	at java.util.HashMap.put(HashMap.java:492)
	at org.joda.time.PeriodType.forFields(PeriodType.java:116)
	at org.joda.time.TestPeriod_Basics.testNormalizedStandard_periodType_monthsWeeks(TestPeriod_Basics.java:1552)

testMillis(org.joda.time.TestPeriodType)  Time elapsed: 0 sec  <<< ERROR!
java.lang.ArrayIndexOutOfBoundsException: -1
	at org.joda.time.PeriodType.hashCode(PeriodType.java:211)
	at org.joda.time.TestPeriodType.testMillis(TestPeriodType.java:441)

testYears(org.joda.time.TestPeriodType)  Time elapsed: 0.001 sec  <<< ERROR!
java.lang.ArrayIndexOutOfBoundsException: -1
	at org.joda.time.PeriodType.hashCode(PeriodType.java:211)
	at org.joda.time.TestPeriodType.testYears(TestPeriodType.java:329)

testMonths(org.joda.time.TestPeriodType)  Time elapsed: 0 sec  <<< ERROR!
java.lang.ArrayIndexOutOfBoundsException: -1
	at org.joda.time.PeriodType.hashCode(PeriodType.java:211)
	at org.joda.time.TestPeriodType.testMonths(TestPeriodType.java:345)

testWeeks(org.joda.time.TestPeriodType)  Time elapsed: 0.001 sec  <<< ERROR!
java.lang.ArrayIndexOutOfBoundsException: -1
	at org.joda.time.PeriodType.hashCode(PeriodType.java:211)
	at org.joda.time.TestPeriodType.testWeeks(TestPeriodType.java:361)

testDays(org.joda.time.TestPeriodType)  Time elapsed: 0 sec  <<< ERROR!
java.lang.ArrayIndexOutOfBoundsException: -1
	at org.joda.time.PeriodType.hashCode(PeriodType.java:211)
	at org.joda.time.TestPeriodType.testDays(TestPeriodType.java:377)

testHours(org.joda.time.TestPeriodType)  Time elapsed: 0.004 sec  <<< ERROR!
java.lang.ArrayIndexOutOfBoundsException: -1
	at org.joda.time.PeriodType.hashCode(PeriodType.java:211)
	at org.joda.time.TestPeriodType.testHours(TestPeriodType.java:393)

testMinutes(org.joda.time.TestPeriodType)  Time elapsed: 0 sec  <<< ERROR!
java.lang.ArrayIndexOutOfBoundsException: -1
	at org.joda.time.PeriodType.hashCode(PeriodType.java:211)
	at org.joda.time.TestPeriodType.testMinutes(TestPeriodType.java:409)

testSeconds(org.joda.time.TestPeriodType)  Time elapsed: 0 sec  <<< ERROR!
java.lang.ArrayIndexOutOfBoundsException: -1
	at org.joda.time.PeriodType.hashCode(PeriodType.java:211)
	at org.joda.time.TestPeriodType.testSeconds(TestPeriodType.java:425)

testForFields1(org.joda.time.TestPeriodType)  Time elapsed: 0 sec  <<< ERROR!
java.lang.ArrayIndexOutOfBoundsException: -1
	at org.joda.time.PeriodType.hashCode(PeriodType.java:211)
	at java.util.HashMap.hash(HashMap.java:362)
	at java.util.HashMap.put(HashMap.java:492)
	at org.joda.time.PeriodType.forFields(PeriodType.java:116)
	at org.joda.time.TestPeriodType.testForFields1(TestPeriodType.java:449)

testForFields2(org.joda.time.TestPeriodType)  Time elapsed: 0 sec  <<< ERROR!
java.lang.ArrayIndexOutOfBoundsException: -1
	at org.joda.time.PeriodType.hashCode(PeriodType.java:211)
	at java.util.HashMap.hash(HashMap.java:362)
	at java.util.HashMap.put(HashMap.java:492)
	at org.joda.time.PeriodType.forFields(PeriodType.java:116)
	at org.joda.time.TestPeriodType.testForFields2(TestPeriodType.java:488)

testForFields3(org.joda.time.TestPeriodType)  Time elapsed: 0 sec  <<< ERROR!
java.lang.ArrayIndexOutOfBoundsException: -1
	at org.joda.time.PeriodType.hashCode(PeriodType.java:211)
	at java.util.HashMap.hash(HashMap.java:362)
	at java.util.HashMap.put(HashMap.java:492)
	at org.joda.time.PeriodType.forFields(PeriodType.java:116)
	at org.joda.time.TestPeriodType.testForFields3(TestPeriodType.java:508)

testForFields4(org.joda.time.TestPeriodType)  Time elapsed: 0 sec  <<< ERROR!
java.lang.ArrayIndexOutOfBoundsException: -1
	at org.joda.time.PeriodType.hashCode(PeriodType.java:211)
	at java.util.HashMap.hash(HashMap.java:362)
	at java.util.HashMap.put(HashMap.java:492)
	at org.joda.time.PeriodType.forFields(PeriodType.java:116)
	at org.joda.time.TestPeriodType.testForFields4(TestPeriodType.java:534)

testForFields5(org.joda.time.TestPeriodType)  Time elapsed: 0 sec  <<< ERROR!
java.lang.ArrayIndexOutOfBoundsException: -1
	at org.joda.time.PeriodType.hashCode(PeriodType.java:211)
	at java.util.HashMap.hash(HashMap.java:362)
	at java.util.HashMap.put(HashMap.java:492)
	at org.joda.time.PeriodType.forFields(PeriodType.java:116)
	at org.joda.time.TestPeriodType.testForFields5(TestPeriodType.java:545)

testForFields7(org.joda.time.TestPeriodType)  Time elapsed: 0 sec  <<< ERROR!
java.lang.ArrayIndexOutOfBoundsException: -1
	at org.joda.time.PeriodType.hashCode(PeriodType.java:211)
	at java.util.HashMap.hash(HashMap.java:362)
	at java.util.HashMap.put(HashMap.java:492)
	at org.joda.time.PeriodType.forFields(PeriodType.java:116)
	at org.joda.time.TestPeriodType.testForFields7(TestPeriodType.java:607)

testMaskYears(org.joda.time.TestPeriodType)  Time elapsed: 0.001 sec  <<< ERROR!
java.lang.ArrayIndexOutOfBoundsException: -1
	at org.joda.time.PeriodType.hashCode(PeriodType.java:211)
	at org.joda.time.TestPeriodType.testMaskYears(TestPeriodType.java:628)

testMaskMonths(org.joda.time.TestPeriodType)  Time elapsed: 0 sec  <<< ERROR!
java.lang.ArrayIndexOutOfBoundsException: -1
	at org.joda.time.PeriodType.hashCode(PeriodType.java:211)
	at org.joda.time.TestPeriodType.testMaskMonths(TestPeriodType.java:650)

testMaskWeeks(org.joda.time.TestPeriodType)  Time elapsed: 0 sec  <<< ERROR!
java.lang.ArrayIndexOutOfBoundsException: -1
	at org.joda.time.PeriodType.hashCode(PeriodType.java:211)
	at org.joda.time.TestPeriodType.testMaskWeeks(TestPeriodType.java:672)

testMaskDays(org.joda.time.TestPeriodType)  Time elapsed: 0.001 sec  <<< ERROR!
java.lang.ArrayIndexOutOfBoundsException: -1
	at org.joda.time.PeriodType.hashCode(PeriodType.java:211)
	at org.joda.time.TestPeriodType.testMaskDays(TestPeriodType.java:694)

testMaskHours(org.joda.time.TestPeriodType)  Time elapsed: 0.001 sec  <<< ERROR!
java.lang.ArrayIndexOutOfBoundsException: -1
	at org.joda.time.PeriodType.hashCode(PeriodType.java:211)
	at org.joda.time.TestPeriodType.testMaskHours(TestPeriodType.java:716)

testMaskMinutes(org.joda.time.TestPeriodType)  Time elapsed: 0 sec  <<< ERROR!
java.lang.ArrayIndexOutOfBoundsException: -1
	at org.joda.time.PeriodType.hashCode(PeriodType.java:211)
	at org.joda.time.TestPeriodType.testMaskMinutes(TestPeriodType.java:738)

testMaskSeconds(org.joda.time.TestPeriodType)  Time elapsed: 0.001 sec  <<< ERROR!
java.lang.ArrayIndexOutOfBoundsException: -1
	at org.joda.time.PeriodType.hashCode(PeriodType.java:211)
	at org.joda.time.TestPeriodType.testMaskSeconds(TestPeriodType.java:760)

testMaskMillis(org.joda.time.TestPeriodType)  Time elapsed: 0.001 sec  <<< ERROR!
java.lang.ArrayIndexOutOfBoundsException: -1
	at org.joda.time.PeriodType.hashCode(PeriodType.java:211)
	at org.joda.time.TestPeriodType.testMaskMillis(TestPeriodType.java:782)

testMaskHoursMinutesSeconds(org.joda.time.TestPeriodType)  Time elapsed: 0.001 sec  <<< ERROR!
java.lang.ArrayIndexOutOfBoundsException: -1
	at org.joda.time.PeriodType.hashCode(PeriodType.java:211)
	at org.joda.time.TestPeriodType.testMaskHoursMinutesSeconds(TestPeriodType.java:802)

testHashCode(org.joda.time.TestPeriodType)  Time elapsed: 0.001 sec  <<< ERROR!
java.lang.ArrayIndexOutOfBoundsException: -1
	at org.joda.time.PeriodType.hashCode(PeriodType.java:211)
	at org.joda.time.TestPeriodType.testHashCode(TestPeriodType.java:887)

testStandard(org.joda.time.TestPeriodType)  Time elapsed: 0 sec  <<< ERROR!
java.lang.ArrayIndexOutOfBoundsException: -1
	at org.joda.time.PeriodType.hashCode(PeriodType.java:211)
	at org.joda.time.TestPeriodType.testStandard(TestPeriodType.java:156)

testYearMonthDayTime(org.joda.time.TestPeriodType)  Time elapsed: 0 sec  <<< ERROR!
java.lang.ArrayIndexOutOfBoundsException: -1
	at org.joda.time.PeriodType.hashCode(PeriodType.java:211)
	at org.joda.time.TestPeriodType.testYearMonthDayTime(TestPeriodType.java:178)

testYearMonthDay(org.joda.time.TestPeriodType)  Time elapsed: 0.001 sec  <<< ERROR!
java.lang.ArrayIndexOutOfBoundsException: -1
	at org.joda.time.PeriodType.hashCode(PeriodType.java:211)
	at org.joda.time.TestPeriodType.testYearMonthDay(TestPeriodType.java:196)

testYearWeekDayTime(org.joda.time.TestPeriodType)  Time elapsed: 0 sec  <<< ERROR!
java.lang.ArrayIndexOutOfBoundsException: -1
	at org.joda.time.PeriodType.hashCode(PeriodType.java:211)
	at org.joda.time.TestPeriodType.testYearWeekDayTime(TestPeriodType.java:218)

testYearWeekDay(org.joda.time.TestPeriodType)  Time elapsed: 0.001 sec  <<< ERROR!
java.lang.ArrayIndexOutOfBoundsException: -1
	at org.joda.time.PeriodType.hashCode(PeriodType.java:211)
	at org.joda.time.TestPeriodType.testYearWeekDay(TestPeriodType.java:236)

testYearDayTime(org.joda.time.TestPeriodType)  Time elapsed: 0 sec  <<< ERROR!
java.lang.ArrayIndexOutOfBoundsException: -1
	at org.joda.time.PeriodType.hashCode(PeriodType.java:211)
	at org.joda.time.TestPeriodType.testYearDayTime(TestPeriodType.java:257)

testYearDay(org.joda.time.TestPeriodType)  Time elapsed: 0.001 sec  <<< ERROR!
java.lang.ArrayIndexOutOfBoundsException: -1
	at org.joda.time.PeriodType.hashCode(PeriodType.java:211)
	at org.joda.time.TestPeriodType.testYearDay(TestPeriodType.java:274)

testDayTime(org.joda.time.TestPeriodType)  Time elapsed: 0 sec  <<< ERROR!
java.lang.ArrayIndexOutOfBoundsException: -1
	at org.joda.time.PeriodType.hashCode(PeriodType.java:211)
	at org.joda.time.TestPeriodType.testDayTime(TestPeriodType.java:294)

testTime(org.joda.time.TestPeriodType)  Time elapsed: 0 sec  <<< ERROR!
java.lang.ArrayIndexOutOfBoundsException: -1
	at org.joda.time.PeriodType.hashCode(PeriodType.java:211)
	at org.joda.time.TestPeriodType.testTime(TestPeriodType.java:313)


Results :

Tests in error: 
  org.joda.time.TestPeriodType#testDayTime ArrayIndexOutOfBoundsException -1
  org.joda.time.TestPeriodType#testDays ArrayIndexOutOfBoundsException -1
  org.joda.time.TestPeriodType#testForFields1 ArrayIndexOutOfBoundsException -1
  org.joda.time.TestPeriodType#testForFields2 ArrayIndexOutOfBoundsException -1
  org.joda.time.TestPeriodType#testForFields3 ArrayIndexOutOfBoundsException -1
  org.joda.time.TestPeriodType#testForFields4 ArrayIndexOutOfBoundsException -1
  org.joda.time.TestPeriodType#testForFields5 ArrayIndexOutOfBoundsException -1
  org.joda.time.TestPeriodType#testForFields7 ArrayIndexOutOfBoundsException -1
  org.joda.time.TestPeriodType#testHashCode ArrayIndexOutOfBoundsException -1
  org.joda.time.TestPeriodType#testHours ArrayIndexOutOfBoundsException -1
  org.joda.time.TestPeriodType#testMaskDays ArrayIndexOutOfBoundsException -1
  org.joda.time.TestPeriodType#testMaskHours ArrayIndexOutOfBoundsException -1
  org.joda.time.TestPeriodType#testMaskHoursMinutesSeconds ArrayIndexOutOfBoundsException
  org.joda.time.TestPeriodType#testMaskMillis ArrayIndexOutOfBoundsException -1
  org.joda.time.TestPeriodType#testMaskMinutes ArrayIndexOutOfBoundsException -1
  org.joda.time.TestPeriodType#testMaskMonths ArrayIndexOutOfBoundsException -1
  org.joda.time.TestPeriodType#testMaskSeconds ArrayIndexOutOfBoundsException -1
  org.joda.time.TestPeriodType#testMaskWeeks ArrayIndexOutOfBoundsException -1
  org.joda.time.TestPeriodType#testMaskYears ArrayIndexOutOfBoundsException -1
  org.joda.time.TestPeriodType#testMillis ArrayIndexOutOfBoundsException -1
  org.joda.time.TestPeriodType#testMinutes ArrayIndexOutOfBoundsException -1
  org.joda.time.TestPeriodType#testMonths ArrayIndexOutOfBoundsException -1
  org.joda.time.TestPeriodType#testSeconds ArrayIndexOutOfBoundsException -1
  org.joda.time.TestPeriodType#testStandard ArrayIndexOutOfBoundsException -1
  org.joda.time.TestPeriodType#testTime ArrayIndexOutOfBoundsException -1
  org.joda.time.TestPeriodType#testWeeks ArrayIndexOutOfBoundsException -1
  org.joda.time.TestPeriodType#testYearDay ArrayIndexOutOfBoundsException -1
  org.joda.time.TestPeriodType#testYearDayTime ArrayIndexOutOfBoundsException -1
  org.joda.time.TestPeriodType#testYearMonthDay ArrayIndexOutOfBoundsException -...
  org.joda.time.TestPeriodType#testYearMonthDayTime ArrayIndexOutOfBoundsException
  org.joda.time.TestPeriodType#testYearWeekDay ArrayIndexOutOfBoundsException -1
  org.joda.time.TestPeriodType#testYearWeekDayTime ArrayIndexOutOfBoundsException
  org.joda.time.TestPeriodType#testYears ArrayIndexOutOfBoundsException -1
  org.joda.time.TestPeriod_Basics#testNormalizedStandard_periodType_monthsWeeks ArrayIndexOutOfBoundsException
  org.joda.time.TestPeriod_Constructors#testFactoryFieldDifference1 ArrayIndexOutOfBoundsException

Tests run: 4157, Failures: 0, Errors: 35, Skipped: 0

[INFO] ------------------------------------------------------------------------
[INFO] BUILD FAILURE
[INFO] ------------------------------------------------------------------------
[INFO] Total time: 15.127s
[INFO] Finished at: Wed Aug 05 18:56:27 BST 2015
[INFO] Final Memory: 9M/213M
[INFO] ------------------------------------------------------------------------
[ERROR] Failed to execute goal org.apache.maven.plugins:maven-surefire-plugin:2.18.1:test (default-test) on project joda-time: There are test failures.
[ERROR] 
[ERROR] Please refer to /home/perham/Study/LittleDarwin/Cases/joda-time-2.8.1/target/surefire-reports for the individual test results.
[ERROR] -> [Help 1]
[ERROR] 
[ERROR] To see the full stack trace of the errors, re-run Maven with the -e switch.
[ERROR] Re-run Maven using the -X switch to enable full debug logging.
[ERROR] 
[ERROR] For more information about the errors and possible solutions, please read the following articles:
[ERROR] [Help 1] http://cwiki.apache.org/confluence/display/MAVEN/MojoFailureException
