[INFO] Scanning for projects...
[INFO]                                                                         
[INFO] ------------------------------------------------------------------------
[INFO] Building Joda-Time 2.8.1
[INFO] ------------------------------------------------------------------------
[INFO] 
[INFO] --- maven-resources-plugin:2.7:resources (default-resources) @ joda-time ---
[INFO] Using 'UTF-8' encoding to copy filtered resources.
[INFO] Copying 2 resources to META-INF
[INFO] Copying 10 resources
[INFO] 
[INFO] --- maven-compiler-plugin:3.3:compile (default-compile) @ joda-time ---
[INFO] Changes detected - recompiling the module!
[INFO] Compiling 166 source files to /home/perham/Study/LittleDarwin/Cases/joda-time-2.8.1/target/classes
[INFO] 
[INFO] --- exec-maven-plugin:1.4.0:java (compile-tzdb) @ joda-time ---
Writing zoneinfo files
Writing ZoneInfoMap
[INFO] 
[INFO] --- maven-resources-plugin:2.7:testResources (default-testResources) @ joda-time ---
[INFO] Using 'UTF-8' encoding to copy filtered resources.
[INFO] Copying 34 resources
[INFO] 
[INFO] --- maven-compiler-plugin:3.3:testCompile (default-testCompile) @ joda-time ---
[INFO] Nothing to compile - all classes are up to date
[INFO] 
[INFO] --- maven-surefire-plugin:2.18.1:test (default-test) @ joda-time ---
[INFO] Surefire report directory: /home/perham/Study/LittleDarwin/Cases/joda-time-2.8.1/target/surefire-reports

-------------------------------------------------------
 T E S T S
-------------------------------------------------------
Running org.joda.time.TestAllPackages

TestBuddhistChronology.testCalendar

TestCopticChronology.testCalendar

TestEthiopicChronology.testCalendar

TestIslamicChronology.testCalendar

Testing Gregorian chronology over 1000 iterations
100% complete (i=1000)

Testing Julian chronology over 1000 iterations
100% complete (i=1000)
Writing zoneinfo files
Writing ZoneInfoMap
Tests run: 4157, Failures: 9, Errors: 26, Skipped: 0, Time elapsed: 5.323 sec <<< FAILURE! - in org.joda.time.TestAllPackages
testToPeriod_PeriodType(org.joda.time.TestDuration_Basics)  Time elapsed: 0.004 sec  <<< ERROR!
java.lang.NullPointerException
	at org.joda.time.chrono.BaseChronology.get(BaseChronology.java:283)
	at org.joda.time.base.BasePeriod.<init>(BasePeriod.java:258)
	at org.joda.time.Period.<init>(Period.java:402)
	at org.joda.time.base.BaseDuration.toPeriod(BaseDuration.java:144)
	at org.joda.time.TestDuration_Basics.testToPeriod_PeriodType(TestDuration_Basics.java:502)

testToPeriod_PeriodType_Chronology(org.joda.time.TestDuration_Basics)  Time elapsed: 0.001 sec  <<< ERROR!
java.lang.NullPointerException
	at org.joda.time.chrono.BaseChronology.get(BaseChronology.java:283)
	at org.joda.time.base.BasePeriod.<init>(BasePeriod.java:258)
	at org.joda.time.Period.<init>(Period.java:444)
	at org.joda.time.base.BaseDuration.toPeriod(BaseDuration.java:185)
	at org.joda.time.TestDuration_Basics.testToPeriod_PeriodType_Chronology(TestDuration_Basics.java:528)

testToPeriodFrom_PeriodType(org.joda.time.TestDuration_Basics)  Time elapsed: 0.001 sec  <<< ERROR!
java.lang.NullPointerException
	at org.joda.time.chrono.BaseChronology.get(BaseChronology.java:259)
	at org.joda.time.base.BasePeriod.<init>(BasePeriod.java:201)
	at org.joda.time.Period.<init>(Period.java:637)
	at org.joda.time.base.BaseDuration.toPeriodFrom(BaseDuration.java:216)
	at org.joda.time.TestDuration_Basics.testToPeriodFrom_PeriodType(TestDuration_Basics.java:555)

testToPeriodTo_PeriodType(org.joda.time.TestDuration_Basics)  Time elapsed: 0.001 sec  <<< ERROR!
java.lang.NullPointerException
	at org.joda.time.chrono.BaseChronology.get(BaseChronology.java:259)
	at org.joda.time.base.BasePeriod.<init>(BasePeriod.java:219)
	at org.joda.time.Period.<init>(Period.java:658)
	at org.joda.time.base.BaseDuration.toPeriodTo(BaseDuration.java:249)
	at org.joda.time.TestDuration_Basics.testToPeriodTo_PeriodType(TestDuration_Basics.java:581)

testConstructor_long_PeriodType4(org.joda.time.TestPeriod_Constructors)  Time elapsed: 0.001 sec  <<< ERROR!
java.lang.NullPointerException
	at org.joda.time.chrono.BaseChronology.get(BaseChronology.java:283)
	at org.joda.time.base.BasePeriod.<init>(BasePeriod.java:258)
	at org.joda.time.Period.<init>(Period.java:402)
	at org.joda.time.TestPeriod_Constructors.testConstructor_long_PeriodType4(TestPeriod_Constructors.java:257)

testConstructor_long_PeriodType_Chronology1(org.joda.time.TestPeriod_Constructors)  Time elapsed: 0.001 sec  <<< ERROR!
java.lang.NullPointerException
	at org.joda.time.chrono.BaseChronology.get(BaseChronology.java:283)
	at org.joda.time.base.BasePeriod.<init>(BasePeriod.java:258)
	at org.joda.time.Period.<init>(Period.java:444)
	at org.joda.time.TestPeriod_Constructors.testConstructor_long_PeriodType_Chronology1(TestPeriod_Constructors.java:327)

testConstructor_long_long_PeriodType3(org.joda.time.TestPeriod_Constructors)  Time elapsed: 0.001 sec  <<< ERROR!
java.lang.NullPointerException
	at org.joda.time.chrono.BaseChronology.get(BaseChronology.java:259)
	at org.joda.time.base.BasePeriod.<init>(BasePeriod.java:110)
	at org.joda.time.Period.<init>(Period.java:466)
	at org.joda.time.TestPeriod_Constructors.testConstructor_long_long_PeriodType3(TestPeriod_Constructors.java:526)

testConstructor_RI_RI_PeriodType3(org.joda.time.TestPeriod_Constructors)  Time elapsed: 0 sec  <<< ERROR!
java.lang.NullPointerException
	at org.joda.time.chrono.BaseChronology.get(BaseChronology.java:259)
	at org.joda.time.base.BasePeriod.<init>(BasePeriod.java:132)
	at org.joda.time.Period.<init>(Period.java:548)
	at org.joda.time.TestPeriod_Constructors.testConstructor_RI_RI_PeriodType3(TestPeriod_Constructors.java:758)

testNormalizedStandard_periodType_monthsWeeks(org.joda.time.TestPeriod_Basics)  Time elapsed: 0.002 sec  <<< ERROR!
java.lang.NullPointerException
	at org.joda.time.PeriodType.hashCode(PeriodType.java:211)
	at java.util.HashMap.hash(HashMap.java:362)
	at java.util.HashMap.getEntry(HashMap.java:462)
	at java.util.HashMap.get(HashMap.java:417)
	at org.joda.time.PeriodType.forFields(PeriodType.java:150)
	at org.joda.time.TestPeriod_Basics.testNormalizedStandard_periodType_monthsWeeks(TestPeriod_Basics.java:1552)

testConstructor_long_PeriodType4(org.joda.time.TestMutablePeriod_Constructors)  Time elapsed: 0 sec  <<< ERROR!
java.lang.NullPointerException
	at org.joda.time.chrono.BaseChronology.get(BaseChronology.java:283)
	at org.joda.time.base.BasePeriod.<init>(BasePeriod.java:258)
	at org.joda.time.MutablePeriod.<init>(MutablePeriod.java:200)
	at org.joda.time.TestMutablePeriod_Constructors.testConstructor_long_PeriodType4(TestMutablePeriod_Constructors.java:263)

testConstructor_long_PeriodType_Chronology1(org.joda.time.TestMutablePeriod_Constructors)  Time elapsed: 0.001 sec  <<< ERROR!
java.lang.NullPointerException
	at org.joda.time.chrono.BaseChronology.get(BaseChronology.java:283)
	at org.joda.time.base.BasePeriod.<init>(BasePeriod.java:258)
	at org.joda.time.MutablePeriod.<init>(MutablePeriod.java:242)
	at org.joda.time.TestMutablePeriod_Constructors.testConstructor_long_PeriodType_Chronology1(TestMutablePeriod_Constructors.java:333)

testConstructor_long_long_PeriodType3(org.joda.time.TestMutablePeriod_Constructors)  Time elapsed: 0 sec  <<< ERROR!
java.lang.NullPointerException
	at org.joda.time.chrono.BaseChronology.get(BaseChronology.java:259)
	at org.joda.time.base.BasePeriod.<init>(BasePeriod.java:110)
	at org.joda.time.MutablePeriod.<init>(MutablePeriod.java:264)
	at org.joda.time.TestMutablePeriod_Constructors.testConstructor_long_long_PeriodType3(TestMutablePeriod_Constructors.java:532)

testConstructor_RI_RI_PeriodType3(org.joda.time.TestMutablePeriod_Constructors)  Time elapsed: 0 sec  <<< ERROR!
java.lang.NullPointerException
	at org.joda.time.chrono.BaseChronology.get(BaseChronology.java:259)
	at org.joda.time.base.BasePeriod.<init>(BasePeriod.java:132)
	at org.joda.time.MutablePeriod.<init>(MutablePeriod.java:316)
	at org.joda.time.TestMutablePeriod_Constructors.testConstructor_RI_RI_PeriodType3(TestMutablePeriod_Constructors.java:716)

testSetPeriod_long_long_NoMillis(org.joda.time.TestMutablePeriod_Updates)  Time elapsed: 0.001 sec  <<< ERROR!
java.lang.NullPointerException
	at org.joda.time.chrono.BaseChronology.get(BaseChronology.java:259)
	at org.joda.time.MutablePeriod.setPeriod(MutablePeriod.java:548)
	at org.joda.time.MutablePeriod.setPeriod(MutablePeriod.java:535)
	at org.joda.time.TestMutablePeriod_Updates.testSetPeriod_long_long_NoMillis(TestMutablePeriod_Updates.java:711)

testSetPeriod_long_long_NoYears(org.joda.time.TestMutablePeriod_Updates)  Time elapsed: 0.001 sec  <<< ERROR!
java.lang.NullPointerException
	at org.joda.time.chrono.BaseChronology.get(BaseChronology.java:259)
	at org.joda.time.MutablePeriod.setPeriod(MutablePeriod.java:548)
	at org.joda.time.MutablePeriod.setPeriod(MutablePeriod.java:535)
	at org.joda.time.TestMutablePeriod_Updates.testSetPeriod_long_long_NoYears(TestMutablePeriod_Updates.java:606)

testSetPeriod_long_long_NoMonths(org.joda.time.TestMutablePeriod_Updates)  Time elapsed: 0.001 sec  <<< ERROR!
java.lang.NullPointerException
	at org.joda.time.chrono.BaseChronology.get(BaseChronology.java:259)
	at org.joda.time.MutablePeriod.setPeriod(MutablePeriod.java:548)
	at org.joda.time.MutablePeriod.setPeriod(MutablePeriod.java:535)
	at org.joda.time.TestMutablePeriod_Updates.testSetPeriod_long_long_NoMonths(TestMutablePeriod_Updates.java:621)

testSetPeriod_long_long_NoWeeks(org.joda.time.TestMutablePeriod_Updates)  Time elapsed: 0.001 sec  <<< ERROR!
java.lang.NullPointerException
	at org.joda.time.chrono.BaseChronology.get(BaseChronology.java:259)
	at org.joda.time.MutablePeriod.setPeriod(MutablePeriod.java:548)
	at org.joda.time.MutablePeriod.setPeriod(MutablePeriod.java:535)
	at org.joda.time.TestMutablePeriod_Updates.testSetPeriod_long_long_NoWeeks(TestMutablePeriod_Updates.java:636)

testSetPeriod_long_long_NoDays(org.joda.time.TestMutablePeriod_Updates)  Time elapsed: 0 sec  <<< ERROR!
java.lang.NullPointerException
	at org.joda.time.chrono.BaseChronology.get(BaseChronology.java:259)
	at org.joda.time.MutablePeriod.setPeriod(MutablePeriod.java:548)
	at org.joda.time.MutablePeriod.setPeriod(MutablePeriod.java:535)
	at org.joda.time.TestMutablePeriod_Updates.testSetPeriod_long_long_NoDays(TestMutablePeriod_Updates.java:651)

testSetPeriod_long_long_NoHours(org.joda.time.TestMutablePeriod_Updates)  Time elapsed: 0.001 sec  <<< ERROR!
java.lang.NullPointerException
	at org.joda.time.chrono.BaseChronology.get(BaseChronology.java:259)
	at org.joda.time.MutablePeriod.setPeriod(MutablePeriod.java:548)
	at org.joda.time.MutablePeriod.setPeriod(MutablePeriod.java:535)
	at org.joda.time.TestMutablePeriod_Updates.testSetPeriod_long_long_NoHours(TestMutablePeriod_Updates.java:666)

testSetPeriod_long_long_NoMinutes(org.joda.time.TestMutablePeriod_Updates)  Time elapsed: 0.001 sec  <<< ERROR!
java.lang.NullPointerException
	at org.joda.time.chrono.BaseChronology.get(BaseChronology.java:259)
	at org.joda.time.MutablePeriod.setPeriod(MutablePeriod.java:548)
	at org.joda.time.MutablePeriod.setPeriod(MutablePeriod.java:535)
	at org.joda.time.TestMutablePeriod_Updates.testSetPeriod_long_long_NoMinutes(TestMutablePeriod_Updates.java:681)

testSetPeriod_long_long_NoSeconds(org.joda.time.TestMutablePeriod_Updates)  Time elapsed: 0 sec  <<< ERROR!
java.lang.NullPointerException
	at org.joda.time.chrono.BaseChronology.get(BaseChronology.java:259)
	at org.joda.time.MutablePeriod.setPeriod(MutablePeriod.java:548)
	at org.joda.time.MutablePeriod.setPeriod(MutablePeriod.java:535)
	at org.joda.time.TestMutablePeriod_Updates.testSetPeriod_long_long_NoSeconds(TestMutablePeriod_Updates.java:696)

testForFields2(org.joda.time.TestPeriodType)  Time elapsed: 0.001 sec  <<< ERROR!
java.lang.NullPointerException
	at org.joda.time.PeriodType.hashCode(PeriodType.java:211)
	at java.util.HashMap.hash(HashMap.java:362)
	at java.util.HashMap.getEntry(HashMap.java:462)
	at java.util.HashMap.get(HashMap.java:417)
	at org.joda.time.PeriodType.forFields(PeriodType.java:150)
	at org.joda.time.TestPeriodType.testForFields2(TestPeriodType.java:488)

testForFields3(org.joda.time.TestPeriodType)  Time elapsed: 0 sec  <<< ERROR!
java.lang.NullPointerException
	at org.joda.time.PeriodType.hashCode(PeriodType.java:211)
	at java.util.HashMap.hash(HashMap.java:362)
	at java.util.HashMap.getEntry(HashMap.java:462)
	at java.util.HashMap.get(HashMap.java:417)
	at org.joda.time.PeriodType.forFields(PeriodType.java:150)
	at org.joda.time.TestPeriodType.testForFields3(TestPeriodType.java:508)

testForFields4(org.joda.time.TestPeriodType)  Time elapsed: 0.001 sec  <<< ERROR!
java.lang.NullPointerException
	at org.joda.time.PeriodType.hashCode(PeriodType.java:211)
	at java.util.HashMap.hash(HashMap.java:362)
	at java.util.HashMap.getEntry(HashMap.java:462)
	at java.util.HashMap.get(HashMap.java:417)
	at org.joda.time.PeriodType.forFields(PeriodType.java:150)
	at org.joda.time.TestPeriodType.testForFields4(TestPeriodType.java:534)

testForFields7(org.joda.time.TestPeriodType)  Time elapsed: 0 sec  <<< ERROR!
java.lang.NullPointerException
	at org.joda.time.PeriodType.hashCode(PeriodType.java:211)
	at java.util.HashMap.hash(HashMap.java:362)
	at java.util.HashMap.getEntry(HashMap.java:462)
	at java.util.HashMap.get(HashMap.java:417)
	at org.joda.time.PeriodType.forFields(PeriodType.java:150)
	at org.joda.time.TestPeriodType.testForFields7(TestPeriodType.java:607)

testMaskYears(org.joda.time.TestPeriodType)  Time elapsed: 0 sec  <<< FAILURE!
junit.framework.AssertionFailedError: expected:<7> but was:<9>
	at junit.framework.Assert.fail(Assert.java:47)
	at junit.framework.Assert.failNotEquals(Assert.java:280)
	at junit.framework.Assert.assertEquals(Assert.java:64)
	at junit.framework.Assert.assertEquals(Assert.java:198)
	at junit.framework.Assert.assertEquals(Assert.java:204)
	at org.joda.time.TestPeriodType.testMaskYears(TestPeriodType.java:617)

testMaskMonths(org.joda.time.TestPeriodType)  Time elapsed: 0 sec  <<< FAILURE!
junit.framework.AssertionFailedError: expected:<7> but was:<9>
	at junit.framework.Assert.fail(Assert.java:47)
	at junit.framework.Assert.failNotEquals(Assert.java:280)
	at junit.framework.Assert.assertEquals(Assert.java:64)
	at junit.framework.Assert.assertEquals(Assert.java:198)
	at junit.framework.Assert.assertEquals(Assert.java:204)
	at org.joda.time.TestPeriodType.testMaskMonths(TestPeriodType.java:639)

testMaskWeeks(org.joda.time.TestPeriodType)  Time elapsed: 0.001 sec  <<< FAILURE!
junit.framework.AssertionFailedError: expected:<7> but was:<9>
	at junit.framework.Assert.fail(Assert.java:47)
	at junit.framework.Assert.failNotEquals(Assert.java:280)
	at junit.framework.Assert.assertEquals(Assert.java:64)
	at junit.framework.Assert.assertEquals(Assert.java:198)
	at junit.framework.Assert.assertEquals(Assert.java:204)
	at org.joda.time.TestPeriodType.testMaskWeeks(TestPeriodType.java:661)

testMaskDays(org.joda.time.TestPeriodType)  Time elapsed: 0 sec  <<< FAILURE!
junit.framework.AssertionFailedError: expected:<7> but was:<9>
	at junit.framework.Assert.fail(Assert.java:47)
	at junit.framework.Assert.failNotEquals(Assert.java:280)
	at junit.framework.Assert.assertEquals(Assert.java:64)
	at junit.framework.Assert.assertEquals(Assert.java:198)
	at junit.framework.Assert.assertEquals(Assert.java:204)
	at org.joda.time.TestPeriodType.testMaskDays(TestPeriodType.java:683)

testMaskHours(org.joda.time.TestPeriodType)  Time elapsed: 0.001 sec  <<< FAILURE!
junit.framework.AssertionFailedError: expected:<7> but was:<9>
	at junit.framework.Assert.fail(Assert.java:47)
	at junit.framework.Assert.failNotEquals(Assert.java:280)
	at junit.framework.Assert.assertEquals(Assert.java:64)
	at junit.framework.Assert.assertEquals(Assert.java:198)
	at junit.framework.Assert.assertEquals(Assert.java:204)
	at org.joda.time.TestPeriodType.testMaskHours(TestPeriodType.java:705)

testMaskMinutes(org.joda.time.TestPeriodType)  Time elapsed: 0 sec  <<< FAILURE!
junit.framework.AssertionFailedError: expected:<7> but was:<9>
	at junit.framework.Assert.fail(Assert.java:47)
	at junit.framework.Assert.failNotEquals(Assert.java:280)
	at junit.framework.Assert.assertEquals(Assert.java:64)
	at junit.framework.Assert.assertEquals(Assert.java:198)
	at junit.framework.Assert.assertEquals(Assert.java:204)
	at org.joda.time.TestPeriodType.testMaskMinutes(TestPeriodType.java:727)

testMaskSeconds(org.joda.time.TestPeriodType)  Time elapsed: 0 sec  <<< FAILURE!
junit.framework.AssertionFailedError: expected:<7> but was:<9>
	at junit.framework.Assert.fail(Assert.java:47)
	at junit.framework.Assert.failNotEquals(Assert.java:280)
	at junit.framework.Assert.assertEquals(Assert.java:64)
	at junit.framework.Assert.assertEquals(Assert.java:198)
	at junit.framework.Assert.assertEquals(Assert.java:204)
	at org.joda.time.TestPeriodType.testMaskSeconds(TestPeriodType.java:749)

testMaskMillis(org.joda.time.TestPeriodType)  Time elapsed: 0 sec  <<< FAILURE!
junit.framework.AssertionFailedError: expected:<7> but was:<9>
	at junit.framework.Assert.fail(Assert.java:47)
	at junit.framework.Assert.failNotEquals(Assert.java:280)
	at junit.framework.Assert.assertEquals(Assert.java:64)
	at junit.framework.Assert.assertEquals(Assert.java:198)
	at junit.framework.Assert.assertEquals(Assert.java:204)
	at org.joda.time.TestPeriodType.testMaskMillis(TestPeriodType.java:771)

testMaskHoursMinutesSeconds(org.joda.time.TestPeriodType)  Time elapsed: 0 sec  <<< FAILURE!
junit.framework.AssertionFailedError: expected:<5> but was:<11>
	at junit.framework.Assert.fail(Assert.java:47)
	at junit.framework.Assert.failNotEquals(Assert.java:280)
	at junit.framework.Assert.assertEquals(Assert.java:64)
	at junit.framework.Assert.assertEquals(Assert.java:198)
	at junit.framework.Assert.assertEquals(Assert.java:204)
	at org.joda.time.TestPeriodType.testMaskHoursMinutesSeconds(TestPeriodType.java:793)

testHashCode(org.joda.time.TestPeriodType)  Time elapsed: 0.001 sec  <<< ERROR!
java.lang.NullPointerException
	at org.joda.time.PeriodType.hashCode(PeriodType.java:211)
	at org.joda.time.TestPeriodType.testHashCode(TestPeriodType.java:887)


Results :

Failed tests: 
  org.joda.time.TestPeriodType#testMaskDays AssertionFailedError expected:<7> bu...
  org.joda.time.TestPeriodType#testMaskHours AssertionFailedError expected:<7> b...
  org.joda.time.TestPeriodType#testMaskHoursMinutesSeconds AssertionFailedError ...
  org.joda.time.TestPeriodType#testMaskMillis AssertionFailedError expected:<7> ...
  org.joda.time.TestPeriodType#testMaskMinutes AssertionFailedError expected:<7>...
  org.joda.time.TestPeriodType#testMaskMonths AssertionFailedError expected:<7> ...
  org.joda.time.TestPeriodType#testMaskSeconds AssertionFailedError expected:<7>...
  org.joda.time.TestPeriodType#testMaskWeeks AssertionFailedError expected:<7> b...
  org.joda.time.TestPeriodType#testMaskYears AssertionFailedError expected:<7> b...
Tests in error: 
  org.joda.time.TestDuration_Basics#testToPeriodFrom_PeriodType NullPointerException
  org.joda.time.TestDuration_Basics#testToPeriodTo_PeriodType NullPointerException
  org.joda.time.TestDuration_Basics#testToPeriod_PeriodType NullPointerException
  org.joda.time.TestDuration_Basics#testToPeriod_PeriodType_Chronology NullPointerException
  org.joda.time.TestMutablePeriod_Constructors#testConstructor_RI_RI_PeriodType3 NullPointerException
  org.joda.time.TestMutablePeriod_Constructors#testConstructor_long_PeriodType4 NullPointerException
  org.joda.time.TestMutablePeriod_Constructors#testConstructor_long_PeriodType_Chronology1 NullPointerException
  org.joda.time.TestMutablePeriod_Constructors#testConstructor_long_long_PeriodType3 NullPointerException
  org.joda.time.TestMutablePeriod_Updates#testSetPeriod_long_long_NoDays NullPointerException
  org.joda.time.TestMutablePeriod_Updates#testSetPeriod_long_long_NoHours NullPointerException
  org.joda.time.TestMutablePeriod_Updates#testSetPeriod_long_long_NoMillis NullPointerException
  org.joda.time.TestMutablePeriod_Updates#testSetPeriod_long_long_NoMinutes NullPointerException
  org.joda.time.TestMutablePeriod_Updates#testSetPeriod_long_long_NoMonths NullPointerException
  org.joda.time.TestMutablePeriod_Updates#testSetPeriod_long_long_NoSeconds NullPointerException
  org.joda.time.TestMutablePeriod_Updates#testSetPeriod_long_long_NoWeeks NullPointerException
  org.joda.time.TestMutablePeriod_Updates#testSetPeriod_long_long_NoYears NullPointerException
  org.joda.time.TestPeriodType#testForFields2 NullPointerException
  org.joda.time.TestPeriodType#testForFields3 NullPointerException
  org.joda.time.TestPeriodType#testForFields4 NullPointerException
  org.joda.time.TestPeriodType#testForFields7 NullPointerException
  org.joda.time.TestPeriodType#testHashCode NullPointerException
  org.joda.time.TestPeriod_Basics#testNormalizedStandard_periodType_monthsWeeks NullPointerException
  org.joda.time.TestPeriod_Constructors#testConstructor_RI_RI_PeriodType3 NullPointerException
  org.joda.time.TestPeriod_Constructors#testConstructor_long_PeriodType4 NullPointerException
  org.joda.time.TestPeriod_Constructors#testConstructor_long_PeriodType_Chronology1 NullPointerException
  org.joda.time.TestPeriod_Constructors#testConstructor_long_long_PeriodType3 NullPointerException

Tests run: 4157, Failures: 9, Errors: 26, Skipped: 0

[INFO] ------------------------------------------------------------------------
[INFO] BUILD FAILURE
[INFO] ------------------------------------------------------------------------
[INFO] Total time: 15.872s
[INFO] Finished at: Wed Aug 05 18:56:10 BST 2015
[INFO] Final Memory: 9M/211M
[INFO] ------------------------------------------------------------------------
[ERROR] Failed to execute goal org.apache.maven.plugins:maven-surefire-plugin:2.18.1:test (default-test) on project joda-time: There are test failures.
[ERROR] 
[ERROR] Please refer to /home/perham/Study/LittleDarwin/Cases/joda-time-2.8.1/target/surefire-reports for the individual test results.
[ERROR] -> [Help 1]
[ERROR] 
[ERROR] To see the full stack trace of the errors, re-run Maven with the -e switch.
[ERROR] Re-run Maven using the -X switch to enable full debug logging.
[ERROR] 
[ERROR] For more information about the errors and possible solutions, please read the following articles:
[ERROR] [Help 1] http://cwiki.apache.org/confluence/display/MAVEN/MojoFailureException
