[INFO] Scanning for projects...
[INFO]                                                                         
[INFO] ------------------------------------------------------------------------
[INFO] Building Joda-Time 2.8.1
[INFO] ------------------------------------------------------------------------
[INFO] 
[INFO] --- maven-resources-plugin:2.7:resources (default-resources) @ joda-time ---
[INFO] Using 'UTF-8' encoding to copy filtered resources.
[INFO] Copying 2 resources to META-INF
[INFO] Copying 10 resources
[INFO] 
[INFO] --- maven-compiler-plugin:3.3:compile (default-compile) @ joda-time ---
[INFO] Changes detected - recompiling the module!
[INFO] Compiling 166 source files to /home/perham/Study/LittleDarwin/Cases/joda-time-2.8.1/target/classes
[INFO] 
[INFO] --- exec-maven-plugin:1.4.0:java (compile-tzdb) @ joda-time ---
Writing zoneinfo files
Writing ZoneInfoMap
[INFO] 
[INFO] --- maven-resources-plugin:2.7:testResources (default-testResources) @ joda-time ---
[INFO] Using 'UTF-8' encoding to copy filtered resources.
[INFO] Copying 34 resources
[INFO] 
[INFO] --- maven-compiler-plugin:3.3:testCompile (default-testCompile) @ joda-time ---
[INFO] Nothing to compile - all classes are up to date
[INFO] 
[INFO] --- maven-surefire-plugin:2.18.1:test (default-test) @ joda-time ---
[INFO] Surefire report directory: /home/perham/Study/LittleDarwin/Cases/joda-time-2.8.1/target/surefire-reports

-------------------------------------------------------
 T E S T S
-------------------------------------------------------
Running org.joda.time.TestAllPackages

TestBuddhistChronology.testCalendar

TestCopticChronology.testCalendar

TestEthiopicChronology.testCalendar

TestIslamicChronology.testCalendar

Testing Gregorian chronology over 1000 iterations
100% complete (i=1000)

Testing Julian chronology over 1000 iterations
100% complete (i=1000)
Writing zoneinfo files
Writing ZoneInfoMap
Tests run: 4157, Failures: 0, Errors: 22, Skipped: 0, Time elapsed: 5.262 sec <<< FAILURE! - in org.joda.time.TestAllPackages
testNormalizedStandard_periodType_monthsWeeks(org.joda.time.TestPeriod_Basics)  Time elapsed: 0.004 sec  <<< ERROR!
java.lang.ArrayIndexOutOfBoundsException: 7
	at org.joda.time.PeriodType.withFieldRemoved(PeriodType.java:196)
	at org.joda.time.PeriodType.withYearsRemoved(PeriodType.java:182)
	at org.joda.time.PeriodType.forFields(PeriodType.java:139)
	at org.joda.time.TestPeriod_Basics.testNormalizedStandard_periodType_monthsWeeks(TestPeriod_Basics.java:1552)

testSetPeriod_long_long_NoYears(org.joda.time.TestMutablePeriod_Updates)  Time elapsed: 0.001 sec  <<< ERROR!
java.lang.ArrayIndexOutOfBoundsException: 7
	at org.joda.time.PeriodType.withFieldRemoved(PeriodType.java:196)
	at org.joda.time.PeriodType.withYearsRemoved(PeriodType.java:182)
	at org.joda.time.TestMutablePeriod_Updates.testSetPeriod_long_long_NoYears(TestMutablePeriod_Updates.java:603)

testSetPeriod_long_long_NoMonths(org.joda.time.TestMutablePeriod_Updates)  Time elapsed: 0.001 sec  <<< ERROR!
java.lang.ArrayIndexOutOfBoundsException: 7
	at org.joda.time.PeriodType.withFieldRemoved(PeriodType.java:196)
	at org.joda.time.PeriodType.withMonthsRemoved(PeriodType.java:183)
	at org.joda.time.TestMutablePeriod_Updates.testSetPeriod_long_long_NoMonths(TestMutablePeriod_Updates.java:618)

testSetPeriod_long_long_NoWeeks(org.joda.time.TestMutablePeriod_Updates)  Time elapsed: 0.001 sec  <<< ERROR!
java.lang.ArrayIndexOutOfBoundsException: 7
	at org.joda.time.PeriodType.withFieldRemoved(PeriodType.java:196)
	at org.joda.time.PeriodType.withWeeksRemoved(PeriodType.java:184)
	at org.joda.time.TestMutablePeriod_Updates.testSetPeriod_long_long_NoWeeks(TestMutablePeriod_Updates.java:633)

testSetPeriod_long_long_NoDays(org.joda.time.TestMutablePeriod_Updates)  Time elapsed: 0.001 sec  <<< ERROR!
java.lang.ArrayIndexOutOfBoundsException: 7
	at org.joda.time.PeriodType.withFieldRemoved(PeriodType.java:196)
	at org.joda.time.PeriodType.withDaysRemoved(PeriodType.java:185)
	at org.joda.time.TestMutablePeriod_Updates.testSetPeriod_long_long_NoDays(TestMutablePeriod_Updates.java:648)

testSetPeriod_long_long_NoHours(org.joda.time.TestMutablePeriod_Updates)  Time elapsed: 0.002 sec  <<< ERROR!
java.lang.ArrayIndexOutOfBoundsException: 7
	at org.joda.time.PeriodType.withFieldRemoved(PeriodType.java:196)
	at org.joda.time.PeriodType.withHoursRemoved(PeriodType.java:186)
	at org.joda.time.TestMutablePeriod_Updates.testSetPeriod_long_long_NoHours(TestMutablePeriod_Updates.java:663)

testSetPeriod_long_long_NoMinutes(org.joda.time.TestMutablePeriod_Updates)  Time elapsed: 0 sec  <<< ERROR!
java.lang.ArrayIndexOutOfBoundsException: 7
	at org.joda.time.PeriodType.withFieldRemoved(PeriodType.java:196)
	at org.joda.time.PeriodType.withMinutesRemoved(PeriodType.java:187)
	at org.joda.time.TestMutablePeriod_Updates.testSetPeriod_long_long_NoMinutes(TestMutablePeriod_Updates.java:678)

testSetPeriod_long_long_NoSeconds(org.joda.time.TestMutablePeriod_Updates)  Time elapsed: 0.001 sec  <<< ERROR!
java.lang.ArrayIndexOutOfBoundsException: 8
	at org.joda.time.PeriodType.withFieldRemoved(PeriodType.java:196)
	at org.joda.time.PeriodType.withSecondsRemoved(PeriodType.java:188)
	at org.joda.time.TestMutablePeriod_Updates.testSetPeriod_long_long_NoSeconds(TestMutablePeriod_Updates.java:693)

testForFields2(org.joda.time.TestPeriodType)  Time elapsed: 0.001 sec  <<< ERROR!
java.lang.ArrayIndexOutOfBoundsException: 7
	at org.joda.time.PeriodType.withFieldRemoved(PeriodType.java:196)
	at org.joda.time.PeriodType.withMonthsRemoved(PeriodType.java:183)
	at org.joda.time.PeriodType.forFields(PeriodType.java:140)
	at org.joda.time.TestPeriodType.testForFields2(TestPeriodType.java:488)

testForFields3(org.joda.time.TestPeriodType)  Time elapsed: 0 sec  <<< ERROR!
java.lang.ArrayIndexOutOfBoundsException: 7
	at org.joda.time.PeriodType.withFieldRemoved(PeriodType.java:196)
	at org.joda.time.PeriodType.withYearsRemoved(PeriodType.java:182)
	at org.joda.time.PeriodType.forFields(PeriodType.java:139)
	at org.joda.time.TestPeriodType.testForFields3(TestPeriodType.java:508)

testForFields4(org.joda.time.TestPeriodType)  Time elapsed: 0.001 sec  <<< ERROR!
java.lang.ArrayIndexOutOfBoundsException: 7
	at org.joda.time.PeriodType.withFieldRemoved(PeriodType.java:196)
	at org.joda.time.PeriodType.withYearsRemoved(PeriodType.java:182)
	at org.joda.time.PeriodType.forFields(PeriodType.java:139)
	at org.joda.time.TestPeriodType.testForFields4(TestPeriodType.java:534)

testForFields5(org.joda.time.TestPeriodType)  Time elapsed: 0 sec  <<< ERROR!
java.lang.ArrayIndexOutOfBoundsException: 7
	at org.joda.time.PeriodType.withFieldRemoved(PeriodType.java:196)
	at org.joda.time.PeriodType.withYearsRemoved(PeriodType.java:182)
	at org.joda.time.PeriodType.forFields(PeriodType.java:139)
	at org.joda.time.TestPeriodType.testForFields5(TestPeriodType.java:545)

testForFields7(org.joda.time.TestPeriodType)  Time elapsed: 0 sec  <<< ERROR!
java.lang.ArrayIndexOutOfBoundsException: 7
	at org.joda.time.PeriodType.withFieldRemoved(PeriodType.java:196)
	at org.joda.time.PeriodType.withYearsRemoved(PeriodType.java:182)
	at org.joda.time.PeriodType.forFields(PeriodType.java:139)
	at org.joda.time.TestPeriodType.testForFields7(TestPeriodType.java:607)

testMaskYears(org.joda.time.TestPeriodType)  Time elapsed: 0.001 sec  <<< ERROR!
java.lang.ArrayIndexOutOfBoundsException: 7
	at org.joda.time.PeriodType.withFieldRemoved(PeriodType.java:196)
	at org.joda.time.PeriodType.withYearsRemoved(PeriodType.java:182)
	at org.joda.time.TestPeriodType.testMaskYears(TestPeriodType.java:616)

testMaskMonths(org.joda.time.TestPeriodType)  Time elapsed: 0 sec  <<< ERROR!
java.lang.ArrayIndexOutOfBoundsException: 7
	at org.joda.time.PeriodType.withFieldRemoved(PeriodType.java:196)
	at org.joda.time.PeriodType.withMonthsRemoved(PeriodType.java:183)
	at org.joda.time.TestPeriodType.testMaskMonths(TestPeriodType.java:638)

testMaskWeeks(org.joda.time.TestPeriodType)  Time elapsed: 0.001 sec  <<< ERROR!
java.lang.ArrayIndexOutOfBoundsException: 7
	at org.joda.time.PeriodType.withFieldRemoved(PeriodType.java:196)
	at org.joda.time.PeriodType.withWeeksRemoved(PeriodType.java:184)
	at org.joda.time.TestPeriodType.testMaskWeeks(TestPeriodType.java:660)

testMaskDays(org.joda.time.TestPeriodType)  Time elapsed: 0 sec  <<< ERROR!
java.lang.ArrayIndexOutOfBoundsException: 7
	at org.joda.time.PeriodType.withFieldRemoved(PeriodType.java:196)
	at org.joda.time.PeriodType.withDaysRemoved(PeriodType.java:185)
	at org.joda.time.TestPeriodType.testMaskDays(TestPeriodType.java:682)

testMaskHours(org.joda.time.TestPeriodType)  Time elapsed: 0.001 sec  <<< ERROR!
java.lang.ArrayIndexOutOfBoundsException: 7
	at org.joda.time.PeriodType.withFieldRemoved(PeriodType.java:196)
	at org.joda.time.PeriodType.withHoursRemoved(PeriodType.java:186)
	at org.joda.time.TestPeriodType.testMaskHours(TestPeriodType.java:704)

testMaskMinutes(org.joda.time.TestPeriodType)  Time elapsed: 0 sec  <<< ERROR!
java.lang.ArrayIndexOutOfBoundsException: 7
	at org.joda.time.PeriodType.withFieldRemoved(PeriodType.java:196)
	at org.joda.time.PeriodType.withMinutesRemoved(PeriodType.java:187)
	at org.joda.time.TestPeriodType.testMaskMinutes(TestPeriodType.java:726)

testMaskSeconds(org.joda.time.TestPeriodType)  Time elapsed: 0 sec  <<< ERROR!
java.lang.ArrayIndexOutOfBoundsException: 8
	at org.joda.time.PeriodType.withFieldRemoved(PeriodType.java:196)
	at org.joda.time.PeriodType.withSecondsRemoved(PeriodType.java:188)
	at org.joda.time.TestPeriodType.testMaskSeconds(TestPeriodType.java:748)

testMaskHoursMinutesSeconds(org.joda.time.TestPeriodType)  Time elapsed: 0 sec  <<< ERROR!
java.lang.ArrayIndexOutOfBoundsException: 7
	at org.joda.time.PeriodType.withFieldRemoved(PeriodType.java:196)
	at org.joda.time.PeriodType.withHoursRemoved(PeriodType.java:186)
	at org.joda.time.TestPeriodType.testMaskHoursMinutesSeconds(TestPeriodType.java:792)

testMaskTwice1(org.joda.time.TestPeriodType)  Time elapsed: 0.001 sec  <<< ERROR!
java.lang.ArrayIndexOutOfBoundsException: 7
	at org.joda.time.PeriodType.withFieldRemoved(PeriodType.java:196)
	at org.joda.time.PeriodType.withYearsRemoved(PeriodType.java:182)
	at org.joda.time.TestPeriodType.testMaskTwice1(TestPeriodType.java:812)


Results :

Tests in error: 
  org.joda.time.TestMutablePeriod_Updates#testSetPeriod_long_long_NoDays ArrayIndexOutOfBoundsException
  org.joda.time.TestMutablePeriod_Updates#testSetPeriod_long_long_NoHours ArrayIndexOutOfBoundsException
  org.joda.time.TestMutablePeriod_Updates#testSetPeriod_long_long_NoMinutes ArrayIndexOutOfBoundsException
  org.joda.time.TestMutablePeriod_Updates#testSetPeriod_long_long_NoMonths ArrayIndexOutOfBoundsException
  org.joda.time.TestMutablePeriod_Updates#testSetPeriod_long_long_NoSeconds ArrayIndexOutOfBoundsException
  org.joda.time.TestMutablePeriod_Updates#testSetPeriod_long_long_NoWeeks ArrayIndexOutOfBoundsException
  org.joda.time.TestMutablePeriod_Updates#testSetPeriod_long_long_NoYears ArrayIndexOutOfBoundsException
  org.joda.time.TestPeriodType#testForFields2 ArrayIndexOutOfBoundsException 7
  org.joda.time.TestPeriodType#testForFields3 ArrayIndexOutOfBoundsException 7
  org.joda.time.TestPeriodType#testForFields4 ArrayIndexOutOfBoundsException 7
  org.joda.time.TestPeriodType#testForFields5 ArrayIndexOutOfBoundsException 7
  org.joda.time.TestPeriodType#testForFields7 ArrayIndexOutOfBoundsException 7
  org.joda.time.TestPeriodType#testMaskDays ArrayIndexOutOfBoundsException 7
  org.joda.time.TestPeriodType#testMaskHours ArrayIndexOutOfBoundsException 7
  org.joda.time.TestPeriodType#testMaskHoursMinutesSeconds ArrayIndexOutOfBoundsException
  org.joda.time.TestPeriodType#testMaskMinutes ArrayIndexOutOfBoundsException 7
  org.joda.time.TestPeriodType#testMaskMonths ArrayIndexOutOfBoundsException 7
  org.joda.time.TestPeriodType#testMaskSeconds ArrayIndexOutOfBoundsException 8
  org.joda.time.TestPeriodType#testMaskTwice1 ArrayIndexOutOfBoundsException 7
  org.joda.time.TestPeriodType#testMaskWeeks ArrayIndexOutOfBoundsException 7
  org.joda.time.TestPeriodType#testMaskYears ArrayIndexOutOfBoundsException 7
  org.joda.time.TestPeriod_Basics#testNormalizedStandard_periodType_monthsWeeks ArrayIndexOutOfBoundsException

Tests run: 4157, Failures: 0, Errors: 22, Skipped: 0

[INFO] ------------------------------------------------------------------------
[INFO] BUILD FAILURE
[INFO] ------------------------------------------------------------------------
[INFO] Total time: 15.376s
[INFO] Finished at: Wed Aug 05 18:55:52 BST 2015
[INFO] Final Memory: 9M/213M
[INFO] ------------------------------------------------------------------------
[ERROR] Failed to execute goal org.apache.maven.plugins:maven-surefire-plugin:2.18.1:test (default-test) on project joda-time: There are test failures.
[ERROR] 
[ERROR] Please refer to /home/perham/Study/LittleDarwin/Cases/joda-time-2.8.1/target/surefire-reports for the individual test results.
[ERROR] -> [Help 1]
[ERROR] 
[ERROR] To see the full stack trace of the errors, re-run Maven with the -e switch.
[ERROR] Re-run Maven using the -X switch to enable full debug logging.
[ERROR] 
[ERROR] For more information about the errors and possible solutions, please read the following articles:
[ERROR] [Help 1] http://cwiki.apache.org/confluence/display/MAVEN/MojoFailureException
