[INFO] Scanning for projects...
[INFO]                                                                         
[INFO] ------------------------------------------------------------------------
[INFO] Building Joda-Time 2.8.1
[INFO] ------------------------------------------------------------------------
[INFO] 
[INFO] --- maven-resources-plugin:2.7:resources (default-resources) @ joda-time ---
[INFO] Using 'UTF-8' encoding to copy filtered resources.
[INFO] Copying 2 resources to META-INF
[INFO] Copying 10 resources
[INFO] 
[INFO] --- maven-compiler-plugin:3.3:compile (default-compile) @ joda-time ---
[INFO] Changes detected - recompiling the module!
[INFO] Compiling 166 source files to /home/perham/Study/LittleDarwin/Cases/joda-time-2.8.1/target/classes
[INFO] 
[INFO] --- exec-maven-plugin:1.4.0:java (compile-tzdb) @ joda-time ---
Writing zoneinfo files
Writing ZoneInfoMap
[INFO] 
[INFO] --- maven-resources-plugin:2.7:testResources (default-testResources) @ joda-time ---
[INFO] Using 'UTF-8' encoding to copy filtered resources.
[INFO] Copying 34 resources
[INFO] 
[INFO] --- maven-compiler-plugin:3.3:testCompile (default-testCompile) @ joda-time ---
[INFO] Nothing to compile - all classes are up to date
[INFO] 
[INFO] --- maven-surefire-plugin:2.18.1:test (default-test) @ joda-time ---
[INFO] Surefire report directory: /home/perham/Study/LittleDarwin/Cases/joda-time-2.8.1/target/surefire-reports

-------------------------------------------------------
 T E S T S
-------------------------------------------------------
Running org.joda.time.TestAllPackages

TestBuddhistChronology.testCalendar

TestCopticChronology.testCalendar

TestEthiopicChronology.testCalendar

TestIslamicChronology.testCalendar

Testing Gregorian chronology over 1000 iterations
100% complete (i=1000)

Testing Julian chronology over 1000 iterations
100% complete (i=1000)
Writing zoneinfo files
Writing ZoneInfoMap
Tests run: 4157, Failures: 31, Errors: 25, Skipped: 0, Time elapsed: 5.395 sec <<< FAILURE! - in org.joda.time.TestAllPackages
testConstructor_8int__PeriodType3(org.joda.time.TestPeriod_Constructors)  Time elapsed: 0.004 sec  <<< FAILURE!
junit.framework.AssertionFailedError
	at junit.framework.Assert.fail(Assert.java:47)
	at junit.framework.Assert.fail(Assert.java:53)
	at org.joda.time.TestPeriod_Constructors.testConstructor_8int__PeriodType3(TestPeriod_Constructors.java:457)

testWithFieldAdded3(org.joda.time.TestPeriod_Basics)  Time elapsed: 0.001 sec  <<< FAILURE!
junit.framework.AssertionFailedError
	at junit.framework.Assert.fail(Assert.java:47)
	at junit.framework.Assert.fail(Assert.java:53)
	at org.joda.time.TestPeriod_Basics.testWithFieldAdded3(TestPeriod_Basics.java:652)

testGet(org.joda.time.TestPeriod_Basics)  Time elapsed: 0.003 sec  <<< FAILURE!
junit.framework.AssertionFailedError: expected:<0> but was:<4>
	at junit.framework.Assert.fail(Assert.java:47)
	at junit.framework.Assert.failNotEquals(Assert.java:280)
	at junit.framework.Assert.assertEquals(Assert.java:64)
	at junit.framework.Assert.assertEquals(Assert.java:198)
	at junit.framework.Assert.assertEquals(Assert.java:204)
	at org.joda.time.TestPeriod_Basics.testGet(TestPeriod_Basics.java:186)

testWithPeriodType3(org.joda.time.TestPeriod_Basics)  Time elapsed: 0.002 sec  <<< FAILURE!
junit.framework.AssertionFailedError
	at junit.framework.Assert.fail(Assert.java:47)
	at junit.framework.Assert.fail(Assert.java:53)
	at org.joda.time.TestPeriod_Basics.testWithPeriodType3(TestPeriod_Basics.java:543)

testWithPeriodType5(org.joda.time.TestPeriod_Basics)  Time elapsed: 0.002 sec  <<< FAILURE!
junit.framework.AssertionFailedError: expected:<2> but was:<0>
	at junit.framework.Assert.fail(Assert.java:47)
	at junit.framework.Assert.failNotEquals(Assert.java:280)
	at junit.framework.Assert.assertEquals(Assert.java:64)
	at junit.framework.Assert.assertEquals(Assert.java:198)
	at junit.framework.Assert.assertEquals(Assert.java:204)
	at org.joda.time.TestPeriod_Basics.testWithPeriodType5(TestPeriod_Basics.java:560)

testWithFields1(org.joda.time.TestPeriod_Basics)  Time elapsed: 0.001 sec  <<< ERROR!
java.lang.ArrayIndexOutOfBoundsException: 1
	at org.joda.time.base.BasePeriod.checkAndUpdate(BasePeriod.java:397)
	at org.joda.time.base.BasePeriod.setPeriodInternal(BasePeriod.java:454)
	at org.joda.time.base.BasePeriod.<init>(BasePeriod.java:93)
	at org.joda.time.Period.<init>(Period.java:352)
	at org.joda.time.TestPeriod_Basics.testWithFields1(TestPeriod_Basics.java:572)

testWithFields3(org.joda.time.TestPeriod_Basics)  Time elapsed: 0.002 sec  <<< ERROR!
java.lang.ArrayIndexOutOfBoundsException: 1
	at org.joda.time.base.BasePeriod.checkAndUpdate(BasePeriod.java:397)
	at org.joda.time.base.BasePeriod.setPeriodInternal(BasePeriod.java:454)
	at org.joda.time.base.BasePeriod.<init>(BasePeriod.java:93)
	at org.joda.time.Period.<init>(Period.java:352)
	at org.joda.time.TestPeriod_Basics.testWithFields3(TestPeriod_Basics.java:590)

testWithField3(org.joda.time.TestPeriod_Basics)  Time elapsed: 0 sec  <<< FAILURE!
junit.framework.AssertionFailedError
	at junit.framework.Assert.fail(Assert.java:47)
	at junit.framework.Assert.fail(Assert.java:53)
	at org.joda.time.TestPeriod_Basics.testWithField3(TestPeriod_Basics.java:621)

testWithField4(org.joda.time.TestPeriod_Basics)  Time elapsed: 0.001 sec  <<< FAILURE!
junit.framework.AssertionFailedError: expected:<P6Y6M6W6DT5H6M7.008S> but was:<PT5H7.008S>
	at junit.framework.Assert.fail(Assert.java:47)
	at junit.framework.Assert.failNotEquals(Assert.java:280)
	at junit.framework.Assert.assertEquals(Assert.java:64)
	at junit.framework.Assert.assertEquals(Assert.java:71)
	at org.joda.time.TestPeriod_Basics.testWithField4(TestPeriod_Basics.java:628)

testPlus(org.joda.time.TestPeriod_Basics)  Time elapsed: 0 sec  <<< ERROR!
java.lang.ArrayIndexOutOfBoundsException: 1
	at org.joda.time.base.BasePeriod.checkAndUpdate(BasePeriod.java:397)
	at org.joda.time.base.BasePeriod.setPeriodInternal(BasePeriod.java:454)
	at org.joda.time.base.BasePeriod.<init>(BasePeriod.java:93)
	at org.joda.time.Period.<init>(Period.java:352)
	at org.joda.time.TestPeriod_Basics.testPlus(TestPeriod_Basics.java:713)

testMinus(org.joda.time.TestPeriod_Basics)  Time elapsed: 0 sec  <<< ERROR!
java.lang.ArrayIndexOutOfBoundsException: 1
	at org.joda.time.base.BasePeriod.checkAndUpdate(BasePeriod.java:397)
	at org.joda.time.base.BasePeriod.setPeriodInternal(BasePeriod.java:454)
	at org.joda.time.base.BasePeriod.<init>(BasePeriod.java:93)
	at org.joda.time.Period.<init>(Period.java:352)
	at org.joda.time.TestPeriod_Basics.testMinus(TestPeriod_Basics.java:787)

testNormalizedStandard_periodType_yearMonthWeekDay(org.joda.time.TestPeriod_Basics)  Time elapsed: 0 sec  <<< FAILURE!
junit.framework.AssertionFailedError: expected:<P2Y19D> but was:<P2Y3M3W19D>
	at junit.framework.Assert.fail(Assert.java:47)
	at junit.framework.Assert.failNotEquals(Assert.java:280)
	at junit.framework.Assert.assertEquals(Assert.java:64)
	at junit.framework.Assert.assertEquals(Assert.java:71)
	at org.joda.time.TestPeriod_Basics.testNormalizedStandard_periodType_yearMonthWeekDay(TestPeriod_Basics.java:1510)

testNormalizedStandard_periodType_yearMonthDay(org.joda.time.TestPeriod_Basics)  Time elapsed: 0.001 sec  <<< FAILURE!
junit.framework.AssertionFailedError: expected:<P2Y37DT3H> but was:<P2Y3M3W37DT3H>
	at junit.framework.Assert.fail(Assert.java:47)
	at junit.framework.Assert.failNotEquals(Assert.java:280)
	at junit.framework.Assert.assertEquals(Assert.java:64)
	at junit.framework.Assert.assertEquals(Assert.java:71)
	at org.joda.time.TestPeriod_Basics.testNormalizedStandard_periodType_yearMonthDay(TestPeriod_Basics.java:1517)

testNormalizedStandard_periodType_months1(org.joda.time.TestPeriod_Basics)  Time elapsed: 0 sec  <<< ERROR!
java.lang.UnsupportedOperationException: Field is not supported
	at org.joda.time.PeriodType.setIndexedField(PeriodType.java:174)
	at org.joda.time.Period.withYears(Period.java:916)
	at org.joda.time.Period.normalizedStandard(Period.java:1651)
	at org.joda.time.TestPeriod_Basics.testNormalizedStandard_periodType_months1(TestPeriod_Basics.java:1522)

testNormalizedStandard_periodType_months2(org.joda.time.TestPeriod_Basics)  Time elapsed: 0.001 sec  <<< ERROR!
java.lang.UnsupportedOperationException: Field is not supported
	at org.joda.time.PeriodType.setIndexedField(PeriodType.java:174)
	at org.joda.time.Period.withYears(Period.java:916)
	at org.joda.time.Period.normalizedStandard(Period.java:1651)
	at org.joda.time.TestPeriod_Basics.testNormalizedStandard_periodType_months2(TestPeriod_Basics.java:1529)

testNormalizedStandard_periodType_months3(org.joda.time.TestPeriod_Basics)  Time elapsed: 0.001 sec  <<< ERROR!
java.lang.UnsupportedOperationException: Field is not supported
	at org.joda.time.PeriodType.setIndexedField(PeriodType.java:174)
	at org.joda.time.Period.withYears(Period.java:916)
	at org.joda.time.Period.normalizedStandard(Period.java:1651)
	at org.joda.time.TestPeriod_Basics.testNormalizedStandard_periodType_months3(TestPeriod_Basics.java:1536)

testNormalizedStandard_periodType_monthsWeeks(org.joda.time.TestPeriod_Basics)  Time elapsed: 0 sec  <<< ERROR!
java.lang.UnsupportedOperationException: Field is not supported
	at org.joda.time.PeriodType.setIndexedField(PeriodType.java:174)
	at org.joda.time.Period.withYears(Period.java:916)
	at org.joda.time.Period.normalizedStandard(Period.java:1651)
	at org.joda.time.TestPeriod_Basics.testNormalizedStandard_periodType_monthsWeeks(TestPeriod_Basics.java:1557)

testIsSupported(org.joda.time.TestPeriod_Basics)  Time elapsed: 0 sec  <<< FAILURE!
junit.framework.AssertionFailedError: expected:<false> but was:<true>
	at junit.framework.Assert.fail(Assert.java:47)
	at junit.framework.Assert.failNotEquals(Assert.java:280)
	at junit.framework.Assert.assertEquals(Assert.java:64)
	at junit.framework.Assert.assertEquals(Assert.java:146)
	at junit.framework.Assert.assertEquals(Assert.java:152)
	at org.joda.time.TestPeriod_Basics.testIsSupported(TestPeriod_Basics.java:162)

testIndexOf(org.joda.time.TestPeriod_Basics)  Time elapsed: 0 sec  <<< FAILURE!
junit.framework.AssertionFailedError: expected:<-1> but was:<1>
	at junit.framework.Assert.fail(Assert.java:47)
	at junit.framework.Assert.failNotEquals(Assert.java:280)
	at junit.framework.Assert.assertEquals(Assert.java:64)
	at junit.framework.Assert.assertEquals(Assert.java:198)
	at junit.framework.Assert.assertEquals(Assert.java:204)
	at org.joda.time.TestPeriod_Basics.testIndexOf(TestPeriod_Basics.java:174)

testConstructor_8int__PeriodType3(org.joda.time.TestMutablePeriod_Constructors)  Time elapsed: 0 sec  <<< FAILURE!
junit.framework.AssertionFailedError
	at junit.framework.Assert.fail(Assert.java:47)
	at junit.framework.Assert.fail(Assert.java:53)
	at org.joda.time.TestMutablePeriod_Constructors.testConstructor_8int__PeriodType3(TestMutablePeriod_Constructors.java:463)

testAdd_RP2(org.joda.time.TestMutablePeriod_Updates)  Time elapsed: 0.001 sec  <<< FAILURE!
junit.framework.AssertionFailedError: expected:<2> but was:<0>
	at junit.framework.Assert.fail(Assert.java:47)
	at junit.framework.Assert.failNotEquals(Assert.java:280)
	at junit.framework.Assert.assertEquals(Assert.java:64)
	at junit.framework.Assert.assertEquals(Assert.java:198)
	at junit.framework.Assert.assertEquals(Assert.java:204)
	at org.joda.time.TestMutablePeriod_Updates.testAdd_RP2(TestMutablePeriod_Updates.java:1252)

testAdd_8ints2(org.joda.time.TestMutablePeriod_Updates)  Time elapsed: 0.001 sec  <<< FAILURE!
junit.framework.AssertionFailedError
	at junit.framework.Assert.fail(Assert.java:47)
	at junit.framework.Assert.fail(Assert.java:53)
	at org.joda.time.TestMutablePeriod_Updates.testAdd_8ints2(TestMutablePeriod_Updates.java:1078)

testAdd_RP4(org.joda.time.TestMutablePeriod_Updates)  Time elapsed: 0 sec  <<< FAILURE!
junit.framework.AssertionFailedError
	at junit.framework.Assert.fail(Assert.java:47)
	at junit.framework.Assert.fail(Assert.java:53)
	at org.joda.time.TestMutablePeriod_Updates.testAdd_RP4(TestMutablePeriod_Updates.java:1278)

testAdd_RP5(org.joda.time.TestMutablePeriod_Updates)  Time elapsed: 0 sec  <<< FAILURE!
junit.framework.AssertionFailedError: expected:<4> but was:<2>
	at junit.framework.Assert.fail(Assert.java:47)
	at junit.framework.Assert.failNotEquals(Assert.java:280)
	at junit.framework.Assert.assertEquals(Assert.java:64)
	at junit.framework.Assert.assertEquals(Assert.java:198)
	at junit.framework.Assert.assertEquals(Assert.java:204)
	at org.joda.time.TestMutablePeriod_Updates.testAdd_RP5(TestMutablePeriod_Updates.java:1294)

testMergePeriod_RP2(org.joda.time.TestMutablePeriod_Updates)  Time elapsed: 0 sec  <<< ERROR!
java.lang.ArrayIndexOutOfBoundsException: 1
	at org.joda.time.base.BasePeriod.checkAndUpdate(BasePeriod.java:397)
	at org.joda.time.base.BasePeriod.mergePeriodInto(BasePeriod.java:552)
	at org.joda.time.base.BasePeriod.mergePeriod(BasePeriod.java:536)
	at org.joda.time.MutablePeriod.mergePeriod(MutablePeriod.java:736)
	at org.joda.time.TestMutablePeriod_Updates.testMergePeriod_RP2(TestMutablePeriod_Updates.java:1403)

testMergePeriod_RP3(org.joda.time.TestMutablePeriod_Updates)  Time elapsed: 0.001 sec  <<< ERROR!
java.lang.ArrayIndexOutOfBoundsException: 1
	at org.joda.time.base.BasePeriod.checkAndUpdate(BasePeriod.java:397)
	at org.joda.time.base.BasePeriod.mergePeriodInto(BasePeriod.java:552)
	at org.joda.time.base.BasePeriod.mergePeriod(BasePeriod.java:536)
	at org.joda.time.MutablePeriod.mergePeriod(MutablePeriod.java:736)
	at org.joda.time.TestMutablePeriod_Updates.testMergePeriod_RP3(TestMutablePeriod_Updates.java:1418)

testSetYears(org.joda.time.TestMutablePeriod_Updates)  Time elapsed: 0.001 sec  <<< ERROR!
java.lang.ArrayIndexOutOfBoundsException: 1
	at org.joda.time.base.BasePeriod.checkAndUpdate(BasePeriod.java:397)
	at org.joda.time.base.BasePeriod.setPeriodInternal(BasePeriod.java:454)
	at org.joda.time.base.BasePeriod.<init>(BasePeriod.java:93)
	at org.joda.time.MutablePeriod.<init>(MutablePeriod.java:150)
	at org.joda.time.TestMutablePeriod_Updates.testSetYears(TestMutablePeriod_Updates.java:255)

testSet_Field(org.joda.time.TestMutablePeriod_Updates)  Time elapsed: 0 sec  <<< FAILURE!
junit.framework.AssertionFailedError
	at junit.framework.Assert.fail(Assert.java:47)
	at junit.framework.Assert.fail(Assert.java:53)
	at org.joda.time.TestMutablePeriod_Updates.testSet_Field(TestMutablePeriod_Updates.java:404)

testAdd_Field(org.joda.time.TestMutablePeriod_Updates)  Time elapsed: 0 sec  <<< ERROR!
java.lang.ArrayIndexOutOfBoundsException: 1
	at org.joda.time.base.BasePeriod.checkAndUpdate(BasePeriod.java:397)
	at org.joda.time.base.BasePeriod.setPeriodInternal(BasePeriod.java:454)
	at org.joda.time.base.BasePeriod.<init>(BasePeriod.java:93)
	at org.joda.time.MutablePeriod.<init>(MutablePeriod.java:150)
	at org.joda.time.TestMutablePeriod_Updates.testAdd_Field(TestMutablePeriod_Updates.java:414)

testSetPeriod_8ints2(org.joda.time.TestMutablePeriod_Updates)  Time elapsed: 0 sec  <<< ERROR!
java.lang.ArrayIndexOutOfBoundsException: 1
	at org.joda.time.base.BasePeriod.checkAndUpdate(BasePeriod.java:397)
	at org.joda.time.base.BasePeriod.setPeriodInternal(BasePeriod.java:454)
	at org.joda.time.base.BasePeriod.setPeriod(BasePeriod.java:444)
	at org.joda.time.MutablePeriod.setPeriod(MutablePeriod.java:486)
	at org.joda.time.TestMutablePeriod_Updates.testSetPeriod_8ints2(TestMutablePeriod_Updates.java:449)

testSetPeriod_8ints3(org.joda.time.TestMutablePeriod_Updates)  Time elapsed: 0 sec  <<< ERROR!
java.lang.ArrayIndexOutOfBoundsException: 1
	at org.joda.time.base.BasePeriod.checkAndUpdate(BasePeriod.java:397)
	at org.joda.time.base.BasePeriod.setPeriodInternal(BasePeriod.java:454)
	at org.joda.time.base.BasePeriod.setPeriod(BasePeriod.java:444)
	at org.joda.time.MutablePeriod.setPeriod(MutablePeriod.java:486)
	at org.joda.time.TestMutablePeriod_Updates.testSetPeriod_8ints3(TestMutablePeriod_Updates.java:464)

testSetPeriod_RP2(org.joda.time.TestMutablePeriod_Updates)  Time elapsed: 0 sec  <<< ERROR!
java.lang.ArrayIndexOutOfBoundsException: 1
	at org.joda.time.base.BasePeriod.checkAndUpdate(BasePeriod.java:397)
	at org.joda.time.base.BasePeriod.setPeriodInternal(BasePeriod.java:424)
	at org.joda.time.base.BasePeriod.setPeriod(BasePeriod.java:412)
	at org.joda.time.MutablePeriod.setPeriod(MutablePeriod.java:468)
	at org.joda.time.TestMutablePeriod_Updates.testSetPeriod_RP2(TestMutablePeriod_Updates.java:505)

testSetPeriod_RP3(org.joda.time.TestMutablePeriod_Updates)  Time elapsed: 0 sec  <<< ERROR!
java.lang.ArrayIndexOutOfBoundsException: 1
	at org.joda.time.base.BasePeriod.checkAndUpdate(BasePeriod.java:397)
	at org.joda.time.base.BasePeriod.setPeriodInternal(BasePeriod.java:424)
	at org.joda.time.base.BasePeriod.setPeriod(BasePeriod.java:412)
	at org.joda.time.MutablePeriod.setPeriod(MutablePeriod.java:468)
	at org.joda.time.TestMutablePeriod_Updates.testSetPeriod_RP3(TestMutablePeriod_Updates.java:520)

testEqualsHashCode(org.joda.time.TestBaseSingleFieldPeriod)  Time elapsed: 0.001 sec  <<< ERROR!
java.lang.ArrayIndexOutOfBoundsException: 1
	at org.joda.time.base.BasePeriod.checkAndUpdate(BasePeriod.java:397)
	at org.joda.time.base.BasePeriod.setPeriodInternal(BasePeriod.java:454)
	at org.joda.time.base.BasePeriod.<init>(BasePeriod.java:93)
	at org.joda.time.Period.<init>(Period.java:352)
	at org.joda.time.TestBaseSingleFieldPeriod.testEqualsHashCode(TestBaseSingleFieldPeriod.java:224)

testFactory_parseYears_String(org.joda.time.TestYears)  Time elapsed: 0.001 sec  <<< ERROR!
java.lang.ArrayIndexOutOfBoundsException: 1
	at org.joda.time.base.BasePeriod.setFieldInto(BasePeriod.java:493)
	at org.joda.time.base.BasePeriod.setField(BasePeriod.java:474)
	at org.joda.time.MutablePeriod.setMonths(MutablePeriod.java:843)
	at org.joda.time.format.PeriodFormatterBuilder$FieldFormatter.setFieldValue(PeriodFormatterBuilder.java:1837)
	at org.joda.time.format.PeriodFormatterBuilder$FieldFormatter.parseInto(PeriodFormatterBuilder.java:1634)
	at org.joda.time.format.PeriodFormatterBuilder$Composite.parseInto(PeriodFormatterBuilder.java:2162)
	at org.joda.time.format.PeriodFormatterBuilder$Separator.parseInto(PeriodFormatterBuilder.java:2035)
	at org.joda.time.format.PeriodFormatter.parseMutablePeriod(PeriodFormatter.java:322)
	at org.joda.time.format.PeriodFormatter.parsePeriod(PeriodFormatter.java:308)
	at org.joda.time.Years.parseYears(Years.java:162)
	at org.joda.time.TestYears.testFactory_parseYears_String(TestYears.java:119)

testFactory_parseMonths_String(org.joda.time.TestMonths)  Time elapsed: 0.011 sec  <<< ERROR!
java.lang.ArrayIndexOutOfBoundsException: 1
	at org.joda.time.base.BasePeriod.setFieldInto(BasePeriod.java:493)
	at org.joda.time.base.BasePeriod.setField(BasePeriod.java:474)
	at org.joda.time.MutablePeriod.setYears(MutablePeriod.java:821)
	at org.joda.time.format.PeriodFormatterBuilder$FieldFormatter.setFieldValue(PeriodFormatterBuilder.java:1834)
	at org.joda.time.format.PeriodFormatterBuilder$FieldFormatter.parseInto(PeriodFormatterBuilder.java:1634)
	at org.joda.time.format.PeriodFormatterBuilder$Composite.parseInto(PeriodFormatterBuilder.java:2162)
	at org.joda.time.format.PeriodFormatterBuilder$Separator.parseInto(PeriodFormatterBuilder.java:2035)
	at org.joda.time.format.PeriodFormatter.parseMutablePeriod(PeriodFormatter.java:322)
	at org.joda.time.format.PeriodFormatter.parsePeriod(PeriodFormatter.java:308)
	at org.joda.time.Months.parseMonths(Months.java:198)
	at org.joda.time.TestMonths.testFactory_parseMonths_String(TestMonths.java:164)

testFactory_parseWeeks_String(org.joda.time.TestWeeks)  Time elapsed: 0 sec  <<< ERROR!
java.lang.ArrayIndexOutOfBoundsException: 1
	at org.joda.time.base.BasePeriod.setFieldInto(BasePeriod.java:493)
	at org.joda.time.base.BasePeriod.setField(BasePeriod.java:474)
	at org.joda.time.MutablePeriod.setYears(MutablePeriod.java:821)
	at org.joda.time.format.PeriodFormatterBuilder$FieldFormatter.setFieldValue(PeriodFormatterBuilder.java:1834)
	at org.joda.time.format.PeriodFormatterBuilder$FieldFormatter.parseInto(PeriodFormatterBuilder.java:1634)
	at org.joda.time.format.PeriodFormatterBuilder$Composite.parseInto(PeriodFormatterBuilder.java:2162)
	at org.joda.time.format.PeriodFormatterBuilder$Separator.parseInto(PeriodFormatterBuilder.java:2035)
	at org.joda.time.format.PeriodFormatter.parseMutablePeriod(PeriodFormatter.java:322)
	at org.joda.time.format.PeriodFormatter.parsePeriod(PeriodFormatter.java:308)
	at org.joda.time.Weeks.parseWeeks(Weeks.java:185)
	at org.joda.time.TestWeeks.testFactory_parseWeeks_String(TestWeeks.java:136)

testFactory_parseDays_String(org.joda.time.TestDays)  Time elapsed: 0.001 sec  <<< ERROR!
java.lang.ArrayIndexOutOfBoundsException: 1
	at org.joda.time.base.BasePeriod.setFieldInto(BasePeriod.java:493)
	at org.joda.time.base.BasePeriod.setField(BasePeriod.java:474)
	at org.joda.time.MutablePeriod.setYears(MutablePeriod.java:821)
	at org.joda.time.format.PeriodFormatterBuilder$FieldFormatter.setFieldValue(PeriodFormatterBuilder.java:1834)
	at org.joda.time.format.PeriodFormatterBuilder$FieldFormatter.parseInto(PeriodFormatterBuilder.java:1634)
	at org.joda.time.format.PeriodFormatterBuilder$Composite.parseInto(PeriodFormatterBuilder.java:2162)
	at org.joda.time.format.PeriodFormatterBuilder$Separator.parseInto(PeriodFormatterBuilder.java:2035)
	at org.joda.time.format.PeriodFormatter.parseMutablePeriod(PeriodFormatter.java:322)
	at org.joda.time.format.PeriodFormatter.parsePeriod(PeriodFormatter.java:308)
	at org.joda.time.Days.parseDays(Days.java:203)
	at org.joda.time.TestDays.testFactory_parseDays_String(TestDays.java:178)

testFactory_parseHours_String(org.joda.time.TestHours)  Time elapsed: 0.001 sec  <<< ERROR!
java.lang.ArrayIndexOutOfBoundsException: 1
	at org.joda.time.base.BasePeriod.setFieldInto(BasePeriod.java:493)
	at org.joda.time.base.BasePeriod.setField(BasePeriod.java:474)
	at org.joda.time.MutablePeriod.setYears(MutablePeriod.java:821)
	at org.joda.time.format.PeriodFormatterBuilder$FieldFormatter.setFieldValue(PeriodFormatterBuilder.java:1834)
	at org.joda.time.format.PeriodFormatterBuilder$FieldFormatter.parseInto(PeriodFormatterBuilder.java:1634)
	at org.joda.time.format.PeriodFormatterBuilder$Composite.parseInto(PeriodFormatterBuilder.java:2162)
	at org.joda.time.format.PeriodFormatterBuilder$Separator.parseInto(PeriodFormatterBuilder.java:2035)
	at org.joda.time.format.PeriodFormatter.parseMutablePeriod(PeriodFormatter.java:322)
	at org.joda.time.format.PeriodFormatter.parsePeriod(PeriodFormatter.java:308)
	at org.joda.time.Hours.parseHours(Hours.java:205)
	at org.joda.time.TestHours.testFactory_parseHours_String(TestHours.java:147)

testFactory_parseMinutes_String(org.joda.time.TestMinutes)  Time elapsed: 0 sec  <<< ERROR!
java.lang.ArrayIndexOutOfBoundsException: 1
	at org.joda.time.base.BasePeriod.setFieldInto(BasePeriod.java:493)
	at org.joda.time.base.BasePeriod.setField(BasePeriod.java:474)
	at org.joda.time.MutablePeriod.setYears(MutablePeriod.java:821)
	at org.joda.time.format.PeriodFormatterBuilder$FieldFormatter.setFieldValue(PeriodFormatterBuilder.java:1834)
	at org.joda.time.format.PeriodFormatterBuilder$FieldFormatter.parseInto(PeriodFormatterBuilder.java:1634)
	at org.joda.time.format.PeriodFormatterBuilder$Composite.parseInto(PeriodFormatterBuilder.java:2162)
	at org.joda.time.format.PeriodFormatterBuilder$Separator.parseInto(PeriodFormatterBuilder.java:2035)
	at org.joda.time.format.PeriodFormatter.parseMutablePeriod(PeriodFormatter.java:322)
	at org.joda.time.format.PeriodFormatter.parsePeriod(PeriodFormatter.java:308)
	at org.joda.time.Minutes.parseMinutes(Minutes.java:185)
	at org.joda.time.TestMinutes.testFactory_parseMinutes_String(TestMinutes.java:137)

testFactory_parseSeconds_String(org.joda.time.TestSeconds)  Time elapsed: 0.001 sec  <<< ERROR!
java.lang.ArrayIndexOutOfBoundsException: 1
	at org.joda.time.base.BasePeriod.setFieldInto(BasePeriod.java:493)
	at org.joda.time.base.BasePeriod.setField(BasePeriod.java:474)
	at org.joda.time.MutablePeriod.setMillis(MutablePeriod.java:975)
	at org.joda.time.format.PeriodFormatterBuilder$FieldFormatter.setFieldValue(PeriodFormatterBuilder.java:1855)
	at org.joda.time.format.PeriodFormatterBuilder$FieldFormatter.parseInto(PeriodFormatterBuilder.java:1637)
	at org.joda.time.format.PeriodFormatterBuilder$Composite.parseInto(PeriodFormatterBuilder.java:2162)
	at org.joda.time.format.PeriodFormatterBuilder$Separator.parseInto(PeriodFormatterBuilder.java:2061)
	at org.joda.time.format.PeriodFormatter.parseMutablePeriod(PeriodFormatter.java:322)
	at org.joda.time.format.PeriodFormatter.parsePeriod(PeriodFormatter.java:308)
	at org.joda.time.Seconds.parseSeconds(Seconds.java:185)
	at org.joda.time.TestSeconds.testFactory_parseSeconds_String(TestSeconds.java:131)

testIsSupported(org.joda.time.TestPeriodType)  Time elapsed: 0.001 sec  <<< FAILURE!
junit.framework.AssertionFailedError: expected:<false> but was:<true>
	at junit.framework.Assert.fail(Assert.java:47)
	at junit.framework.Assert.failNotEquals(Assert.java:280)
	at junit.framework.Assert.assertEquals(Assert.java:64)
	at junit.framework.Assert.assertEquals(Assert.java:146)
	at junit.framework.Assert.assertEquals(Assert.java:152)
	at org.joda.time.TestPeriodType.testIsSupported(TestPeriodType.java:893)

testIndexOf(org.joda.time.TestPeriodType)  Time elapsed: 0.001 sec  <<< FAILURE!
junit.framework.AssertionFailedError: expected:<-1> but was:<1>
	at junit.framework.Assert.fail(Assert.java:47)
	at junit.framework.Assert.failNotEquals(Assert.java:280)
	at junit.framework.Assert.assertEquals(Assert.java:64)
	at junit.framework.Assert.assertEquals(Assert.java:198)
	at junit.framework.Assert.assertEquals(Assert.java:204)
	at org.joda.time.TestPeriodType.testIndexOf(TestPeriodType.java:906)

testSeconds(org.joda.time.TestStringConvert)  Time elapsed: 0.001 sec  <<< ERROR!
java.lang.ArrayIndexOutOfBoundsException: 1
	at org.joda.time.base.BasePeriod.setFieldInto(BasePeriod.java:493)
	at org.joda.time.base.BasePeriod.setField(BasePeriod.java:474)
	at org.joda.time.MutablePeriod.setMillis(MutablePeriod.java:975)
	at org.joda.time.format.PeriodFormatterBuilder$FieldFormatter.setFieldValue(PeriodFormatterBuilder.java:1855)
	at org.joda.time.format.PeriodFormatterBuilder$FieldFormatter.parseInto(PeriodFormatterBuilder.java:1637)
	at org.joda.time.format.PeriodFormatterBuilder$Composite.parseInto(PeriodFormatterBuilder.java:2162)
	at org.joda.time.format.PeriodFormatterBuilder$Separator.parseInto(PeriodFormatterBuilder.java:2061)
	at org.joda.time.format.PeriodFormatter.parseMutablePeriod(PeriodFormatter.java:322)
	at org.joda.time.format.PeriodFormatter.parsePeriod(PeriodFormatter.java:308)
	at org.joda.time.Seconds.parseSeconds(Seconds.java:185)
	at sun.reflect.NativeMethodAccessorImpl.invoke0(Native Method)
	at sun.reflect.NativeMethodAccessorImpl.invoke(NativeMethodAccessorImpl.java:57)
	at sun.reflect.DelegatingMethodAccessorImpl.invoke(DelegatingMethodAccessorImpl.java:43)
	at java.lang.reflect.Method.invoke(Method.java:606)
	at org.joda.convert.MethodsStringConverter.convertFromString(MethodsStringConverter.java:70)
	at org.joda.convert.StringConvert.convertFromString(StringConvert.java:163)
	at org.joda.time.TestStringConvert.testSeconds(TestStringConvert.java:200)

testParsePeriod_parseType(org.joda.time.format.TestPeriodFormatter)  Time elapsed: 0.001 sec  <<< FAILURE!
junit.framework.AssertionFailedError
	at junit.framework.Assert.fail(Assert.java:47)
	at junit.framework.Assert.fail(Assert.java:53)
	at org.joda.time.format.TestPeriodFormatter.testParsePeriod_parseType(TestPeriodFormatter.java:202)

testFormatAlternateExtended(org.joda.time.format.TestISOPeriodFormat)  Time elapsed: 0 sec  <<< FAILURE!
junit.framework.ComparisonFailure: expected:<P0001-0[0]-04T05:06:07.008> but was:<P0001-0[4]-04T05:06:07.008>
	at junit.framework.Assert.assertEquals(Assert.java:81)
	at junit.framework.Assert.assertEquals(Assert.java:87)
	at org.joda.time.format.TestISOPeriodFormat.testFormatAlternateExtended(TestISOPeriodFormat.java:168)

testFormatAlternateWithWeeks(org.joda.time.format.TestISOPeriodFormat)  Time elapsed: 0.001 sec  <<< FAILURE!
junit.framework.ComparisonFailure: expected:<P0001W0[0]04T050607.008> but was:<P0001W0[4]04T050607.008>
	at junit.framework.Assert.assertEquals(Assert.java:81)
	at junit.framework.Assert.assertEquals(Assert.java:87)
	at org.joda.time.format.TestISOPeriodFormat.testFormatAlternateWithWeeks(TestISOPeriodFormat.java:186)

testFormatAlternateExtendedWithWeeks(org.joda.time.format.TestISOPeriodFormat)  Time elapsed: 0.001 sec  <<< FAILURE!
junit.framework.ComparisonFailure: expected:<P0001-W0[0]-04T05:06:07.008> but was:<P0001-W0[4]-04T05:06:07.008>
	at junit.framework.Assert.assertEquals(Assert.java:81)
	at junit.framework.Assert.assertEquals(Assert.java:87)
	at org.joda.time.format.TestISOPeriodFormat.testFormatAlternateExtendedWithWeeks(TestISOPeriodFormat.java:204)

testFormatStandard(org.joda.time.format.TestISOPeriodFormat)  Time elapsed: 0 sec  <<< FAILURE!
junit.framework.ComparisonFailure: expected:<PT0[M]> but was:<PT0[S]>
	at junit.framework.Assert.assertEquals(Assert.java:81)
	at junit.framework.Assert.assertEquals(Assert.java:87)
	at org.joda.time.format.TestISOPeriodFormat.testFormatStandard(TestISOPeriodFormat.java:110)

testFormatAlternate(org.joda.time.format.TestISOPeriodFormat)  Time elapsed: 0 sec  <<< FAILURE!
junit.framework.ComparisonFailure: expected:<P00010[0]04T050607.008> but was:<P00010[4]04T050607.008>
	at junit.framework.Assert.assertEquals(Assert.java:81)
	at junit.framework.Assert.assertEquals(Assert.java:87)
	at org.joda.time.format.TestISOPeriodFormat.testFormatAlternate(TestISOPeriodFormat.java:150)

testFormatPrintZeroDefault(org.joda.time.format.TestPeriodFormatterBuilder)  Time elapsed: 0.001 sec  <<< FAILURE!
junit.framework.ComparisonFailure: expected:<1-[-]-4> but was:<1-[4-4]-4>
	at junit.framework.Assert.assertEquals(Assert.java:81)
	at junit.framework.Assert.assertEquals(Assert.java:87)
	at org.joda.time.format.TestPeriodFormatterBuilder.testFormatPrintZeroDefault(TestPeriodFormatterBuilder.java:880)

testFormatPrintZeroRarelyLast(org.joda.time.format.TestPeriodFormatterBuilder)  Time elapsed: 0.001 sec  <<< FAILURE!
junit.framework.ComparisonFailure: expected:<1-[-]-4> but was:<1-[4-4]-4>
	at junit.framework.Assert.assertEquals(Assert.java:81)
	at junit.framework.Assert.assertEquals(Assert.java:87)
	at org.joda.time.format.TestPeriodFormatterBuilder.testFormatPrintZeroRarelyLast(TestPeriodFormatterBuilder.java:913)

testFormatPrintZeroRarelyFirst(org.joda.time.format.TestPeriodFormatterBuilder)  Time elapsed: 0.001 sec  <<< FAILURE!
junit.framework.ComparisonFailure: expected:<1-[-]-4> but was:<1-[4-4]-4>
	at junit.framework.Assert.assertEquals(Assert.java:81)
	at junit.framework.Assert.assertEquals(Assert.java:87)
	at org.joda.time.format.TestPeriodFormatterBuilder.testFormatPrintZeroRarelyFirst(TestPeriodFormatterBuilder.java:938)

testFormatPrintZeroIfSupported(org.joda.time.format.TestPeriodFormatterBuilder)  Time elapsed: 0.001 sec  <<< FAILURE!
junit.framework.ComparisonFailure: expected:<0-[-]-0> but was:<0-[0-0]-0>
	at junit.framework.Assert.assertEquals(Assert.java:81)
	at junit.framework.Assert.assertEquals(Assert.java:87)
	at org.joda.time.format.TestPeriodFormatterBuilder.testFormatPrintZeroIfSupported(TestPeriodFormatterBuilder.java:1008)

testFormatPrintZeroAlways(org.joda.time.format.TestPeriodFormatterBuilder)  Time elapsed: 0.001 sec  <<< FAILURE!
junit.framework.ComparisonFailure: expected:<1-[0-0]-4> but was:<1-[4-4]-4>
	at junit.framework.Assert.assertEquals(Assert.java:81)
	at junit.framework.Assert.assertEquals(Assert.java:87)
	at org.joda.time.format.TestPeriodFormatterBuilder.testFormatPrintZeroAlways(TestPeriodFormatterBuilder.java:1037)

testFormatPrintZeroNever(org.joda.time.format.TestPeriodFormatterBuilder)  Time elapsed: 0 sec  <<< FAILURE!
junit.framework.ComparisonFailure: expected:<1-[-]-4> but was:<1-[4-4]-4>
	at junit.framework.Assert.assertEquals(Assert.java:81)
	at junit.framework.Assert.assertEquals(Assert.java:87)
	at org.joda.time.format.TestPeriodFormatterBuilder.testFormatPrintZeroNever(TestPeriodFormatterBuilder.java:1062)


Results :

Failed tests: 
  org.joda.time.TestMutablePeriod_Constructors#testConstructor_8int__PeriodType3 AssertionFailedError
  org.joda.time.TestMutablePeriod_Updates#testAdd_8ints2 AssertionFailedError
  org.joda.time.TestMutablePeriod_Updates#testAdd_RP2 AssertionFailedError expec...
  org.joda.time.TestMutablePeriod_Updates#testAdd_RP4 AssertionFailedError
  org.joda.time.TestMutablePeriod_Updates#testAdd_RP5 AssertionFailedError expec...
  org.joda.time.TestMutablePeriod_Updates#testSet_Field AssertionFailedError
  org.joda.time.TestPeriodType#testIndexOf AssertionFailedError expected:<-1> bu...
  org.joda.time.TestPeriodType#testIsSupported AssertionFailedError expected:<fa...
  org.joda.time.TestPeriod_Basics#testGet AssertionFailedError expected:<0> but ...
  org.joda.time.TestPeriod_Basics#testIndexOf AssertionFailedError expected:<-1>...
  org.joda.time.TestPeriod_Basics#testIsSupported AssertionFailedError expected:...
  org.joda.time.TestPeriod_Basics#testNormalizedStandard_periodType_yearMonthDay AssertionFailedError
  org.joda.time.TestPeriod_Basics#testNormalizedStandard_periodType_yearMonthWeekDay AssertionFailedError
  org.joda.time.TestPeriod_Basics#testWithField3 AssertionFailedError
  org.joda.time.TestPeriod_Basics#testWithField4 AssertionFailedError expected:<...
  org.joda.time.TestPeriod_Basics#testWithFieldAdded3 AssertionFailedError
  org.joda.time.TestPeriod_Basics#testWithPeriodType3 AssertionFailedError
  org.joda.time.TestPeriod_Basics#testWithPeriodType5 AssertionFailedError expec...
  org.joda.time.TestPeriod_Constructors#testConstructor_8int__PeriodType3 AssertionFailedError
  org.joda.time.format.TestISOPeriodFormat#testFormatAlternate ComparisonFailure
  org.joda.time.format.TestISOPeriodFormat#testFormatAlternateExtended ComparisonFailure
  org.joda.time.format.TestISOPeriodFormat#testFormatAlternateExtendedWithWeeks ComparisonFailure
  org.joda.time.format.TestISOPeriodFormat#testFormatAlternateWithWeeks ComparisonFailure
  org.joda.time.format.TestISOPeriodFormat#testFormatStandard ComparisonFailure ...
  org.joda.time.format.TestPeriodFormatter#testParsePeriod_parseType AssertionFailedError
  org.joda.time.format.TestPeriodFormatterBuilder#testFormatPrintZeroAlways ComparisonFailure
  org.joda.time.format.TestPeriodFormatterBuilder#testFormatPrintZeroDefault ComparisonFailure
  org.joda.time.format.TestPeriodFormatterBuilder#testFormatPrintZeroIfSupported ComparisonFailure
  org.joda.time.format.TestPeriodFormatterBuilder#testFormatPrintZeroNever ComparisonFailure
  org.joda.time.format.TestPeriodFormatterBuilder#testFormatPrintZeroRarelyFirst ComparisonFailure
  org.joda.time.format.TestPeriodFormatterBuilder#testFormatPrintZeroRarelyLast ComparisonFailure
Tests in error: 
  org.joda.time.TestBaseSingleFieldPeriod#testEqualsHashCode ArrayIndexOutOfBoundsException
  org.joda.time.TestDays#testFactory_parseDays_String ArrayIndexOutOfBoundsException
  org.joda.time.TestHours#testFactory_parseHours_String ArrayIndexOutOfBoundsException
  org.joda.time.TestMinutes#testFactory_parseMinutes_String ArrayIndexOutOfBoundsException
  org.joda.time.TestMonths#testFactory_parseMonths_String ArrayIndexOutOfBoundsException
  org.joda.time.TestMutablePeriod_Updates#testAdd_Field ArrayIndexOutOfBoundsException
  org.joda.time.TestMutablePeriod_Updates#testMergePeriod_RP2 ArrayIndexOutOfBoundsException
  org.joda.time.TestMutablePeriod_Updates#testMergePeriod_RP3 ArrayIndexOutOfBoundsException
  org.joda.time.TestMutablePeriod_Updates#testSetPeriod_8ints2 ArrayIndexOutOfBoundsException
  org.joda.time.TestMutablePeriod_Updates#testSetPeriod_8ints3 ArrayIndexOutOfBoundsException
  org.joda.time.TestMutablePeriod_Updates#testSetPeriod_RP2 ArrayIndexOutOfBoundsException
  org.joda.time.TestMutablePeriod_Updates#testSetPeriod_RP3 ArrayIndexOutOfBoundsException
  org.joda.time.TestMutablePeriod_Updates#testSetYears ArrayIndexOutOfBoundsException
  org.joda.time.TestPeriod_Basics#testMinus ArrayIndexOutOfBoundsException 1
  org.joda.time.TestPeriod_Basics#testNormalizedStandard_periodType_months1 UnsupportedOperationException
  org.joda.time.TestPeriod_Basics#testNormalizedStandard_periodType_months2 UnsupportedOperationException
  org.joda.time.TestPeriod_Basics#testNormalizedStandard_periodType_months3 UnsupportedOperationException
  org.joda.time.TestPeriod_Basics#testNormalizedStandard_periodType_monthsWeeks UnsupportedOperationException
  org.joda.time.TestPeriod_Basics#testPlus ArrayIndexOutOfBoundsException 1
  org.joda.time.TestPeriod_Basics#testWithFields1 ArrayIndexOutOfBoundsException
  org.joda.time.TestPeriod_Basics#testWithFields3 ArrayIndexOutOfBoundsException
  org.joda.time.TestSeconds#testFactory_parseSeconds_String ArrayIndexOutOfBoundsException
  org.joda.time.TestStringConvert#testSeconds ArrayIndexOutOfBoundsException 1
  org.joda.time.TestWeeks#testFactory_parseWeeks_String ArrayIndexOutOfBoundsException
  org.joda.time.TestYears#testFactory_parseYears_String ArrayIndexOutOfBoundsException

Tests run: 4157, Failures: 31, Errors: 25, Skipped: 0

[INFO] ------------------------------------------------------------------------
[INFO] BUILD FAILURE
[INFO] ------------------------------------------------------------------------
[INFO] Total time: 16.040s
[INFO] Finished at: Wed Aug 05 18:59:51 BST 2015
[INFO] Final Memory: 10M/209M
[INFO] ------------------------------------------------------------------------
[ERROR] Failed to execute goal org.apache.maven.plugins:maven-surefire-plugin:2.18.1:test (default-test) on project joda-time: There are test failures.
[ERROR] 
[ERROR] Please refer to /home/perham/Study/LittleDarwin/Cases/joda-time-2.8.1/target/surefire-reports for the individual test results.
[ERROR] -> [Help 1]
[ERROR] 
[ERROR] To see the full stack trace of the errors, re-run Maven with the -e switch.
[ERROR] Re-run Maven using the -X switch to enable full debug logging.
[ERROR] 
[ERROR] For more information about the errors and possible solutions, please read the following articles:
[ERROR] [Help 1] http://cwiki.apache.org/confluence/display/MAVEN/MojoFailureException
