[INFO] Scanning for projects...
[INFO]                                                                         
[INFO] ------------------------------------------------------------------------
[INFO] Building Joda-Time 2.8.1
[INFO] ------------------------------------------------------------------------
[INFO] 
[INFO] --- maven-resources-plugin:2.7:resources (default-resources) @ joda-time ---
[INFO] Using 'UTF-8' encoding to copy filtered resources.
[INFO] Copying 2 resources to META-INF
[INFO] Copying 10 resources
[INFO] 
[INFO] --- maven-compiler-plugin:3.3:compile (default-compile) @ joda-time ---
[INFO] Changes detected - recompiling the module!
[INFO] Compiling 166 source files to /home/perham/Study/LittleDarwin/Cases/joda-time-2.8.1/target/classes
[INFO] 
[INFO] --- exec-maven-plugin:1.4.0:java (compile-tzdb) @ joda-time ---
Writing zoneinfo files
Writing ZoneInfoMap
[INFO] 
[INFO] --- maven-resources-plugin:2.7:testResources (default-testResources) @ joda-time ---
[INFO] Using 'UTF-8' encoding to copy filtered resources.
[INFO] Copying 34 resources
[INFO] 
[INFO] --- maven-compiler-plugin:3.3:testCompile (default-testCompile) @ joda-time ---
[INFO] Nothing to compile - all classes are up to date
[INFO] 
[INFO] --- maven-surefire-plugin:2.18.1:test (default-test) @ joda-time ---
[INFO] Surefire report directory: /home/perham/Study/LittleDarwin/Cases/joda-time-2.8.1/target/surefire-reports

-------------------------------------------------------
 T E S T S
-------------------------------------------------------
Running org.joda.time.TestAllPackages

TestBuddhistChronology.testCalendar

TestCopticChronology.testCalendar

TestEthiopicChronology.testCalendar

TestIslamicChronology.testCalendar

Testing Gregorian chronology over 1000 iterations
100% complete (i=1000)

Testing Julian chronology over 1000 iterations
100% complete (i=1000)
Writing zoneinfo files
Writing ZoneInfoMap
Tests run: 4157, Failures: 12, Errors: 22, Skipped: 0, Time elapsed: 5.273 sec <<< FAILURE! - in org.joda.time.TestAllPackages
testConstructor_long_PeriodType2(org.joda.time.TestPeriod_Constructors)  Time elapsed: 0.004 sec  <<< FAILURE!
junit.framework.AssertionFailedError: expected:<null> but was:<PeriodType[Standard]>
	at junit.framework.Assert.fail(Assert.java:47)
	at junit.framework.Assert.failNotEquals(Assert.java:280)
	at junit.framework.Assert.assertEquals(Assert.java:64)
	at junit.framework.Assert.assertEquals(Assert.java:71)
	at org.joda.time.TestPeriod_Constructors.testConstructor_long_PeriodType2(TestPeriod_Constructors.java:224)

testWithFields3(org.joda.time.TestPeriod_Basics)  Time elapsed: 0.001 sec  <<< FAILURE!
junit.framework.AssertionFailedError
	at junit.framework.Assert.fail(Assert.java:47)
	at junit.framework.Assert.fail(Assert.java:53)
	at org.joda.time.TestPeriod_Basics.testWithFields3(TestPeriod_Basics.java:594)

testWith(org.joda.time.TestPeriod_Basics)  Time elapsed: 0.002 sec  <<< FAILURE!
junit.framework.AssertionFailedError
	at junit.framework.Assert.fail(Assert.java:47)
	at junit.framework.Assert.fail(Assert.java:53)
	at org.joda.time.TestPeriod_Basics.testWith(TestPeriod_Basics.java:706)

testPlusFields(org.joda.time.TestPeriod_Basics)  Time elapsed: 0.002 sec  <<< FAILURE!
junit.framework.AssertionFailedError
	at junit.framework.Assert.fail(Assert.java:47)
	at junit.framework.Assert.fail(Assert.java:53)
	at org.joda.time.TestPeriod_Basics.testPlusFields(TestPeriod_Basics.java:881)

testMinusFields(org.joda.time.TestPeriod_Basics)  Time elapsed: 0.001 sec  <<< FAILURE!
junit.framework.AssertionFailedError
	at junit.framework.Assert.fail(Assert.java:47)
	at junit.framework.Assert.fail(Assert.java:53)
	at org.joda.time.TestPeriod_Basics.testMinusFields(TestPeriod_Basics.java:935)

testWithFields1(org.joda.time.TestPeriod_Basics)  Time elapsed: 0 sec  <<< FAILURE!
junit.framework.AssertionFailedError: expected:<P1Y2M3W4DT5H6M7.009S> but was:<PT0.009S>
	at junit.framework.Assert.fail(Assert.java:47)
	at junit.framework.Assert.failNotEquals(Assert.java:280)
	at junit.framework.Assert.assertEquals(Assert.java:64)
	at junit.framework.Assert.assertEquals(Assert.java:71)
	at org.joda.time.TestPeriod_Basics.testWithFields1(TestPeriod_Basics.java:577)

testConstructor_long_PeriodType2(org.joda.time.TestMutablePeriod_Constructors)  Time elapsed: 0 sec  <<< FAILURE!
junit.framework.AssertionFailedError: expected:<null> but was:<PeriodType[Standard]>
	at junit.framework.Assert.fail(Assert.java:47)
	at junit.framework.Assert.failNotEquals(Assert.java:280)
	at junit.framework.Assert.assertEquals(Assert.java:64)
	at junit.framework.Assert.assertEquals(Assert.java:71)
	at org.joda.time.TestMutablePeriod_Constructors.testConstructor_long_PeriodType2(TestMutablePeriod_Constructors.java:230)

testMergePeriod_RP2(org.joda.time.TestMutablePeriod_Updates)  Time elapsed: 0 sec  <<< FAILURE!
junit.framework.AssertionFailedError
	at junit.framework.Assert.fail(Assert.java:47)
	at junit.framework.Assert.fail(Assert.java:53)
	at org.joda.time.TestMutablePeriod_Updates.testMergePeriod_RP2(TestMutablePeriod_Updates.java:1404)

testSetPeriod_RP2(org.joda.time.TestMutablePeriod_Updates)  Time elapsed: 0.001 sec  <<< FAILURE!
junit.framework.AssertionFailedError
	at junit.framework.Assert.fail(Assert.java:47)
	at junit.framework.Assert.fail(Assert.java:53)
	at org.joda.time.TestMutablePeriod_Updates.testSetPeriod_RP2(TestMutablePeriod_Updates.java:506)

testSetPeriod_8ints2(org.joda.time.TestMutablePeriod_Updates)  Time elapsed: 0.001 sec  <<< FAILURE!
junit.framework.AssertionFailedError
	at junit.framework.Assert.fail(Assert.java:47)
	at junit.framework.Assert.fail(Assert.java:53)
	at org.joda.time.TestMutablePeriod_Updates.testSetPeriod_8ints2(TestMutablePeriod_Updates.java:450)

testSetYears(org.joda.time.TestMutablePeriod_Updates)  Time elapsed: 0 sec  <<< FAILURE!
junit.framework.AssertionFailedError
	at junit.framework.Assert.fail(Assert.java:47)
	at junit.framework.Assert.fail(Assert.java:53)
	at org.joda.time.TestMutablePeriod_Updates.testSetYears(TestMutablePeriod_Updates.java:258)

testForFields1(org.joda.time.TestPeriodType)  Time elapsed: 0.001 sec  <<< FAILURE!
junit.framework.AssertionFailedError: expected same:<null> was not:<PeriodType[StandardNoYearsNoMonthsNoWeeksNoDaysNoHoursNoMinutesNoSeconds]>
	at junit.framework.Assert.fail(Assert.java:47)
	at junit.framework.Assert.failNotSame(Assert.java:276)
	at junit.framework.Assert.assertSame(Assert.java:239)
	at junit.framework.Assert.assertSame(Assert.java:246)
	at org.joda.time.TestPeriodType.testForFields1(TestPeriodType.java:480)

testForFields2(org.joda.time.TestPeriodType)  Time elapsed: 0.001 sec  <<< ERROR!
java.lang.NullPointerException
	at org.joda.time.TestPeriodType.testForFields2(TestPeriodType.java:499)

testForFields3(org.joda.time.TestPeriodType)  Time elapsed: 0 sec  <<< ERROR!
java.lang.NullPointerException
	at org.joda.time.TestPeriodType.testForFields3(TestPeriodType.java:519)

testMaskYears(org.joda.time.TestPeriodType)  Time elapsed: 0.001 sec  <<< ERROR!
java.lang.NullPointerException
	at org.joda.time.TestPeriodType.testMaskYears(TestPeriodType.java:630)

testMaskMonths(org.joda.time.TestPeriodType)  Time elapsed: 0 sec  <<< ERROR!
java.lang.NullPointerException
	at org.joda.time.TestPeriodType.testMaskMonths(TestPeriodType.java:652)

testMaskWeeks(org.joda.time.TestPeriodType)  Time elapsed: 0 sec  <<< ERROR!
java.lang.NullPointerException
	at org.joda.time.TestPeriodType.testMaskWeeks(TestPeriodType.java:674)

testMaskDays(org.joda.time.TestPeriodType)  Time elapsed: 0.002 sec  <<< ERROR!
java.lang.NullPointerException
	at org.joda.time.TestPeriodType.testMaskDays(TestPeriodType.java:696)

testMaskHours(org.joda.time.TestPeriodType)  Time elapsed: 0 sec  <<< ERROR!
java.lang.NullPointerException
	at org.joda.time.TestPeriodType.testMaskHours(TestPeriodType.java:718)

testMaskMinutes(org.joda.time.TestPeriodType)  Time elapsed: 0 sec  <<< ERROR!
java.lang.NullPointerException
	at org.joda.time.TestPeriodType.testMaskMinutes(TestPeriodType.java:740)

testMaskSeconds(org.joda.time.TestPeriodType)  Time elapsed: 0 sec  <<< ERROR!
java.lang.NullPointerException
	at org.joda.time.TestPeriodType.testMaskSeconds(TestPeriodType.java:762)

testMaskMillis(org.joda.time.TestPeriodType)  Time elapsed: 0 sec  <<< ERROR!
java.lang.NullPointerException
	at org.joda.time.TestPeriodType.testMaskMillis(TestPeriodType.java:784)

testMaskHoursMinutesSeconds(org.joda.time.TestPeriodType)  Time elapsed: 0 sec  <<< ERROR!
java.lang.NullPointerException
	at org.joda.time.TestPeriodType.testMaskHoursMinutesSeconds(TestPeriodType.java:804)

testMaskTwice2(org.joda.time.TestPeriodType)  Time elapsed: 0 sec  <<< ERROR!
java.lang.NullPointerException
	at org.joda.time.TestPeriodType.testMaskTwice2(TestPeriodType.java:860)

testStandard(org.joda.time.TestPeriodType)  Time elapsed: 0.001 sec  <<< ERROR!
java.lang.NullPointerException
	at org.joda.time.TestPeriodType.testStandard(TestPeriodType.java:158)

testYearMonthDayTime(org.joda.time.TestPeriodType)  Time elapsed: 0 sec  <<< ERROR!
java.lang.NullPointerException
	at org.joda.time.TestPeriodType.testYearMonthDayTime(TestPeriodType.java:180)

testYearMonthDay(org.joda.time.TestPeriodType)  Time elapsed: 0 sec  <<< ERROR!
java.lang.NullPointerException
	at org.joda.time.TestPeriodType.testYearMonthDay(TestPeriodType.java:198)

testYearWeekDayTime(org.joda.time.TestPeriodType)  Time elapsed: 0.001 sec  <<< ERROR!
java.lang.NullPointerException
	at org.joda.time.TestPeriodType.testYearWeekDayTime(TestPeriodType.java:220)

testYearWeekDay(org.joda.time.TestPeriodType)  Time elapsed: 0 sec  <<< ERROR!
java.lang.NullPointerException
	at org.joda.time.TestPeriodType.testYearWeekDay(TestPeriodType.java:238)

testYearDayTime(org.joda.time.TestPeriodType)  Time elapsed: 0.001 sec  <<< ERROR!
java.lang.NullPointerException
	at org.joda.time.TestPeriodType.testYearDayTime(TestPeriodType.java:259)

testYearDay(org.joda.time.TestPeriodType)  Time elapsed: 0 sec  <<< ERROR!
java.lang.NullPointerException
	at org.joda.time.TestPeriodType.testYearDay(TestPeriodType.java:276)

testDayTime(org.joda.time.TestPeriodType)  Time elapsed: 0 sec  <<< ERROR!
java.lang.NullPointerException
	at org.joda.time.TestPeriodType.testDayTime(TestPeriodType.java:296)

testTime(org.joda.time.TestPeriodType)  Time elapsed: 0.001 sec  <<< ERROR!
java.lang.NullPointerException
	at org.joda.time.TestPeriodType.testTime(TestPeriodType.java:315)

testMillis(org.joda.time.TestPeriodType)  Time elapsed: 0 sec  <<< ERROR!
java.lang.NullPointerException
	at org.joda.time.TestPeriodType.testMillis(TestPeriodType.java:434)


Results :

Failed tests: 
  org.joda.time.TestMutablePeriod_Constructors#testConstructor_long_PeriodType2 AssertionFailedError
  org.joda.time.TestMutablePeriod_Updates#testMergePeriod_RP2 AssertionFailedError
  org.joda.time.TestMutablePeriod_Updates#testSetPeriod_8ints2 AssertionFailedError
  org.joda.time.TestMutablePeriod_Updates#testSetPeriod_RP2 AssertionFailedError
  org.joda.time.TestMutablePeriod_Updates#testSetYears AssertionFailedError
  org.joda.time.TestPeriodType#testForFields1 AssertionFailedError expected same...
  org.joda.time.TestPeriod_Basics#testMinusFields AssertionFailedError
  org.joda.time.TestPeriod_Basics#testPlusFields AssertionFailedError
  org.joda.time.TestPeriod_Basics#testWith AssertionFailedError
  org.joda.time.TestPeriod_Basics#testWithFields1 AssertionFailedError expected:...
  org.joda.time.TestPeriod_Basics#testWithFields3 AssertionFailedError
  org.joda.time.TestPeriod_Constructors#testConstructor_long_PeriodType2 AssertionFailedError
Tests in error: 
  org.joda.time.TestPeriodType#testDayTime NullPointerException
  org.joda.time.TestPeriodType#testForFields2 NullPointerException
  org.joda.time.TestPeriodType#testForFields3 NullPointerException
  org.joda.time.TestPeriodType#testMaskDays NullPointerException
  org.joda.time.TestPeriodType#testMaskHours NullPointerException
  org.joda.time.TestPeriodType#testMaskHoursMinutesSeconds NullPointerException
  org.joda.time.TestPeriodType#testMaskMillis NullPointerException
  org.joda.time.TestPeriodType#testMaskMinutes NullPointerException
  org.joda.time.TestPeriodType#testMaskMonths NullPointerException
  org.joda.time.TestPeriodType#testMaskSeconds NullPointerException
  org.joda.time.TestPeriodType#testMaskTwice2 NullPointerException
  org.joda.time.TestPeriodType#testMaskWeeks NullPointerException
  org.joda.time.TestPeriodType#testMaskYears NullPointerException
  org.joda.time.TestPeriodType#testMillis NullPointerException
  org.joda.time.TestPeriodType#testStandard NullPointerException
  org.joda.time.TestPeriodType#testTime NullPointerException
  org.joda.time.TestPeriodType#testYearDay NullPointerException
  org.joda.time.TestPeriodType#testYearDayTime NullPointerException
  org.joda.time.TestPeriodType#testYearMonthDay NullPointerException
  org.joda.time.TestPeriodType#testYearMonthDayTime NullPointerException
  org.joda.time.TestPeriodType#testYearWeekDay NullPointerException
  org.joda.time.TestPeriodType#testYearWeekDayTime NullPointerException

Tests run: 4157, Failures: 12, Errors: 22, Skipped: 0

[INFO] ------------------------------------------------------------------------
[INFO] BUILD FAILURE
[INFO] ------------------------------------------------------------------------
[INFO] Total time: 15.808s
[INFO] Finished at: Wed Aug 05 19:33:43 BST 2015
[INFO] Final Memory: 9M/213M
[INFO] ------------------------------------------------------------------------
[ERROR] Failed to execute goal org.apache.maven.plugins:maven-surefire-plugin:2.18.1:test (default-test) on project joda-time: There are test failures.
[ERROR] 
[ERROR] Please refer to /home/perham/Study/LittleDarwin/Cases/joda-time-2.8.1/target/surefire-reports for the individual test results.
[ERROR] -> [Help 1]
[ERROR] 
[ERROR] To see the full stack trace of the errors, re-run Maven with the -e switch.
[ERROR] Re-run Maven using the -X switch to enable full debug logging.
[ERROR] 
[ERROR] For more information about the errors and possible solutions, please read the following articles:
[ERROR] [Help 1] http://cwiki.apache.org/confluence/display/MAVEN/MojoFailureException
