[INFO] Scanning for projects...
[INFO]                                                                         
[INFO] ------------------------------------------------------------------------
[INFO] Building Joda-Time 2.8.1
[INFO] ------------------------------------------------------------------------
[INFO] 
[INFO] --- maven-resources-plugin:2.7:resources (default-resources) @ joda-time ---
[INFO] Using 'UTF-8' encoding to copy filtered resources.
[INFO] Copying 2 resources to META-INF
[INFO] Copying 10 resources
[INFO] 
[INFO] --- maven-compiler-plugin:3.3:compile (default-compile) @ joda-time ---
[INFO] Changes detected - recompiling the module!
[INFO] Compiling 166 source files to /home/perham/Study/LittleDarwin/Cases/joda-time-2.8.1/target/classes
[INFO] 
[INFO] --- exec-maven-plugin:1.4.0:java (compile-tzdb) @ joda-time ---
Writing zoneinfo files
Writing ZoneInfoMap
[INFO] 
[INFO] --- maven-resources-plugin:2.7:testResources (default-testResources) @ joda-time ---
[INFO] Using 'UTF-8' encoding to copy filtered resources.
[INFO] Copying 34 resources
[INFO] 
[INFO] --- maven-compiler-plugin:3.3:testCompile (default-testCompile) @ joda-time ---
[INFO] Nothing to compile - all classes are up to date
[INFO] 
[INFO] --- maven-surefire-plugin:2.18.1:test (default-test) @ joda-time ---
[INFO] Surefire report directory: /home/perham/Study/LittleDarwin/Cases/joda-time-2.8.1/target/surefire-reports

-------------------------------------------------------
 T E S T S
-------------------------------------------------------
Running org.joda.time.TestAllPackages

TestBuddhistChronology.testCalendar

TestCopticChronology.testCalendar

TestEthiopicChronology.testCalendar

TestIslamicChronology.testCalendar

Testing Gregorian chronology over 1000 iterations
100% complete (i=1000)

Testing Julian chronology over 1000 iterations
100% complete (i=1000)
Writing zoneinfo files
Writing ZoneInfoMap
Tests run: 4157, Failures: 221, Errors: 34, Skipped: 0, Time elapsed: 5.295 sec <<< FAILURE! - in org.joda.time.TestAllPackages
testToPeriod_fixedZone(org.joda.time.TestDuration_Basics)  Time elapsed: 0.003 sec  <<< FAILURE!
junit.framework.AssertionFailedError: expected:<10805> but was:<0>
	at junit.framework.Assert.fail(Assert.java:47)
	at junit.framework.Assert.failNotEquals(Assert.java:280)
	at junit.framework.Assert.assertEquals(Assert.java:64)
	at junit.framework.Assert.assertEquals(Assert.java:198)
	at junit.framework.Assert.assertEquals(Assert.java:204)
	at org.joda.time.TestDuration_Basics.testToPeriod_fixedZone(TestDuration_Basics.java:485)

testToPeriod(org.joda.time.TestDuration_Basics)  Time elapsed: 0.004 sec  <<< FAILURE!
junit.framework.AssertionFailedError: expected:<10805> but was:<0>
	at junit.framework.Assert.fail(Assert.java:47)
	at junit.framework.Assert.failNotEquals(Assert.java:280)
	at junit.framework.Assert.assertEquals(Assert.java:64)
	at junit.framework.Assert.assertEquals(Assert.java:198)
	at junit.framework.Assert.assertEquals(Assert.java:204)
	at org.joda.time.TestDuration_Basics.testToPeriod(TestDuration_Basics.java:461)

testConstructor_long1(org.joda.time.TestPeriod_Constructors)  Time elapsed: 0.001 sec  <<< FAILURE!
junit.framework.AssertionFailedError: expected:<101> but was:<0>
	at junit.framework.Assert.fail(Assert.java:47)
	at junit.framework.Assert.failNotEquals(Assert.java:280)
	at junit.framework.Assert.assertEquals(Assert.java:64)
	at junit.framework.Assert.assertEquals(Assert.java:198)
	at junit.framework.Assert.assertEquals(Assert.java:204)
	at org.joda.time.TestPeriod_Constructors.testConstructor_long1(TestPeriod_Constructors.java:133)

testConstructor_long2(org.joda.time.TestPeriod_Constructors)  Time elapsed: 0.001 sec  <<< FAILURE!
junit.framework.AssertionFailedError: expected:<5> but was:<0>
	at junit.framework.Assert.fail(Assert.java:47)
	at junit.framework.Assert.failNotEquals(Assert.java:280)
	at junit.framework.Assert.assertEquals(Assert.java:64)
	at junit.framework.Assert.assertEquals(Assert.java:198)
	at junit.framework.Assert.assertEquals(Assert.java:204)
	at org.joda.time.TestPeriod_Constructors.testConstructor_long2(TestPeriod_Constructors.java:150)

testConstructor_RI_RI6(org.joda.time.TestPeriod_Constructors)  Time elapsed: 0 sec  <<< FAILURE!
junit.framework.AssertionFailedError: expected:<15> but was:<0>
	at junit.framework.Assert.fail(Assert.java:47)
	at junit.framework.Assert.failNotEquals(Assert.java:280)
	at junit.framework.Assert.assertEquals(Assert.java:64)
	at junit.framework.Assert.assertEquals(Assert.java:198)
	at junit.framework.Assert.assertEquals(Assert.java:204)
	at org.joda.time.TestPeriod_Constructors.testConstructor_RI_RI6(TestPeriod_Constructors.java:703)

testConstructor_RI_RI7(org.joda.time.TestPeriod_Constructors)  Time elapsed: 0.001 sec  <<< FAILURE!
junit.framework.AssertionFailedError: expected:<1> but was:<0>
	at junit.framework.Assert.fail(Assert.java:47)
	at junit.framework.Assert.failNotEquals(Assert.java:280)
	at junit.framework.Assert.assertEquals(Assert.java:64)
	at junit.framework.Assert.assertEquals(Assert.java:198)
	at junit.framework.Assert.assertEquals(Assert.java:204)
	at org.joda.time.TestPeriod_Constructors.testConstructor_RI_RI7(TestPeriod_Constructors.java:718)

testConstructor_Object3(org.joda.time.TestPeriod_Constructors)  Time elapsed: 0.001 sec  <<< ERROR!
java.lang.ArrayIndexOutOfBoundsException: -1
	at org.joda.time.base.BasePeriod.getValue(BasePeriod.java:329)
	at org.joda.time.PeriodType.getIndexedField(PeriodType.java:172)
	at org.joda.time.Period.getYears(Period.java:757)
	at org.joda.time.TestPeriod_Constructors.testConstructor_Object3(TestPeriod_Constructors.java:1173)

testConstructor_Object4(org.joda.time.TestPeriod_Constructors)  Time elapsed: 0 sec  <<< FAILURE!
junit.framework.AssertionFailedError: expected:<1> but was:<0>
	at junit.framework.Assert.fail(Assert.java:47)
	at junit.framework.Assert.failNotEquals(Assert.java:280)
	at junit.framework.Assert.assertEquals(Assert.java:64)
	at junit.framework.Assert.assertEquals(Assert.java:198)
	at junit.framework.Assert.assertEquals(Assert.java:204)
	at org.joda.time.TestPeriod_Constructors.testConstructor_Object4(TestPeriod_Constructors.java:1187)

testConstructor_long_long1(org.joda.time.TestPeriod_Constructors)  Time elapsed: 0.001 sec  <<< FAILURE!
junit.framework.AssertionFailedError: expected:<1> but was:<0>
	at junit.framework.Assert.fail(Assert.java:47)
	at junit.framework.Assert.failNotEquals(Assert.java:280)
	at junit.framework.Assert.assertEquals(Assert.java:64)
	at junit.framework.Assert.assertEquals(Assert.java:198)
	at junit.framework.Assert.assertEquals(Assert.java:204)
	at org.joda.time.TestPeriod_Constructors.testConstructor_long_long1(TestPeriod_Constructors.java:467)

testConstructor_RI_RI1(org.joda.time.TestPeriod_Constructors)  Time elapsed: 0 sec  <<< FAILURE!
junit.framework.AssertionFailedError: expected:<1> but was:<0>
	at junit.framework.Assert.fail(Assert.java:47)
	at junit.framework.Assert.failNotEquals(Assert.java:280)
	at junit.framework.Assert.assertEquals(Assert.java:64)
	at junit.framework.Assert.assertEquals(Assert.java:198)
	at junit.framework.Assert.assertEquals(Assert.java:204)
	at org.joda.time.TestPeriod_Constructors.testConstructor_RI_RI1(TestPeriod_Constructors.java:622)

testConstructor_RI_RI2(org.joda.time.TestPeriod_Constructors)  Time elapsed: 0.001 sec  <<< FAILURE!
junit.framework.AssertionFailedError: expected:<1> but was:<0>
	at junit.framework.Assert.fail(Assert.java:47)
	at junit.framework.Assert.failNotEquals(Assert.java:280)
	at junit.framework.Assert.assertEquals(Assert.java:64)
	at junit.framework.Assert.assertEquals(Assert.java:198)
	at junit.framework.Assert.assertEquals(Assert.java:204)
	at org.joda.time.TestPeriod_Constructors.testConstructor_RI_RI2(TestPeriod_Constructors.java:637)

testConstructor_RI_RI3(org.joda.time.TestPeriod_Constructors)  Time elapsed: 0.001 sec  <<< FAILURE!
junit.framework.AssertionFailedError: expected:<3> but was:<0>
	at junit.framework.Assert.fail(Assert.java:47)
	at junit.framework.Assert.failNotEquals(Assert.java:280)
	at junit.framework.Assert.assertEquals(Assert.java:64)
	at junit.framework.Assert.assertEquals(Assert.java:198)
	at junit.framework.Assert.assertEquals(Assert.java:204)
	at org.joda.time.TestPeriod_Constructors.testConstructor_RI_RI3(TestPeriod_Constructors.java:652)

testConstructor_RI_RI4(org.joda.time.TestPeriod_Constructors)  Time elapsed: 0.001 sec  <<< FAILURE!
junit.framework.AssertionFailedError: expected:<-3> but was:<0>
	at junit.framework.Assert.fail(Assert.java:47)
	at junit.framework.Assert.failNotEquals(Assert.java:280)
	at junit.framework.Assert.assertEquals(Assert.java:64)
	at junit.framework.Assert.assertEquals(Assert.java:198)
	at junit.framework.Assert.assertEquals(Assert.java:204)
	at org.joda.time.TestPeriod_Constructors.testConstructor_RI_RI4(TestPeriod_Constructors.java:667)

testConstructor_Object1(org.joda.time.TestPeriod_Constructors)  Time elapsed: 0 sec  <<< FAILURE!
junit.framework.AssertionFailedError: expected:<1> but was:<0>
	at junit.framework.Assert.fail(Assert.java:47)
	at junit.framework.Assert.failNotEquals(Assert.java:280)
	at junit.framework.Assert.assertEquals(Assert.java:64)
	at junit.framework.Assert.assertEquals(Assert.java:198)
	at junit.framework.Assert.assertEquals(Assert.java:204)
	at org.joda.time.TestPeriod_Constructors.testConstructor_Object1(TestPeriod_Constructors.java:1147)

testFactoryYears(org.joda.time.TestPeriod_Constructors)  Time elapsed: 0.001 sec  <<< FAILURE!
junit.framework.AssertionFailedError: expected:<6> but was:<0>
	at junit.framework.Assert.fail(Assert.java:47)
	at junit.framework.Assert.failNotEquals(Assert.java:280)
	at junit.framework.Assert.assertEquals(Assert.java:64)
	at junit.framework.Assert.assertEquals(Assert.java:198)
	at junit.framework.Assert.assertEquals(Assert.java:204)
	at org.joda.time.TestPeriod_Constructors.testFactoryYears(TestPeriod_Constructors.java:1257)

testConstructor_long_long_Chronology1(org.joda.time.TestPeriod_Constructors)  Time elapsed: 0.001 sec  <<< FAILURE!
junit.framework.AssertionFailedError: expected:<1> but was:<0>
	at junit.framework.Assert.fail(Assert.java:47)
	at junit.framework.Assert.failNotEquals(Assert.java:280)
	at junit.framework.Assert.assertEquals(Assert.java:64)
	at junit.framework.Assert.assertEquals(Assert.java:198)
	at junit.framework.Assert.assertEquals(Assert.java:204)
	at org.joda.time.TestPeriod_Constructors.testConstructor_long_long_Chronology1(TestPeriod_Constructors.java:560)

testConstructor_long_long_Chronology2(org.joda.time.TestPeriod_Constructors)  Time elapsed: 0 sec  <<< FAILURE!
junit.framework.AssertionFailedError: expected:<1> but was:<0>
	at junit.framework.Assert.fail(Assert.java:47)
	at junit.framework.Assert.failNotEquals(Assert.java:280)
	at junit.framework.Assert.assertEquals(Assert.java:64)
	at junit.framework.Assert.assertEquals(Assert.java:198)
	at junit.framework.Assert.assertEquals(Assert.java:204)
	at org.joda.time.TestPeriod_Constructors.testConstructor_long_long_Chronology2(TestPeriod_Constructors.java:575)

testConstructor_long_Chronology2(org.joda.time.TestPeriod_Constructors)  Time elapsed: 0.001 sec  <<< FAILURE!
junit.framework.AssertionFailedError: expected:<4> but was:<0>
	at junit.framework.Assert.fail(Assert.java:47)
	at junit.framework.Assert.failNotEquals(Assert.java:280)
	at junit.framework.Assert.assertEquals(Assert.java:64)
	at junit.framework.Assert.assertEquals(Assert.java:198)
	at junit.framework.Assert.assertEquals(Assert.java:204)
	at org.joda.time.TestPeriod_Constructors.testConstructor_long_Chronology2(TestPeriod_Constructors.java:297)

testConstructor_long_Chronology3(org.joda.time.TestPeriod_Constructors)  Time elapsed: 0 sec  <<< FAILURE!
junit.framework.AssertionFailedError: expected:<101> but was:<0>
	at junit.framework.Assert.fail(Assert.java:47)
	at junit.framework.Assert.failNotEquals(Assert.java:280)
	at junit.framework.Assert.assertEquals(Assert.java:64)
	at junit.framework.Assert.assertEquals(Assert.java:198)
	at junit.framework.Assert.assertEquals(Assert.java:204)
	at org.joda.time.TestPeriod_Constructors.testConstructor_long_Chronology3(TestPeriod_Constructors.java:315)

testConstructor_long_PeriodType_Chronology1(org.joda.time.TestPeriod_Constructors)  Time elapsed: 0 sec  <<< ERROR!
java.lang.ArrayIndexOutOfBoundsException: -1
	at org.joda.time.base.BasePeriod.getValue(BasePeriod.java:329)
	at org.joda.time.PeriodType.getIndexedField(PeriodType.java:172)
	at org.joda.time.Period.getYears(Period.java:757)
	at org.joda.time.TestPeriod_Constructors.testConstructor_long_PeriodType_Chronology1(TestPeriod_Constructors.java:329)

testConstructor_long_PeriodType_Chronology2(org.joda.time.TestPeriod_Constructors)  Time elapsed: 0.001 sec  <<< FAILURE!
junit.framework.AssertionFailedError: expected:<4> but was:<0>
	at junit.framework.Assert.fail(Assert.java:47)
	at junit.framework.Assert.failNotEquals(Assert.java:280)
	at junit.framework.Assert.assertEquals(Assert.java:64)
	at junit.framework.Assert.assertEquals(Assert.java:198)
	at junit.framework.Assert.assertEquals(Assert.java:204)
	at org.joda.time.TestPeriod_Constructors.testConstructor_long_PeriodType_Chronology2(TestPeriod_Constructors.java:349)

testConstructor_long_PeriodType_Chronology3(org.joda.time.TestPeriod_Constructors)  Time elapsed: 0 sec  <<< FAILURE!
junit.framework.AssertionFailedError: expected:<101> but was:<0>
	at junit.framework.Assert.fail(Assert.java:47)
	at junit.framework.Assert.failNotEquals(Assert.java:280)
	at junit.framework.Assert.assertEquals(Assert.java:64)
	at junit.framework.Assert.assertEquals(Assert.java:198)
	at junit.framework.Assert.assertEquals(Assert.java:204)
	at org.joda.time.TestPeriod_Constructors.testConstructor_long_PeriodType_Chronology3(TestPeriod_Constructors.java:367)

testConstructor_long_PeriodType_Chronology4(org.joda.time.TestPeriod_Constructors)  Time elapsed: 0.001 sec  <<< FAILURE!
junit.framework.AssertionFailedError: expected:<101> but was:<0>
	at junit.framework.Assert.fail(Assert.java:47)
	at junit.framework.Assert.failNotEquals(Assert.java:280)
	at junit.framework.Assert.assertEquals(Assert.java:64)
	at junit.framework.Assert.assertEquals(Assert.java:198)
	at junit.framework.Assert.assertEquals(Assert.java:204)
	at org.joda.time.TestPeriod_Constructors.testConstructor_long_PeriodType_Chronology4(TestPeriod_Constructors.java:384)

testConstructor_4int1(org.joda.time.TestPeriod_Constructors)  Time elapsed: 0 sec  <<< FAILURE!
junit.framework.AssertionFailedError: expected:<5> but was:<0>
	at junit.framework.Assert.fail(Assert.java:47)
	at junit.framework.Assert.failNotEquals(Assert.java:280)
	at junit.framework.Assert.assertEquals(Assert.java:64)
	at junit.framework.Assert.assertEquals(Assert.java:198)
	at junit.framework.Assert.assertEquals(Assert.java:204)
	at org.joda.time.TestPeriod_Constructors.testConstructor_4int1(TestPeriod_Constructors.java:401)

testConstructor_8int1(org.joda.time.TestPeriod_Constructors)  Time elapsed: 0.001 sec  <<< FAILURE!
junit.framework.AssertionFailedError: expected:<1> but was:<0>
	at junit.framework.Assert.fail(Assert.java:47)
	at junit.framework.Assert.failNotEquals(Assert.java:280)
	at junit.framework.Assert.assertEquals(Assert.java:64)
	at junit.framework.Assert.assertEquals(Assert.java:198)
	at junit.framework.Assert.assertEquals(Assert.java:204)
	at org.joda.time.TestPeriod_Constructors.testConstructor_8int1(TestPeriod_Constructors.java:414)

testConstructor_8int__PeriodType1(org.joda.time.TestPeriod_Constructors)  Time elapsed: 0 sec  <<< FAILURE!
junit.framework.AssertionFailedError: expected:<1> but was:<0>
	at junit.framework.Assert.fail(Assert.java:47)
	at junit.framework.Assert.failNotEquals(Assert.java:280)
	at junit.framework.Assert.assertEquals(Assert.java:64)
	at junit.framework.Assert.assertEquals(Assert.java:198)
	at junit.framework.Assert.assertEquals(Assert.java:204)
	at org.joda.time.TestPeriod_Constructors.testConstructor_8int__PeriodType1(TestPeriod_Constructors.java:431)

testConstructor_8int__PeriodType2(org.joda.time.TestPeriod_Constructors)  Time elapsed: 0.003 sec  <<< ERROR!
java.lang.ArrayIndexOutOfBoundsException: -1
	at org.joda.time.base.BasePeriod.getValue(BasePeriod.java:329)
	at org.joda.time.PeriodType.getIndexedField(PeriodType.java:172)
	at org.joda.time.Period.getYears(Period.java:757)
	at org.joda.time.TestPeriod_Constructors.testConstructor_8int__PeriodType2(TestPeriod_Constructors.java:444)

testConstructor_long_long_PeriodType1(org.joda.time.TestPeriod_Constructors)  Time elapsed: 0 sec  <<< FAILURE!
junit.framework.AssertionFailedError: expected:<1> but was:<0>
	at junit.framework.Assert.fail(Assert.java:47)
	at junit.framework.Assert.failNotEquals(Assert.java:280)
	at junit.framework.Assert.assertEquals(Assert.java:64)
	at junit.framework.Assert.assertEquals(Assert.java:198)
	at junit.framework.Assert.assertEquals(Assert.java:204)
	at org.joda.time.TestPeriod_Constructors.testConstructor_long_long_PeriodType1(TestPeriod_Constructors.java:498)

testConstructor_long_long_PeriodType2(org.joda.time.TestPeriod_Constructors)  Time elapsed: 0 sec  <<< ERROR!
java.lang.ArrayIndexOutOfBoundsException: -1
	at org.joda.time.base.BasePeriod.getValue(BasePeriod.java:329)
	at org.joda.time.PeriodType.getIndexedField(PeriodType.java:172)
	at org.joda.time.Period.getYears(Period.java:757)
	at org.joda.time.TestPeriod_Constructors.testConstructor_long_long_PeriodType2(TestPeriod_Constructors.java:513)

testConstructor_long_long_PeriodType3(org.joda.time.TestPeriod_Constructors)  Time elapsed: 0 sec  <<< FAILURE!
junit.framework.AssertionFailedError: expected:<1> but was:<0>
	at junit.framework.Assert.fail(Assert.java:47)
	at junit.framework.Assert.failNotEquals(Assert.java:280)
	at junit.framework.Assert.assertEquals(Assert.java:64)
	at junit.framework.Assert.assertEquals(Assert.java:198)
	at junit.framework.Assert.assertEquals(Assert.java:204)
	at org.joda.time.TestPeriod_Constructors.testConstructor_long_long_PeriodType3(TestPeriod_Constructors.java:532)

testToPeriod_PeriodType3(org.joda.time.TestPeriod_Constructors)  Time elapsed: 0 sec  <<< FAILURE!
junit.framework.AssertionFailedError: expected:<1> but was:<0>
	at junit.framework.Assert.fail(Assert.java:47)
	at junit.framework.Assert.failNotEquals(Assert.java:280)
	at junit.framework.Assert.assertEquals(Assert.java:64)
	at junit.framework.Assert.assertEquals(Assert.java:198)
	at junit.framework.Assert.assertEquals(Assert.java:204)
	at org.joda.time.TestPeriod_Constructors.testToPeriod_PeriodType3(TestPeriod_Constructors.java:544)

testConstructor_long_long_PeriodType_Chronology1(org.joda.time.TestPeriod_Constructors)  Time elapsed: 0.001 sec  <<< FAILURE!
junit.framework.AssertionFailedError: expected:<1> but was:<0>
	at junit.framework.Assert.fail(Assert.java:47)
	at junit.framework.Assert.failNotEquals(Assert.java:280)
	at junit.framework.Assert.assertEquals(Assert.java:64)
	at junit.framework.Assert.assertEquals(Assert.java:198)
	at junit.framework.Assert.assertEquals(Assert.java:204)
	at org.joda.time.TestPeriod_Constructors.testConstructor_long_long_PeriodType_Chronology1(TestPeriod_Constructors.java:591)

testConstructor_long_long_PeriodType_Chronology2(org.joda.time.TestPeriod_Constructors)  Time elapsed: 0.001 sec  <<< FAILURE!
junit.framework.AssertionFailedError: expected:<1> but was:<0>
	at junit.framework.Assert.fail(Assert.java:47)
	at junit.framework.Assert.failNotEquals(Assert.java:280)
	at junit.framework.Assert.assertEquals(Assert.java:64)
	at junit.framework.Assert.assertEquals(Assert.java:198)
	at junit.framework.Assert.assertEquals(Assert.java:204)
	at org.joda.time.TestPeriod_Constructors.testConstructor_long_long_PeriodType_Chronology2(TestPeriod_Constructors.java:606)

testConstructor_RI_RI_PeriodType1(org.joda.time.TestPeriod_Constructors)  Time elapsed: 0 sec  <<< FAILURE!
junit.framework.AssertionFailedError: expected:<1> but was:<0>
	at junit.framework.Assert.fail(Assert.java:47)
	at junit.framework.Assert.failNotEquals(Assert.java:280)
	at junit.framework.Assert.assertEquals(Assert.java:64)
	at junit.framework.Assert.assertEquals(Assert.java:198)
	at junit.framework.Assert.assertEquals(Assert.java:204)
	at org.joda.time.TestPeriod_Constructors.testConstructor_RI_RI_PeriodType1(TestPeriod_Constructors.java:730)

testConstructor_RI_RI_PeriodType2(org.joda.time.TestPeriod_Constructors)  Time elapsed: 0.001 sec  <<< ERROR!
java.lang.ArrayIndexOutOfBoundsException: -1
	at org.joda.time.base.BasePeriod.getValue(BasePeriod.java:329)
	at org.joda.time.PeriodType.getIndexedField(PeriodType.java:172)
	at org.joda.time.Period.getYears(Period.java:757)
	at org.joda.time.TestPeriod_Constructors.testConstructor_RI_RI_PeriodType2(TestPeriod_Constructors.java:745)

testConstructor_RI_RI_PeriodType3(org.joda.time.TestPeriod_Constructors)  Time elapsed: 0 sec  <<< FAILURE!
junit.framework.AssertionFailedError: expected:<1> but was:<0>
	at junit.framework.Assert.fail(Assert.java:47)
	at junit.framework.Assert.failNotEquals(Assert.java:280)
	at junit.framework.Assert.assertEquals(Assert.java:64)
	at junit.framework.Assert.assertEquals(Assert.java:198)
	at junit.framework.Assert.assertEquals(Assert.java:204)
	at org.joda.time.TestPeriod_Constructors.testConstructor_RI_RI_PeriodType3(TestPeriod_Constructors.java:764)

testConstructor_RI_RI_PeriodType4(org.joda.time.TestPeriod_Constructors)  Time elapsed: 0.001 sec  <<< FAILURE!
junit.framework.AssertionFailedError: expected:<3> but was:<0>
	at junit.framework.Assert.fail(Assert.java:47)
	at junit.framework.Assert.failNotEquals(Assert.java:280)
	at junit.framework.Assert.assertEquals(Assert.java:64)
	at junit.framework.Assert.assertEquals(Assert.java:198)
	at junit.framework.Assert.assertEquals(Assert.java:204)
	at org.joda.time.TestPeriod_Constructors.testConstructor_RI_RI_PeriodType4(TestPeriod_Constructors.java:775)

testConstructor_RP_RP1(org.joda.time.TestPeriod_Constructors)  Time elapsed: 0.001 sec  <<< FAILURE!
junit.framework.AssertionFailedError: expected:<1> but was:<0>
	at junit.framework.Assert.fail(Assert.java:47)
	at junit.framework.Assert.failNotEquals(Assert.java:280)
	at junit.framework.Assert.assertEquals(Assert.java:64)
	at junit.framework.Assert.assertEquals(Assert.java:198)
	at junit.framework.Assert.assertEquals(Assert.java:204)
	at org.joda.time.TestPeriod_Constructors.testConstructor_RP_RP1(TestPeriod_Constructors.java:807)

testConstructor_RP_RP2(org.joda.time.TestPeriod_Constructors)  Time elapsed: 0 sec  <<< FAILURE!
junit.framework.AssertionFailedError: expected:<11> but was:<0>
	at junit.framework.Assert.fail(Assert.java:47)
	at junit.framework.Assert.failNotEquals(Assert.java:280)
	at junit.framework.Assert.assertEquals(Assert.java:64)
	at junit.framework.Assert.assertEquals(Assert.java:198)
	at junit.framework.Assert.assertEquals(Assert.java:204)
	at org.joda.time.TestPeriod_Constructors.testConstructor_RP_RP2(TestPeriod_Constructors.java:824)

testConstructor_RP_RP2Local(org.joda.time.TestPeriod_Constructors)  Time elapsed: 0.001 sec  <<< FAILURE!
junit.framework.AssertionFailedError: expected:<11> but was:<0>
	at junit.framework.Assert.fail(Assert.java:47)
	at junit.framework.Assert.failNotEquals(Assert.java:280)
	at junit.framework.Assert.assertEquals(Assert.java:64)
	at junit.framework.Assert.assertEquals(Assert.java:198)
	at junit.framework.Assert.assertEquals(Assert.java:204)
	at org.joda.time.TestPeriod_Constructors.testConstructor_RP_RP2Local(TestPeriod_Constructors.java:839)

testConstructor_RP_RP_PeriodType1(org.joda.time.TestPeriod_Constructors)  Time elapsed: 0 sec  <<< FAILURE!
junit.framework.AssertionFailedError: expected:<1> but was:<0>
	at junit.framework.Assert.fail(Assert.java:47)
	at junit.framework.Assert.failNotEquals(Assert.java:280)
	at junit.framework.Assert.assertEquals(Assert.java:64)
	at junit.framework.Assert.assertEquals(Assert.java:198)
	at junit.framework.Assert.assertEquals(Assert.java:204)
	at org.joda.time.TestPeriod_Constructors.testConstructor_RP_RP_PeriodType1(TestPeriod_Constructors.java:913)

testConstructor_RP_RP_PeriodType2(org.joda.time.TestPeriod_Constructors)  Time elapsed: 0.001 sec  <<< FAILURE!
junit.framework.AssertionFailedError: expected:<11> but was:<0>
	at junit.framework.Assert.fail(Assert.java:47)
	at junit.framework.Assert.failNotEquals(Assert.java:280)
	at junit.framework.Assert.assertEquals(Assert.java:64)
	at junit.framework.Assert.assertEquals(Assert.java:198)
	at junit.framework.Assert.assertEquals(Assert.java:204)
	at org.joda.time.TestPeriod_Constructors.testConstructor_RP_RP_PeriodType2(TestPeriod_Constructors.java:930)

testConstructor_RP_RP_PeriodType2Local(org.joda.time.TestPeriod_Constructors)  Time elapsed: 0 sec  <<< FAILURE!
junit.framework.AssertionFailedError: expected:<11> but was:<0>
	at junit.framework.Assert.fail(Assert.java:47)
	at junit.framework.Assert.failNotEquals(Assert.java:280)
	at junit.framework.Assert.assertEquals(Assert.java:64)
	at junit.framework.Assert.assertEquals(Assert.java:198)
	at junit.framework.Assert.assertEquals(Assert.java:204)
	at org.joda.time.TestPeriod_Constructors.testConstructor_RP_RP_PeriodType2Local(TestPeriod_Constructors.java:945)

testConstructor_RI_RD_PeriodType1(org.joda.time.TestPeriod_Constructors)  Time elapsed: 0.001 sec  <<< FAILURE!
junit.framework.AssertionFailedError: expected:<1> but was:<0>
	at junit.framework.Assert.fail(Assert.java:47)
	at junit.framework.Assert.failNotEquals(Assert.java:280)
	at junit.framework.Assert.assertEquals(Assert.java:64)
	at junit.framework.Assert.assertEquals(Assert.java:198)
	at junit.framework.Assert.assertEquals(Assert.java:204)
	at org.joda.time.TestPeriod_Constructors.testConstructor_RI_RD_PeriodType1(TestPeriod_Constructors.java:1051)

testConstructor_RD_RI_PeriodType1(org.joda.time.TestPeriod_Constructors)  Time elapsed: 0 sec  <<< FAILURE!
junit.framework.AssertionFailedError: expected:<1> but was:<0>
	at junit.framework.Assert.fail(Assert.java:47)
	at junit.framework.Assert.failNotEquals(Assert.java:280)
	at junit.framework.Assert.assertEquals(Assert.java:64)
	at junit.framework.Assert.assertEquals(Assert.java:198)
	at junit.framework.Assert.assertEquals(Assert.java:204)
	at org.joda.time.TestPeriod_Constructors.testConstructor_RD_RI_PeriodType1(TestPeriod_Constructors.java:1115)

testConstructor_Object_PeriodType1(org.joda.time.TestPeriod_Constructors)  Time elapsed: 0 sec  <<< FAILURE!
junit.framework.AssertionFailedError: expected:<1> but was:<0>
	at junit.framework.Assert.fail(Assert.java:47)
	at junit.framework.Assert.failNotEquals(Assert.java:280)
	at junit.framework.Assert.assertEquals(Assert.java:64)
	at junit.framework.Assert.assertEquals(Assert.java:198)
	at junit.framework.Assert.assertEquals(Assert.java:204)
	at org.joda.time.TestPeriod_Constructors.testConstructor_Object_PeriodType1(TestPeriod_Constructors.java:1204)

testConstructor_Object_PeriodType2(org.joda.time.TestPeriod_Constructors)  Time elapsed: 0 sec  <<< ERROR!
java.lang.ArrayIndexOutOfBoundsException: -1
	at org.joda.time.base.BasePeriod.getValue(BasePeriod.java:329)
	at org.joda.time.PeriodType.getIndexedField(PeriodType.java:172)
	at org.joda.time.Period.getWeeks(Period.java:775)
	at org.joda.time.TestPeriod_Constructors.testConstructor_Object_PeriodType2(TestPeriod_Constructors.java:1219)

testConstructor_Object_PeriodType3(org.joda.time.TestPeriod_Constructors)  Time elapsed: 0 sec  <<< ERROR!
java.lang.ArrayIndexOutOfBoundsException: -1
	at org.joda.time.base.BasePeriod.getValue(BasePeriod.java:329)
	at org.joda.time.PeriodType.getIndexedField(PeriodType.java:172)
	at org.joda.time.Period.getWeeks(Period.java:775)
	at org.joda.time.TestPeriod_Constructors.testConstructor_Object_PeriodType3(TestPeriod_Constructors.java:1232)

testConstructor_Object_PeriodType4(org.joda.time.TestPeriod_Constructors)  Time elapsed: 0 sec  <<< ERROR!
java.lang.ArrayIndexOutOfBoundsException: -1
	at org.joda.time.base.BasePeriod.getValue(BasePeriod.java:329)
	at org.joda.time.PeriodType.getIndexedField(PeriodType.java:172)
	at org.joda.time.Period.getYears(Period.java:757)
	at org.joda.time.TestPeriod_Constructors.testConstructor_Object_PeriodType4(TestPeriod_Constructors.java:1243)

testFactoryMonths(org.joda.time.TestPeriod_Constructors)  Time elapsed: 0.001 sec  <<< FAILURE!
junit.framework.AssertionFailedError: expected:<6> but was:<0>
	at junit.framework.Assert.fail(Assert.java:47)
	at junit.framework.Assert.failNotEquals(Assert.java:280)
	at junit.framework.Assert.assertEquals(Assert.java:64)
	at junit.framework.Assert.assertEquals(Assert.java:198)
	at junit.framework.Assert.assertEquals(Assert.java:204)
	at org.joda.time.TestPeriod_Constructors.testFactoryMonths(TestPeriod_Constructors.java:1271)

testFactoryWeeks(org.joda.time.TestPeriod_Constructors)  Time elapsed: 0 sec  <<< FAILURE!
junit.framework.AssertionFailedError: expected:<6> but was:<0>
	at junit.framework.Assert.fail(Assert.java:47)
	at junit.framework.Assert.failNotEquals(Assert.java:280)
	at junit.framework.Assert.assertEquals(Assert.java:64)
	at junit.framework.Assert.assertEquals(Assert.java:198)
	at junit.framework.Assert.assertEquals(Assert.java:204)
	at org.joda.time.TestPeriod_Constructors.testFactoryWeeks(TestPeriod_Constructors.java:1285)

testFactoryDays(org.joda.time.TestPeriod_Constructors)  Time elapsed: 0.001 sec  <<< FAILURE!
junit.framework.AssertionFailedError: expected:<6> but was:<0>
	at junit.framework.Assert.fail(Assert.java:47)
	at junit.framework.Assert.failNotEquals(Assert.java:280)
	at junit.framework.Assert.assertEquals(Assert.java:64)
	at junit.framework.Assert.assertEquals(Assert.java:198)
	at junit.framework.Assert.assertEquals(Assert.java:204)
	at org.joda.time.TestPeriod_Constructors.testFactoryDays(TestPeriod_Constructors.java:1299)

testFactoryHours(org.joda.time.TestPeriod_Constructors)  Time elapsed: 0 sec  <<< FAILURE!
junit.framework.AssertionFailedError: expected:<6> but was:<0>
	at junit.framework.Assert.fail(Assert.java:47)
	at junit.framework.Assert.failNotEquals(Assert.java:280)
	at junit.framework.Assert.assertEquals(Assert.java:64)
	at junit.framework.Assert.assertEquals(Assert.java:198)
	at junit.framework.Assert.assertEquals(Assert.java:204)
	at org.joda.time.TestPeriod_Constructors.testFactoryHours(TestPeriod_Constructors.java:1313)

testFactoryMinutes(org.joda.time.TestPeriod_Constructors)  Time elapsed: 0.001 sec  <<< FAILURE!
junit.framework.AssertionFailedError: expected:<6> but was:<0>
	at junit.framework.Assert.fail(Assert.java:47)
	at junit.framework.Assert.failNotEquals(Assert.java:280)
	at junit.framework.Assert.assertEquals(Assert.java:64)
	at junit.framework.Assert.assertEquals(Assert.java:198)
	at junit.framework.Assert.assertEquals(Assert.java:204)
	at org.joda.time.TestPeriod_Constructors.testFactoryMinutes(TestPeriod_Constructors.java:1327)

testFactorySeconds(org.joda.time.TestPeriod_Constructors)  Time elapsed: 0 sec  <<< FAILURE!
junit.framework.AssertionFailedError: expected:<6> but was:<0>
	at junit.framework.Assert.fail(Assert.java:47)
	at junit.framework.Assert.failNotEquals(Assert.java:280)
	at junit.framework.Assert.assertEquals(Assert.java:64)
	at junit.framework.Assert.assertEquals(Assert.java:198)
	at junit.framework.Assert.assertEquals(Assert.java:204)
	at org.joda.time.TestPeriod_Constructors.testFactorySeconds(TestPeriod_Constructors.java:1341)

testFactoryMillis(org.joda.time.TestPeriod_Constructors)  Time elapsed: 0.001 sec  <<< FAILURE!
junit.framework.AssertionFailedError: expected:<6> but was:<0>
	at junit.framework.Assert.fail(Assert.java:47)
	at junit.framework.Assert.failNotEquals(Assert.java:280)
	at junit.framework.Assert.assertEquals(Assert.java:64)
	at junit.framework.Assert.assertEquals(Assert.java:198)
	at junit.framework.Assert.assertEquals(Assert.java:204)
	at org.joda.time.TestPeriod_Constructors.testFactoryMillis(TestPeriod_Constructors.java:1355)

testFactoryFieldDifference1(org.joda.time.TestPeriod_Constructors)  Time elapsed: 0 sec  <<< FAILURE!
junit.framework.AssertionFailedError: expected:<-1> but was:<0>
	at junit.framework.Assert.fail(Assert.java:47)
	at junit.framework.Assert.failNotEquals(Assert.java:280)
	at junit.framework.Assert.assertEquals(Assert.java:64)
	at junit.framework.Assert.assertEquals(Assert.java:198)
	at junit.framework.Assert.assertEquals(Assert.java:204)
	at org.joda.time.TestPeriod_Constructors.testFactoryFieldDifference1(TestPeriod_Constructors.java:1500)

testConstructor_long3(org.joda.time.TestPeriod_Constructors)  Time elapsed: 0.002 sec  <<< FAILURE!
junit.framework.AssertionFailedError: expected:<10805> but was:<0>
	at junit.framework.Assert.fail(Assert.java:47)
	at junit.framework.Assert.failNotEquals(Assert.java:280)
	at junit.framework.Assert.assertEquals(Assert.java:64)
	at junit.framework.Assert.assertEquals(Assert.java:198)
	at junit.framework.Assert.assertEquals(Assert.java:204)
	at org.joda.time.TestPeriod_Constructors.testConstructor_long3(TestPeriod_Constructors.java:169)

testConstructor_long_fixedZone(org.joda.time.TestPeriod_Constructors)  Time elapsed: 0.001 sec  <<< FAILURE!
junit.framework.AssertionFailedError: expected:<10805> but was:<0>
	at junit.framework.Assert.fail(Assert.java:47)
	at junit.framework.Assert.failNotEquals(Assert.java:280)
	at junit.framework.Assert.assertEquals(Assert.java:64)
	at junit.framework.Assert.assertEquals(Assert.java:198)
	at junit.framework.Assert.assertEquals(Assert.java:204)
	at org.joda.time.TestPeriod_Constructors.testConstructor_long_fixedZone(TestPeriod_Constructors.java:191)

testConstructor_long_PeriodType1(org.joda.time.TestPeriod_Constructors)  Time elapsed: 0.001 sec  <<< FAILURE!
junit.framework.AssertionFailedError: expected:<101> but was:<0>
	at junit.framework.Assert.fail(Assert.java:47)
	at junit.framework.Assert.failNotEquals(Assert.java:280)
	at junit.framework.Assert.assertEquals(Assert.java:64)
	at junit.framework.Assert.assertEquals(Assert.java:198)
	at junit.framework.Assert.assertEquals(Assert.java:204)
	at org.joda.time.TestPeriod_Constructors.testConstructor_long_PeriodType1(TestPeriod_Constructors.java:212)

testConstructor_long_PeriodType2(org.joda.time.TestPeriod_Constructors)  Time elapsed: 0 sec  <<< ERROR!
java.lang.ArrayIndexOutOfBoundsException: -1
	at org.joda.time.base.BasePeriod.getValue(BasePeriod.java:329)
	at org.joda.time.PeriodType.getIndexedField(PeriodType.java:172)
	at org.joda.time.Period.getYears(Period.java:757)
	at org.joda.time.TestPeriod_Constructors.testConstructor_long_PeriodType2(TestPeriod_Constructors.java:225)

testConstructor_long_PeriodType3(org.joda.time.TestPeriod_Constructors)  Time elapsed: 0.001 sec  <<< ERROR!
java.lang.ArrayIndexOutOfBoundsException: -1
	at org.joda.time.base.BasePeriod.getValue(BasePeriod.java:329)
	at org.joda.time.PeriodType.getIndexedField(PeriodType.java:172)
	at org.joda.time.Period.getYears(Period.java:757)
	at org.joda.time.TestPeriod_Constructors.testConstructor_long_PeriodType3(TestPeriod_Constructors.java:242)

testConstructor_long_PeriodType4(org.joda.time.TestPeriod_Constructors)  Time elapsed: 0 sec  <<< FAILURE!
junit.framework.AssertionFailedError: expected:<5> but was:<0>
	at junit.framework.Assert.fail(Assert.java:47)
	at junit.framework.Assert.failNotEquals(Assert.java:280)
	at junit.framework.Assert.assertEquals(Assert.java:64)
	at junit.framework.Assert.assertEquals(Assert.java:198)
	at junit.framework.Assert.assertEquals(Assert.java:204)
	at org.joda.time.TestPeriod_Constructors.testConstructor_long_PeriodType4(TestPeriod_Constructors.java:263)

testConstructor_long_Chronology1(org.joda.time.TestPeriod_Constructors)  Time elapsed: 0 sec  <<< FAILURE!
junit.framework.AssertionFailedError: expected:<101> but was:<0>
	at junit.framework.Assert.fail(Assert.java:47)
	at junit.framework.Assert.failNotEquals(Assert.java:280)
	at junit.framework.Assert.assertEquals(Assert.java:64)
	at junit.framework.Assert.assertEquals(Assert.java:198)
	at junit.framework.Assert.assertEquals(Assert.java:204)
	at org.joda.time.TestPeriod_Constructors.testConstructor_long_Chronology1(TestPeriod_Constructors.java:281)

testConstructor_RI_RD1(org.joda.time.TestPeriod_Constructors)  Time elapsed: 0 sec  <<< FAILURE!
junit.framework.AssertionFailedError: expected:<1> but was:<0>
	at junit.framework.Assert.fail(Assert.java:47)
	at junit.framework.Assert.failNotEquals(Assert.java:280)
	at junit.framework.Assert.assertEquals(Assert.java:64)
	at junit.framework.Assert.assertEquals(Assert.java:198)
	at junit.framework.Assert.assertEquals(Assert.java:204)
	at org.joda.time.TestPeriod_Constructors.testConstructor_RI_RD1(TestPeriod_Constructors.java:1019)

testConstructor_RD_RI1(org.joda.time.TestPeriod_Constructors)  Time elapsed: 0.001 sec  <<< FAILURE!
junit.framework.AssertionFailedError: expected:<1> but was:<0>
	at junit.framework.Assert.fail(Assert.java:47)
	at junit.framework.Assert.failNotEquals(Assert.java:280)
	at junit.framework.Assert.assertEquals(Assert.java:64)
	at junit.framework.Assert.assertEquals(Assert.java:198)
	at junit.framework.Assert.assertEquals(Assert.java:204)
	at org.joda.time.TestPeriod_Constructors.testConstructor_RD_RI1(TestPeriod_Constructors.java:1083)

testConstructor_long_long2(org.joda.time.TestPeriod_Constructors)  Time elapsed: 0.001 sec  <<< FAILURE!
junit.framework.AssertionFailedError: expected:<1> but was:<0>
	at junit.framework.Assert.fail(Assert.java:47)
	at junit.framework.Assert.failNotEquals(Assert.java:280)
	at junit.framework.Assert.assertEquals(Assert.java:64)
	at junit.framework.Assert.assertEquals(Assert.java:198)
	at junit.framework.Assert.assertEquals(Assert.java:204)
	at org.joda.time.TestPeriod_Constructors.testConstructor_long_long2(TestPeriod_Constructors.java:482)

testWithPeriodType4(org.joda.time.TestPeriod_Basics)  Time elapsed: 0 sec  <<< FAILURE!
junit.framework.AssertionFailedError: expected:<3> but was:<0>
	at junit.framework.Assert.fail(Assert.java:47)
	at junit.framework.Assert.failNotEquals(Assert.java:280)
	at junit.framework.Assert.assertEquals(Assert.java:64)
	at junit.framework.Assert.assertEquals(Assert.java:198)
	at junit.framework.Assert.assertEquals(Assert.java:204)
	at org.joda.time.TestPeriod_Basics.testWithPeriodType4(TestPeriod_Basics.java:550)

testWithPeriodType5(org.joda.time.TestPeriod_Basics)  Time elapsed: 0.001 sec  <<< FAILURE!
junit.framework.AssertionFailedError: expected:<1> but was:<0>
	at junit.framework.Assert.fail(Assert.java:47)
	at junit.framework.Assert.failNotEquals(Assert.java:280)
	at junit.framework.Assert.assertEquals(Assert.java:64)
	at junit.framework.Assert.assertEquals(Assert.java:198)
	at junit.framework.Assert.assertEquals(Assert.java:204)
	at org.joda.time.TestPeriod_Basics.testWithPeriodType5(TestPeriod_Basics.java:559)

testPlus(org.joda.time.TestPeriod_Basics)  Time elapsed: 0 sec  <<< FAILURE!
junit.framework.AssertionFailedError: expected:<11> but was:<0>
	at junit.framework.Assert.fail(Assert.java:47)
	at junit.framework.Assert.failNotEquals(Assert.java:280)
	at junit.framework.Assert.assertEquals(Assert.java:64)
	at junit.framework.Assert.assertEquals(Assert.java:198)
	at junit.framework.Assert.assertEquals(Assert.java:204)
	at org.joda.time.TestPeriod_Basics.testPlus(TestPeriod_Basics.java:719)

testMinus(org.joda.time.TestPeriod_Basics)  Time elapsed: 0.001 sec  <<< FAILURE!
junit.framework.AssertionFailedError: expected:<-9> but was:<0>
	at junit.framework.Assert.fail(Assert.java:47)
	at junit.framework.Assert.failNotEquals(Assert.java:280)
	at junit.framework.Assert.assertEquals(Assert.java:64)
	at junit.framework.Assert.assertEquals(Assert.java:198)
	at junit.framework.Assert.assertEquals(Assert.java:204)
	at org.joda.time.TestPeriod_Basics.testMinus(TestPeriod_Basics.java:793)

testMultipliedBy(org.joda.time.TestPeriod_Basics)  Time elapsed: 0.001 sec  <<< FAILURE!
junit.framework.AssertionFailedError: expected:<2> but was:<0>
	at junit.framework.Assert.fail(Assert.java:47)
	at junit.framework.Assert.failNotEquals(Assert.java:280)
	at junit.framework.Assert.assertEquals(Assert.java:64)
	at junit.framework.Assert.assertEquals(Assert.java:198)
	at junit.framework.Assert.assertEquals(Assert.java:204)
	at org.joda.time.TestPeriod_Basics.testMultipliedBy(TestPeriod_Basics.java:950)

testNegated(org.joda.time.TestPeriod_Basics)  Time elapsed: 0 sec  <<< FAILURE!
junit.framework.AssertionFailedError: expected:<-1> but was:<0>
	at junit.framework.Assert.fail(Assert.java:47)
	at junit.framework.Assert.failNotEquals(Assert.java:280)
	at junit.framework.Assert.assertEquals(Assert.java:64)
	at junit.framework.Assert.assertEquals(Assert.java:198)
	at junit.framework.Assert.assertEquals(Assert.java:204)
	at org.joda.time.TestPeriod_Basics.testNegated(TestPeriod_Basics.java:998)

testToStandardWeeks(org.joda.time.TestPeriod_Basics)  Time elapsed: 0.001 sec  <<< FAILURE!
junit.framework.AssertionFailedError: expected:<3> but was:<0>
	at junit.framework.Assert.fail(Assert.java:47)
	at junit.framework.Assert.failNotEquals(Assert.java:280)
	at junit.framework.Assert.assertEquals(Assert.java:64)
	at junit.framework.Assert.assertEquals(Assert.java:198)
	at junit.framework.Assert.assertEquals(Assert.java:204)
	at org.joda.time.TestPeriod_Basics.testToStandardWeeks(TestPeriod_Basics.java:1019)

testToStandardWeeks_years(org.joda.time.TestPeriod_Basics)  Time elapsed: 0 sec  <<< FAILURE!
junit.framework.AssertionFailedError
	at junit.framework.Assert.fail(Assert.java:47)
	at junit.framework.Assert.fail(Assert.java:53)
	at org.joda.time.TestPeriod_Basics.testToStandardWeeks_years(TestPeriod_Basics.java:1052)

testToStandardWeeks_months(org.joda.time.TestPeriod_Basics)  Time elapsed: 0 sec  <<< FAILURE!
junit.framework.AssertionFailedError
	at junit.framework.Assert.fail(Assert.java:47)
	at junit.framework.Assert.fail(Assert.java:53)
	at org.joda.time.TestPeriod_Basics.testToStandardWeeks_months(TestPeriod_Basics.java:1069)

testToStandardDays_years(org.joda.time.TestPeriod_Basics)  Time elapsed: 0 sec  <<< FAILURE!
junit.framework.AssertionFailedError
	at junit.framework.Assert.fail(Assert.java:47)
	at junit.framework.Assert.fail(Assert.java:53)
	at org.joda.time.TestPeriod_Basics.testToStandardDays_years(TestPeriod_Basics.java:1117)

testToStandardDays_months(org.joda.time.TestPeriod_Basics)  Time elapsed: 0 sec  <<< FAILURE!
junit.framework.AssertionFailedError
	at junit.framework.Assert.fail(Assert.java:47)
	at junit.framework.Assert.fail(Assert.java:53)
	at org.joda.time.TestPeriod_Basics.testToStandardDays_months(TestPeriod_Basics.java:1134)

testToStandardHours_years(org.joda.time.TestPeriod_Basics)  Time elapsed: 0.001 sec  <<< FAILURE!
junit.framework.AssertionFailedError
	at junit.framework.Assert.fail(Assert.java:47)
	at junit.framework.Assert.fail(Assert.java:53)
	at org.joda.time.TestPeriod_Basics.testToStandardHours_years(TestPeriod_Basics.java:1181)

testToStandardHours_months(org.joda.time.TestPeriod_Basics)  Time elapsed: 0 sec  <<< FAILURE!
junit.framework.AssertionFailedError
	at junit.framework.Assert.fail(Assert.java:47)
	at junit.framework.Assert.fail(Assert.java:53)
	at org.joda.time.TestPeriod_Basics.testToStandardHours_months(TestPeriod_Basics.java:1198)

testToStandardMinutes_years(org.joda.time.TestPeriod_Basics)  Time elapsed: 0 sec  <<< FAILURE!
junit.framework.AssertionFailedError
	at junit.framework.Assert.fail(Assert.java:47)
	at junit.framework.Assert.fail(Assert.java:53)
	at org.joda.time.TestPeriod_Basics.testToStandardMinutes_years(TestPeriod_Basics.java:1244)

testToStandardMinutes_months(org.joda.time.TestPeriod_Basics)  Time elapsed: 0.001 sec  <<< FAILURE!
junit.framework.AssertionFailedError
	at junit.framework.Assert.fail(Assert.java:47)
	at junit.framework.Assert.fail(Assert.java:53)
	at org.joda.time.TestPeriod_Basics.testToStandardMinutes_months(TestPeriod_Basics.java:1261)

testToStandardSeconds_years(org.joda.time.TestPeriod_Basics)  Time elapsed: 0 sec  <<< FAILURE!
junit.framework.AssertionFailedError
	at junit.framework.Assert.fail(Assert.java:47)
	at junit.framework.Assert.fail(Assert.java:53)
	at org.joda.time.TestPeriod_Basics.testToStandardSeconds_years(TestPeriod_Basics.java:1304)

testToStandardSeconds_months(org.joda.time.TestPeriod_Basics)  Time elapsed: 0.001 sec  <<< FAILURE!
junit.framework.AssertionFailedError
	at junit.framework.Assert.fail(Assert.java:47)
	at junit.framework.Assert.fail(Assert.java:53)
	at org.joda.time.TestPeriod_Basics.testToStandardSeconds_months(TestPeriod_Basics.java:1321)

testToStandardDuration(org.joda.time.TestPeriod_Basics)  Time elapsed: 0 sec  <<< FAILURE!
junit.framework.AssertionFailedError: expected:<8> but was:<0>
	at junit.framework.Assert.fail(Assert.java:47)
	at junit.framework.Assert.failNotEquals(Assert.java:280)
	at junit.framework.Assert.assertEquals(Assert.java:64)
	at junit.framework.Assert.assertEquals(Assert.java:133)
	at junit.framework.Assert.assertEquals(Assert.java:139)
	at org.joda.time.TestPeriod_Basics.testToStandardDuration(TestPeriod_Basics.java:1337)

testToStandardDuration_years(org.joda.time.TestPeriod_Basics)  Time elapsed: 0 sec  <<< FAILURE!
junit.framework.AssertionFailedError
	at junit.framework.Assert.fail(Assert.java:47)
	at junit.framework.Assert.fail(Assert.java:53)
	at org.joda.time.TestPeriod_Basics.testToStandardDuration_years(TestPeriod_Basics.java:1371)

testToStandardDuration_months(org.joda.time.TestPeriod_Basics)  Time elapsed: 0 sec  <<< FAILURE!
junit.framework.AssertionFailedError
	at junit.framework.Assert.fail(Assert.java:47)
	at junit.framework.Assert.fail(Assert.java:53)
	at org.joda.time.TestPeriod_Basics.testToStandardDuration_months(TestPeriod_Basics.java:1388)

testNormalizedStandard_yearMonth1(org.joda.time.TestPeriod_Basics)  Time elapsed: 0 sec  <<< FAILURE!
junit.framework.AssertionFailedError: expected:<P2Y3M> but was:<PT0S>
	at junit.framework.Assert.fail(Assert.java:47)
	at junit.framework.Assert.failNotEquals(Assert.java:280)
	at junit.framework.Assert.assertEquals(Assert.java:64)
	at junit.framework.Assert.assertEquals(Assert.java:71)
	at org.joda.time.TestPeriod_Basics.testNormalizedStandard_yearMonth1(TestPeriod_Basics.java:1406)

testNormalizedStandard_yearMonth2(org.joda.time.TestPeriod_Basics)  Time elapsed: 0 sec  <<< FAILURE!
junit.framework.AssertionFailedError
	at junit.framework.Assert.fail(Assert.java:47)
	at junit.framework.Assert.fail(Assert.java:53)
	at org.joda.time.TestPeriod_Basics.testNormalizedStandard_yearMonth2(TestPeriod_Basics.java:1413)

testNormalizedStandard_weekDay1(org.joda.time.TestPeriod_Basics)  Time elapsed: 0 sec  <<< FAILURE!
junit.framework.AssertionFailedError: expected:<P2W5D> but was:<PT0S>
	at junit.framework.Assert.fail(Assert.java:47)
	at junit.framework.Assert.failNotEquals(Assert.java:280)
	at junit.framework.Assert.assertEquals(Assert.java:64)
	at junit.framework.Assert.assertEquals(Assert.java:71)
	at org.joda.time.TestPeriod_Basics.testNormalizedStandard_weekDay1(TestPeriod_Basics.java:1421)

testNormalizedStandard_weekDay2(org.joda.time.TestPeriod_Basics)  Time elapsed: 0.001 sec  <<< FAILURE!
junit.framework.AssertionFailedError
	at junit.framework.Assert.fail(Assert.java:47)
	at junit.framework.Assert.fail(Assert.java:53)
	at org.joda.time.TestPeriod_Basics.testNormalizedStandard_weekDay2(TestPeriod_Basics.java:1428)

testNormalizedStandard_yearMonthWeekDay(org.joda.time.TestPeriod_Basics)  Time elapsed: 0 sec  <<< FAILURE!
junit.framework.AssertionFailedError: expected:<P2Y3M2W5D> but was:<PT0S>
	at junit.framework.Assert.fail(Assert.java:47)
	at junit.framework.Assert.failNotEquals(Assert.java:280)
	at junit.framework.Assert.assertEquals(Assert.java:64)
	at junit.framework.Assert.assertEquals(Assert.java:71)
	at org.joda.time.TestPeriod_Basics.testNormalizedStandard_yearMonthWeekDay(TestPeriod_Basics.java:1436)

testNormalizedStandard_yearMonthDay(org.joda.time.TestPeriod_Basics)  Time elapsed: 0.001 sec  <<< FAILURE!
junit.framework.AssertionFailedError: expected:<P2Y3M5W1D> but was:<PT0S>
	at junit.framework.Assert.fail(Assert.java:47)
	at junit.framework.Assert.failNotEquals(Assert.java:280)
	at junit.framework.Assert.assertEquals(Assert.java:64)
	at junit.framework.Assert.assertEquals(Assert.java:71)
	at org.joda.time.TestPeriod_Basics.testNormalizedStandard_yearMonthDay(TestPeriod_Basics.java:1443)

testNormalizedStandard_negative(org.joda.time.TestPeriod_Basics)  Time elapsed: 0 sec  <<< FAILURE!
junit.framework.AssertionFailedError: expected:<PT1H50M> but was:<PT0S>
	at junit.framework.Assert.fail(Assert.java:47)
	at junit.framework.Assert.failNotEquals(Assert.java:280)
	at junit.framework.Assert.assertEquals(Assert.java:64)
	at junit.framework.Assert.assertEquals(Assert.java:71)
	at org.joda.time.TestPeriod_Basics.testNormalizedStandard_negative(TestPeriod_Basics.java:1450)

testNormalizedStandard_fullNegative(org.joda.time.TestPeriod_Basics)  Time elapsed: 0.001 sec  <<< FAILURE!
junit.framework.AssertionFailedError: expected:<PT-10M> but was:<PT0S>
	at junit.framework.Assert.fail(Assert.java:47)
	at junit.framework.Assert.failNotEquals(Assert.java:280)
	at junit.framework.Assert.assertEquals(Assert.java:64)
	at junit.framework.Assert.assertEquals(Assert.java:71)
	at org.joda.time.TestPeriod_Basics.testNormalizedStandard_fullNegative(TestPeriod_Basics.java:1457)

testNormalizedStandard_periodType_yearMonth1(org.joda.time.TestPeriod_Basics)  Time elapsed: 0 sec  <<< FAILURE!
junit.framework.AssertionFailedError: expected:<P2Y3M> but was:<PT0S>
	at junit.framework.Assert.fail(Assert.java:47)
	at junit.framework.Assert.failNotEquals(Assert.java:280)
	at junit.framework.Assert.assertEquals(Assert.java:64)
	at junit.framework.Assert.assertEquals(Assert.java:71)
	at org.joda.time.TestPeriod_Basics.testNormalizedStandard_periodType_yearMonth1(TestPeriod_Basics.java:1465)

testNormalizedStandard_periodType_yearMonth2(org.joda.time.TestPeriod_Basics)  Time elapsed: 0.001 sec  <<< FAILURE!
junit.framework.AssertionFailedError
	at junit.framework.Assert.fail(Assert.java:47)
	at junit.framework.Assert.fail(Assert.java:53)
	at org.joda.time.TestPeriod_Basics.testNormalizedStandard_periodType_yearMonth2(TestPeriod_Basics.java:1472)

testNormalizedStandard_periodType_yearMonth3(org.joda.time.TestPeriod_Basics)  Time elapsed: 0 sec  <<< FAILURE!
junit.framework.AssertionFailedError
	at junit.framework.Assert.fail(Assert.java:47)
	at junit.framework.Assert.fail(Assert.java:53)
	at org.joda.time.TestPeriod_Basics.testNormalizedStandard_periodType_yearMonth3(TestPeriod_Basics.java:1480)

testNormalizedStandard_periodType_weekDay1(org.joda.time.TestPeriod_Basics)  Time elapsed: 0.001 sec  <<< FAILURE!
junit.framework.AssertionFailedError: expected:<P2W5D> but was:<PT0S>
	at junit.framework.Assert.fail(Assert.java:47)
	at junit.framework.Assert.failNotEquals(Assert.java:280)
	at junit.framework.Assert.assertEquals(Assert.java:64)
	at junit.framework.Assert.assertEquals(Assert.java:71)
	at org.joda.time.TestPeriod_Basics.testNormalizedStandard_periodType_weekDay1(TestPeriod_Basics.java:1488)

testNormalizedStandard_periodType_weekDay2(org.joda.time.TestPeriod_Basics)  Time elapsed: 0 sec  <<< FAILURE!
junit.framework.AssertionFailedError
	at junit.framework.Assert.fail(Assert.java:47)
	at junit.framework.Assert.fail(Assert.java:53)
	at org.joda.time.TestPeriod_Basics.testNormalizedStandard_periodType_weekDay2(TestPeriod_Basics.java:1495)

testNormalizedStandard_periodType_weekDay3(org.joda.time.TestPeriod_Basics)  Time elapsed: 0 sec  <<< FAILURE!
junit.framework.AssertionFailedError: expected:<P19D> but was:<PT0S>
	at junit.framework.Assert.fail(Assert.java:47)
	at junit.framework.Assert.failNotEquals(Assert.java:280)
	at junit.framework.Assert.assertEquals(Assert.java:64)
	at junit.framework.Assert.assertEquals(Assert.java:71)
	at org.joda.time.TestPeriod_Basics.testNormalizedStandard_periodType_weekDay3(TestPeriod_Basics.java:1503)

testNormalizedStandard_periodType_yearMonthWeekDay(org.joda.time.TestPeriod_Basics)  Time elapsed: 0.001 sec  <<< FAILURE!
junit.framework.AssertionFailedError: expected:<P2Y3M19D> but was:<PT0S>
	at junit.framework.Assert.fail(Assert.java:47)
	at junit.framework.Assert.failNotEquals(Assert.java:280)
	at junit.framework.Assert.assertEquals(Assert.java:64)
	at junit.framework.Assert.assertEquals(Assert.java:71)
	at org.joda.time.TestPeriod_Basics.testNormalizedStandard_periodType_yearMonthWeekDay(TestPeriod_Basics.java:1510)

testNormalizedStandard_periodType_yearMonthDay(org.joda.time.TestPeriod_Basics)  Time elapsed: 0.001 sec  <<< FAILURE!
junit.framework.AssertionFailedError: expected:<P2Y3M37DT3H> but was:<PT0S>
	at junit.framework.Assert.fail(Assert.java:47)
	at junit.framework.Assert.failNotEquals(Assert.java:280)
	at junit.framework.Assert.assertEquals(Assert.java:64)
	at junit.framework.Assert.assertEquals(Assert.java:71)
	at org.joda.time.TestPeriod_Basics.testNormalizedStandard_periodType_yearMonthDay(TestPeriod_Basics.java:1517)

testNormalizedStandard_periodType_months1(org.joda.time.TestPeriod_Basics)  Time elapsed: 0 sec  <<< FAILURE!
junit.framework.AssertionFailedError: expected:<P27M> but was:<P0M>
	at junit.framework.Assert.fail(Assert.java:47)
	at junit.framework.Assert.failNotEquals(Assert.java:280)
	at junit.framework.Assert.assertEquals(Assert.java:64)
	at junit.framework.Assert.assertEquals(Assert.java:71)
	at org.joda.time.TestPeriod_Basics.testNormalizedStandard_periodType_months1(TestPeriod_Basics.java:1524)

testNormalizedStandard_periodType_months2(org.joda.time.TestPeriod_Basics)  Time elapsed: 0 sec  <<< FAILURE!
junit.framework.AssertionFailedError: expected:<P-9M> but was:<P0M>
	at junit.framework.Assert.fail(Assert.java:47)
	at junit.framework.Assert.failNotEquals(Assert.java:280)
	at junit.framework.Assert.assertEquals(Assert.java:64)
	at junit.framework.Assert.assertEquals(Assert.java:71)
	at org.joda.time.TestPeriod_Basics.testNormalizedStandard_periodType_months2(TestPeriod_Basics.java:1531)

testNormalizedStandard_periodType_months3(org.joda.time.TestPeriod_Basics)  Time elapsed: 0 sec  <<< FAILURE!
junit.framework.AssertionFailedError: expected:<P4M> but was:<P0M>
	at junit.framework.Assert.fail(Assert.java:47)
	at junit.framework.Assert.failNotEquals(Assert.java:280)
	at junit.framework.Assert.assertEquals(Assert.java:64)
	at junit.framework.Assert.assertEquals(Assert.java:71)
	at org.joda.time.TestPeriod_Basics.testNormalizedStandard_periodType_months3(TestPeriod_Basics.java:1538)

testNormalizedStandard_periodType_years(org.joda.time.TestPeriod_Basics)  Time elapsed: 0 sec  <<< FAILURE!
junit.framework.AssertionFailedError
	at junit.framework.Assert.fail(Assert.java:47)
	at junit.framework.Assert.fail(Assert.java:53)
	at org.joda.time.TestPeriod_Basics.testNormalizedStandard_periodType_years(TestPeriod_Basics.java:1545)

testNormalizedStandard_periodType_monthsWeeks(org.joda.time.TestPeriod_Basics)  Time elapsed: 0.001 sec  <<< FAILURE!
junit.framework.AssertionFailedError: expected:<P28M6W> but was:<P0D>
	at junit.framework.Assert.fail(Assert.java:47)
	at junit.framework.Assert.failNotEquals(Assert.java:280)
	at junit.framework.Assert.assertEquals(Assert.java:64)
	at junit.framework.Assert.assertEquals(Assert.java:71)
	at org.joda.time.TestPeriod_Basics.testNormalizedStandard_periodType_monthsWeeks(TestPeriod_Basics.java:1559)

testToStandardDays(org.joda.time.TestPeriod_Basics)  Time elapsed: 0 sec  <<< FAILURE!
junit.framework.AssertionFailedError: expected:<4> but was:<0>
	at junit.framework.Assert.fail(Assert.java:47)
	at junit.framework.Assert.failNotEquals(Assert.java:280)
	at junit.framework.Assert.assertEquals(Assert.java:64)
	at junit.framework.Assert.assertEquals(Assert.java:198)
	at junit.framework.Assert.assertEquals(Assert.java:204)
	at org.joda.time.TestPeriod_Basics.testToStandardDays(TestPeriod_Basics.java:1085)

testWithPeriodType2(org.joda.time.TestPeriod_Basics)  Time elapsed: 0 sec  <<< FAILURE!
junit.framework.AssertionFailedError: expected:<3> but was:<0>
	at junit.framework.Assert.fail(Assert.java:47)
	at junit.framework.Assert.failNotEquals(Assert.java:280)
	at junit.framework.Assert.assertEquals(Assert.java:64)
	at junit.framework.Assert.assertEquals(Assert.java:198)
	at junit.framework.Assert.assertEquals(Assert.java:204)
	at org.joda.time.TestPeriod_Basics.testWithPeriodType2(TestPeriod_Basics.java:534)

testToStandardHours(org.joda.time.TestPeriod_Basics)  Time elapsed: 0 sec  <<< FAILURE!
junit.framework.AssertionFailedError: expected:<5> but was:<0>
	at junit.framework.Assert.fail(Assert.java:47)
	at junit.framework.Assert.failNotEquals(Assert.java:280)
	at junit.framework.Assert.assertEquals(Assert.java:64)
	at junit.framework.Assert.assertEquals(Assert.java:198)
	at junit.framework.Assert.assertEquals(Assert.java:204)
	at org.joda.time.TestPeriod_Basics.testToStandardHours(TestPeriod_Basics.java:1150)

testToStandardMinutes(org.joda.time.TestPeriod_Basics)  Time elapsed: 0 sec  <<< FAILURE!
junit.framework.AssertionFailedError: expected:<6> but was:<0>
	at junit.framework.Assert.fail(Assert.java:47)
	at junit.framework.Assert.failNotEquals(Assert.java:280)
	at junit.framework.Assert.assertEquals(Assert.java:64)
	at junit.framework.Assert.assertEquals(Assert.java:198)
	at junit.framework.Assert.assertEquals(Assert.java:204)
	at org.joda.time.TestPeriod_Basics.testToStandardMinutes(TestPeriod_Basics.java:1214)

testToStandardSeconds(org.joda.time.TestPeriod_Basics)  Time elapsed: 0 sec  <<< FAILURE!
junit.framework.AssertionFailedError: expected:<7> but was:<0>
	at junit.framework.Assert.fail(Assert.java:47)
	at junit.framework.Assert.failNotEquals(Assert.java:280)
	at junit.framework.Assert.assertEquals(Assert.java:64)
	at junit.framework.Assert.assertEquals(Assert.java:198)
	at junit.framework.Assert.assertEquals(Assert.java:204)
	at org.joda.time.TestPeriod_Basics.testToStandardSeconds(TestPeriod_Basics.java:1277)

testConstructor_long1(org.joda.time.TestMutablePeriod_Constructors)  Time elapsed: 0 sec  <<< FAILURE!
junit.framework.AssertionFailedError: expected:<101> but was:<0>
	at junit.framework.Assert.fail(Assert.java:47)
	at junit.framework.Assert.failNotEquals(Assert.java:280)
	at junit.framework.Assert.assertEquals(Assert.java:64)
	at junit.framework.Assert.assertEquals(Assert.java:198)
	at junit.framework.Assert.assertEquals(Assert.java:204)
	at org.joda.time.TestMutablePeriod_Constructors.testConstructor_long1(TestMutablePeriod_Constructors.java:164)

testConstructor_long2(org.joda.time.TestMutablePeriod_Constructors)  Time elapsed: 0 sec  <<< FAILURE!
junit.framework.AssertionFailedError: expected:<5> but was:<0>
	at junit.framework.Assert.fail(Assert.java:47)
	at junit.framework.Assert.failNotEquals(Assert.java:280)
	at junit.framework.Assert.assertEquals(Assert.java:64)
	at junit.framework.Assert.assertEquals(Assert.java:198)
	at junit.framework.Assert.assertEquals(Assert.java:204)
	at org.joda.time.TestMutablePeriod_Constructors.testConstructor_long2(TestMutablePeriod_Constructors.java:181)

testConstructor_PeriodType1(org.joda.time.TestMutablePeriod_Constructors)  Time elapsed: 0.001 sec  <<< ERROR!
java.lang.ArrayIndexOutOfBoundsException: -1
	at org.joda.time.base.BasePeriod.getValue(BasePeriod.java:329)
	at org.joda.time.PeriodType.getIndexedField(PeriodType.java:172)
	at org.joda.time.MutablePeriod.getWeeks(MutablePeriod.java:764)
	at org.joda.time.TestMutablePeriod_Constructors.testConstructor_PeriodType1(TestMutablePeriod_Constructors.java:131)

testConstructor_Object3(org.joda.time.TestMutablePeriod_Constructors)  Time elapsed: 0 sec  <<< ERROR!
java.lang.ArrayIndexOutOfBoundsException: -1
	at org.joda.time.base.BasePeriod.getValue(BasePeriod.java:329)
	at org.joda.time.PeriodType.getIndexedField(PeriodType.java:172)
	at org.joda.time.MutablePeriod.getYears(MutablePeriod.java:746)
	at org.joda.time.TestMutablePeriod_Constructors.testConstructor_Object3(TestMutablePeriod_Constructors.java:855)

testConstructor_Object4(org.joda.time.TestMutablePeriod_Constructors)  Time elapsed: 0.001 sec  <<< FAILURE!
junit.framework.AssertionFailedError: expected:<1> but was:<0>
	at junit.framework.Assert.fail(Assert.java:47)
	at junit.framework.Assert.failNotEquals(Assert.java:280)
	at junit.framework.Assert.assertEquals(Assert.java:64)
	at junit.framework.Assert.assertEquals(Assert.java:198)
	at junit.framework.Assert.assertEquals(Assert.java:204)
	at org.joda.time.TestMutablePeriod_Constructors.testConstructor_Object4(TestMutablePeriod_Constructors.java:869)

testConstructor_long_long1(org.joda.time.TestMutablePeriod_Constructors)  Time elapsed: 0 sec  <<< FAILURE!
junit.framework.AssertionFailedError: expected:<1> but was:<0>
	at junit.framework.Assert.fail(Assert.java:47)
	at junit.framework.Assert.failNotEquals(Assert.java:280)
	at junit.framework.Assert.assertEquals(Assert.java:64)
	at junit.framework.Assert.assertEquals(Assert.java:198)
	at junit.framework.Assert.assertEquals(Assert.java:204)
	at org.joda.time.TestMutablePeriod_Constructors.testConstructor_long_long1(TestMutablePeriod_Constructors.java:473)

testConstructor_RI_RI1(org.joda.time.TestMutablePeriod_Constructors)  Time elapsed: 0 sec  <<< FAILURE!
junit.framework.AssertionFailedError: expected:<1> but was:<0>
	at junit.framework.Assert.fail(Assert.java:47)
	at junit.framework.Assert.failNotEquals(Assert.java:280)
	at junit.framework.Assert.assertEquals(Assert.java:64)
	at junit.framework.Assert.assertEquals(Assert.java:198)
	at junit.framework.Assert.assertEquals(Assert.java:204)
	at org.joda.time.TestMutablePeriod_Constructors.testConstructor_RI_RI1(TestMutablePeriod_Constructors.java:612)

testConstructor_RI_RI2(org.joda.time.TestMutablePeriod_Constructors)  Time elapsed: 0.001 sec  <<< FAILURE!
junit.framework.AssertionFailedError: expected:<1> but was:<0>
	at junit.framework.Assert.fail(Assert.java:47)
	at junit.framework.Assert.failNotEquals(Assert.java:280)
	at junit.framework.Assert.assertEquals(Assert.java:64)
	at junit.framework.Assert.assertEquals(Assert.java:198)
	at junit.framework.Assert.assertEquals(Assert.java:204)
	at org.joda.time.TestMutablePeriod_Constructors.testConstructor_RI_RI2(TestMutablePeriod_Constructors.java:627)

testConstructor_RI_RI3(org.joda.time.TestMutablePeriod_Constructors)  Time elapsed: 0 sec  <<< FAILURE!
junit.framework.AssertionFailedError: expected:<3> but was:<0>
	at junit.framework.Assert.fail(Assert.java:47)
	at junit.framework.Assert.failNotEquals(Assert.java:280)
	at junit.framework.Assert.assertEquals(Assert.java:64)
	at junit.framework.Assert.assertEquals(Assert.java:198)
	at junit.framework.Assert.assertEquals(Assert.java:204)
	at org.joda.time.TestMutablePeriod_Constructors.testConstructor_RI_RI3(TestMutablePeriod_Constructors.java:642)

testConstructor_RI_RI4(org.joda.time.TestMutablePeriod_Constructors)  Time elapsed: 0.001 sec  <<< FAILURE!
junit.framework.AssertionFailedError: expected:<-3> but was:<0>
	at junit.framework.Assert.fail(Assert.java:47)
	at junit.framework.Assert.failNotEquals(Assert.java:280)
	at junit.framework.Assert.assertEquals(Assert.java:64)
	at junit.framework.Assert.assertEquals(Assert.java:198)
	at junit.framework.Assert.assertEquals(Assert.java:204)
	at org.joda.time.TestMutablePeriod_Constructors.testConstructor_RI_RI4(TestMutablePeriod_Constructors.java:657)

testConstructor_Object1(org.joda.time.TestMutablePeriod_Constructors)  Time elapsed: 0 sec  <<< FAILURE!
junit.framework.AssertionFailedError: expected:<1> but was:<0>
	at junit.framework.Assert.fail(Assert.java:47)
	at junit.framework.Assert.failNotEquals(Assert.java:280)
	at junit.framework.Assert.assertEquals(Assert.java:64)
	at junit.framework.Assert.assertEquals(Assert.java:198)
	at junit.framework.Assert.assertEquals(Assert.java:204)
	at org.joda.time.TestMutablePeriod_Constructors.testConstructor_Object1(TestMutablePeriod_Constructors.java:829)

testConstructor_long_long_Chronology1(org.joda.time.TestMutablePeriod_Constructors)  Time elapsed: 0.001 sec  <<< FAILURE!
junit.framework.AssertionFailedError: expected:<1> but was:<0>
	at junit.framework.Assert.fail(Assert.java:47)
	at junit.framework.Assert.failNotEquals(Assert.java:280)
	at junit.framework.Assert.assertEquals(Assert.java:64)
	at junit.framework.Assert.assertEquals(Assert.java:198)
	at junit.framework.Assert.assertEquals(Assert.java:204)
	at org.joda.time.TestMutablePeriod_Constructors.testConstructor_long_long_Chronology1(TestMutablePeriod_Constructors.java:550)

testConstructor_long_long_Chronology2(org.joda.time.TestMutablePeriod_Constructors)  Time elapsed: 0 sec  <<< FAILURE!
junit.framework.AssertionFailedError: expected:<1> but was:<0>
	at junit.framework.Assert.fail(Assert.java:47)
	at junit.framework.Assert.failNotEquals(Assert.java:280)
	at junit.framework.Assert.assertEquals(Assert.java:64)
	at junit.framework.Assert.assertEquals(Assert.java:198)
	at junit.framework.Assert.assertEquals(Assert.java:204)
	at org.joda.time.TestMutablePeriod_Constructors.testConstructor_long_long_Chronology2(TestMutablePeriod_Constructors.java:565)

testConstructor_long_Chronology2(org.joda.time.TestMutablePeriod_Constructors)  Time elapsed: 0.001 sec  <<< FAILURE!
junit.framework.AssertionFailedError: expected:<4> but was:<0>
	at junit.framework.Assert.fail(Assert.java:47)
	at junit.framework.Assert.failNotEquals(Assert.java:280)
	at junit.framework.Assert.assertEquals(Assert.java:64)
	at junit.framework.Assert.assertEquals(Assert.java:198)
	at junit.framework.Assert.assertEquals(Assert.java:204)
	at org.joda.time.TestMutablePeriod_Constructors.testConstructor_long_Chronology2(TestMutablePeriod_Constructors.java:303)

testConstructor_long_Chronology3(org.joda.time.TestMutablePeriod_Constructors)  Time elapsed: 0 sec  <<< FAILURE!
junit.framework.AssertionFailedError: expected:<101> but was:<0>
	at junit.framework.Assert.fail(Assert.java:47)
	at junit.framework.Assert.failNotEquals(Assert.java:280)
	at junit.framework.Assert.assertEquals(Assert.java:64)
	at junit.framework.Assert.assertEquals(Assert.java:198)
	at junit.framework.Assert.assertEquals(Assert.java:204)
	at org.joda.time.TestMutablePeriod_Constructors.testConstructor_long_Chronology3(TestMutablePeriod_Constructors.java:321)

testConstructor_long_PeriodType_Chronology1(org.joda.time.TestMutablePeriod_Constructors)  Time elapsed: 0.001 sec  <<< ERROR!
java.lang.ArrayIndexOutOfBoundsException: -1
	at org.joda.time.base.BasePeriod.getValue(BasePeriod.java:329)
	at org.joda.time.PeriodType.getIndexedField(PeriodType.java:172)
	at org.joda.time.MutablePeriod.getYears(MutablePeriod.java:746)
	at org.joda.time.TestMutablePeriod_Constructors.testConstructor_long_PeriodType_Chronology1(TestMutablePeriod_Constructors.java:335)

testConstructor_long_PeriodType_Chronology2(org.joda.time.TestMutablePeriod_Constructors)  Time elapsed: 0 sec  <<< FAILURE!
junit.framework.AssertionFailedError: expected:<4> but was:<0>
	at junit.framework.Assert.fail(Assert.java:47)
	at junit.framework.Assert.failNotEquals(Assert.java:280)
	at junit.framework.Assert.assertEquals(Assert.java:64)
	at junit.framework.Assert.assertEquals(Assert.java:198)
	at junit.framework.Assert.assertEquals(Assert.java:204)
	at org.joda.time.TestMutablePeriod_Constructors.testConstructor_long_PeriodType_Chronology2(TestMutablePeriod_Constructors.java:355)

testConstructor_long_PeriodType_Chronology3(org.joda.time.TestMutablePeriod_Constructors)  Time elapsed: 0 sec  <<< FAILURE!
junit.framework.AssertionFailedError: expected:<101> but was:<0>
	at junit.framework.Assert.fail(Assert.java:47)
	at junit.framework.Assert.failNotEquals(Assert.java:280)
	at junit.framework.Assert.assertEquals(Assert.java:64)
	at junit.framework.Assert.assertEquals(Assert.java:198)
	at junit.framework.Assert.assertEquals(Assert.java:204)
	at org.joda.time.TestMutablePeriod_Constructors.testConstructor_long_PeriodType_Chronology3(TestMutablePeriod_Constructors.java:373)

testConstructor_long_PeriodType_Chronology4(org.joda.time.TestMutablePeriod_Constructors)  Time elapsed: 0.001 sec  <<< FAILURE!
junit.framework.AssertionFailedError: expected:<101> but was:<0>
	at junit.framework.Assert.fail(Assert.java:47)
	at junit.framework.Assert.failNotEquals(Assert.java:280)
	at junit.framework.Assert.assertEquals(Assert.java:64)
	at junit.framework.Assert.assertEquals(Assert.java:198)
	at junit.framework.Assert.assertEquals(Assert.java:204)
	at org.joda.time.TestMutablePeriod_Constructors.testConstructor_long_PeriodType_Chronology4(TestMutablePeriod_Constructors.java:390)

testConstructor_4int1(org.joda.time.TestMutablePeriod_Constructors)  Time elapsed: 0 sec  <<< FAILURE!
junit.framework.AssertionFailedError: expected:<5> but was:<0>
	at junit.framework.Assert.fail(Assert.java:47)
	at junit.framework.Assert.failNotEquals(Assert.java:280)
	at junit.framework.Assert.assertEquals(Assert.java:64)
	at junit.framework.Assert.assertEquals(Assert.java:198)
	at junit.framework.Assert.assertEquals(Assert.java:204)
	at org.joda.time.TestMutablePeriod_Constructors.testConstructor_4int1(TestMutablePeriod_Constructors.java:407)

testConstructor_8int1(org.joda.time.TestMutablePeriod_Constructors)  Time elapsed: 0 sec  <<< FAILURE!
junit.framework.AssertionFailedError: expected:<1> but was:<0>
	at junit.framework.Assert.fail(Assert.java:47)
	at junit.framework.Assert.failNotEquals(Assert.java:280)
	at junit.framework.Assert.assertEquals(Assert.java:64)
	at junit.framework.Assert.assertEquals(Assert.java:198)
	at junit.framework.Assert.assertEquals(Assert.java:204)
	at org.joda.time.TestMutablePeriod_Constructors.testConstructor_8int1(TestMutablePeriod_Constructors.java:420)

testConstructor_8int__PeriodType1(org.joda.time.TestMutablePeriod_Constructors)  Time elapsed: 0.003 sec  <<< FAILURE!
junit.framework.AssertionFailedError: expected:<1> but was:<0>
	at junit.framework.Assert.fail(Assert.java:47)
	at junit.framework.Assert.failNotEquals(Assert.java:280)
	at junit.framework.Assert.assertEquals(Assert.java:64)
	at junit.framework.Assert.assertEquals(Assert.java:198)
	at junit.framework.Assert.assertEquals(Assert.java:204)
	at org.joda.time.TestMutablePeriod_Constructors.testConstructor_8int__PeriodType1(TestMutablePeriod_Constructors.java:437)

testConstructor_8int__PeriodType2(org.joda.time.TestMutablePeriod_Constructors)  Time elapsed: 0 sec  <<< ERROR!
java.lang.ArrayIndexOutOfBoundsException: -1
	at org.joda.time.base.BasePeriod.getValue(BasePeriod.java:329)
	at org.joda.time.PeriodType.getIndexedField(PeriodType.java:172)
	at org.joda.time.MutablePeriod.getYears(MutablePeriod.java:746)
	at org.joda.time.TestMutablePeriod_Constructors.testConstructor_8int__PeriodType2(TestMutablePeriod_Constructors.java:450)

testConstructor_long_long_PeriodType1(org.joda.time.TestMutablePeriod_Constructors)  Time elapsed: 0 sec  <<< FAILURE!
junit.framework.AssertionFailedError: expected:<1> but was:<0>
	at junit.framework.Assert.fail(Assert.java:47)
	at junit.framework.Assert.failNotEquals(Assert.java:280)
	at junit.framework.Assert.assertEquals(Assert.java:64)
	at junit.framework.Assert.assertEquals(Assert.java:198)
	at junit.framework.Assert.assertEquals(Assert.java:204)
	at org.joda.time.TestMutablePeriod_Constructors.testConstructor_long_long_PeriodType1(TestMutablePeriod_Constructors.java:504)

testConstructor_long_long_PeriodType2(org.joda.time.TestMutablePeriod_Constructors)  Time elapsed: 0 sec  <<< ERROR!
java.lang.ArrayIndexOutOfBoundsException: -1
	at org.joda.time.base.BasePeriod.getValue(BasePeriod.java:329)
	at org.joda.time.PeriodType.getIndexedField(PeriodType.java:172)
	at org.joda.time.MutablePeriod.getYears(MutablePeriod.java:746)
	at org.joda.time.TestMutablePeriod_Constructors.testConstructor_long_long_PeriodType2(TestMutablePeriod_Constructors.java:519)

testConstructor_long_long_PeriodType3(org.joda.time.TestMutablePeriod_Constructors)  Time elapsed: 0 sec  <<< FAILURE!
junit.framework.AssertionFailedError: expected:<1> but was:<0>
	at junit.framework.Assert.fail(Assert.java:47)
	at junit.framework.Assert.failNotEquals(Assert.java:280)
	at junit.framework.Assert.assertEquals(Assert.java:64)
	at junit.framework.Assert.assertEquals(Assert.java:198)
	at junit.framework.Assert.assertEquals(Assert.java:204)
	at org.joda.time.TestMutablePeriod_Constructors.testConstructor_long_long_PeriodType3(TestMutablePeriod_Constructors.java:538)

testConstructor_long_long_PeriodType_Chronology1(org.joda.time.TestMutablePeriod_Constructors)  Time elapsed: 0 sec  <<< FAILURE!
junit.framework.AssertionFailedError: expected:<1> but was:<0>
	at junit.framework.Assert.fail(Assert.java:47)
	at junit.framework.Assert.failNotEquals(Assert.java:280)
	at junit.framework.Assert.assertEquals(Assert.java:64)
	at junit.framework.Assert.assertEquals(Assert.java:198)
	at junit.framework.Assert.assertEquals(Assert.java:204)
	at org.joda.time.TestMutablePeriod_Constructors.testConstructor_long_long_PeriodType_Chronology1(TestMutablePeriod_Constructors.java:581)

testConstructor_long_long_PeriodType_Chronology2(org.joda.time.TestMutablePeriod_Constructors)  Time elapsed: 0 sec  <<< FAILURE!
junit.framework.AssertionFailedError: expected:<1> but was:<0>
	at junit.framework.Assert.fail(Assert.java:47)
	at junit.framework.Assert.failNotEquals(Assert.java:280)
	at junit.framework.Assert.assertEquals(Assert.java:64)
	at junit.framework.Assert.assertEquals(Assert.java:198)
	at junit.framework.Assert.assertEquals(Assert.java:204)
	at org.joda.time.TestMutablePeriod_Constructors.testConstructor_long_long_PeriodType_Chronology2(TestMutablePeriod_Constructors.java:596)

testConstructor_RI_RI_PeriodType1(org.joda.time.TestMutablePeriod_Constructors)  Time elapsed: 0.001 sec  <<< FAILURE!
junit.framework.AssertionFailedError: expected:<1> but was:<0>
	at junit.framework.Assert.fail(Assert.java:47)
	at junit.framework.Assert.failNotEquals(Assert.java:280)
	at junit.framework.Assert.assertEquals(Assert.java:64)
	at junit.framework.Assert.assertEquals(Assert.java:198)
	at junit.framework.Assert.assertEquals(Assert.java:204)
	at org.joda.time.TestMutablePeriod_Constructors.testConstructor_RI_RI_PeriodType1(TestMutablePeriod_Constructors.java:688)

testConstructor_RI_RI_PeriodType2(org.joda.time.TestMutablePeriod_Constructors)  Time elapsed: 0 sec  <<< ERROR!
java.lang.ArrayIndexOutOfBoundsException: -1
	at org.joda.time.base.BasePeriod.getValue(BasePeriod.java:329)
	at org.joda.time.PeriodType.getIndexedField(PeriodType.java:172)
	at org.joda.time.MutablePeriod.getYears(MutablePeriod.java:746)
	at org.joda.time.TestMutablePeriod_Constructors.testConstructor_RI_RI_PeriodType2(TestMutablePeriod_Constructors.java:703)

testConstructor_RI_RI_PeriodType3(org.joda.time.TestMutablePeriod_Constructors)  Time elapsed: 0.001 sec  <<< FAILURE!
junit.framework.AssertionFailedError: expected:<1> but was:<0>
	at junit.framework.Assert.fail(Assert.java:47)
	at junit.framework.Assert.failNotEquals(Assert.java:280)
	at junit.framework.Assert.assertEquals(Assert.java:64)
	at junit.framework.Assert.assertEquals(Assert.java:198)
	at junit.framework.Assert.assertEquals(Assert.java:204)
	at org.joda.time.TestMutablePeriod_Constructors.testConstructor_RI_RI_PeriodType3(TestMutablePeriod_Constructors.java:722)

testConstructor_RI_RI_PeriodType4(org.joda.time.TestMutablePeriod_Constructors)  Time elapsed: 0.002 sec  <<< FAILURE!
junit.framework.AssertionFailedError: expected:<3> but was:<0>
	at junit.framework.Assert.fail(Assert.java:47)
	at junit.framework.Assert.failNotEquals(Assert.java:280)
	at junit.framework.Assert.assertEquals(Assert.java:64)
	at junit.framework.Assert.assertEquals(Assert.java:198)
	at junit.framework.Assert.assertEquals(Assert.java:204)
	at org.joda.time.TestMutablePeriod_Constructors.testConstructor_RI_RI_PeriodType4(TestMutablePeriod_Constructors.java:733)

testConstructor_RI_RD_PeriodType1(org.joda.time.TestMutablePeriod_Constructors)  Time elapsed: 0 sec  <<< FAILURE!
junit.framework.AssertionFailedError: expected:<1> but was:<0>
	at junit.framework.Assert.fail(Assert.java:47)
	at junit.framework.Assert.failNotEquals(Assert.java:280)
	at junit.framework.Assert.assertEquals(Assert.java:64)
	at junit.framework.Assert.assertEquals(Assert.java:198)
	at junit.framework.Assert.assertEquals(Assert.java:204)
	at org.joda.time.TestMutablePeriod_Constructors.testConstructor_RI_RD_PeriodType1(TestMutablePeriod_Constructors.java:797)

testConstructor_Object_PeriodType1(org.joda.time.TestMutablePeriod_Constructors)  Time elapsed: 0 sec  <<< FAILURE!
junit.framework.AssertionFailedError: expected:<1> but was:<0>
	at junit.framework.Assert.fail(Assert.java:47)
	at junit.framework.Assert.failNotEquals(Assert.java:280)
	at junit.framework.Assert.assertEquals(Assert.java:64)
	at junit.framework.Assert.assertEquals(Assert.java:198)
	at junit.framework.Assert.assertEquals(Assert.java:204)
	at org.joda.time.TestMutablePeriod_Constructors.testConstructor_Object_PeriodType1(TestMutablePeriod_Constructors.java:886)

testConstructor_Object_PeriodType2(org.joda.time.TestMutablePeriod_Constructors)  Time elapsed: 0 sec  <<< ERROR!
java.lang.ArrayIndexOutOfBoundsException: -1
	at org.joda.time.base.BasePeriod.getValue(BasePeriod.java:329)
	at org.joda.time.PeriodType.getIndexedField(PeriodType.java:172)
	at org.joda.time.MutablePeriod.getWeeks(MutablePeriod.java:764)
	at org.joda.time.TestMutablePeriod_Constructors.testConstructor_Object_PeriodType2(TestMutablePeriod_Constructors.java:901)

testConstructor_Object_PeriodType3(org.joda.time.TestMutablePeriod_Constructors)  Time elapsed: 0 sec  <<< ERROR!
java.lang.ArrayIndexOutOfBoundsException: -1
	at org.joda.time.base.BasePeriod.getValue(BasePeriod.java:329)
	at org.joda.time.PeriodType.getIndexedField(PeriodType.java:172)
	at org.joda.time.MutablePeriod.getWeeks(MutablePeriod.java:764)
	at org.joda.time.TestMutablePeriod_Constructors.testConstructor_Object_PeriodType3(TestMutablePeriod_Constructors.java:914)

testConstructor_Object_PeriodType4(org.joda.time.TestMutablePeriod_Constructors)  Time elapsed: 0 sec  <<< ERROR!
java.lang.ArrayIndexOutOfBoundsException: -1
	at org.joda.time.base.BasePeriod.getValue(BasePeriod.java:329)
	at org.joda.time.PeriodType.getIndexedField(PeriodType.java:172)
	at org.joda.time.MutablePeriod.getYears(MutablePeriod.java:746)
	at org.joda.time.TestMutablePeriod_Constructors.testConstructor_Object_PeriodType4(TestMutablePeriod_Constructors.java:925)

testConstructor_long3(org.joda.time.TestMutablePeriod_Constructors)  Time elapsed: 0 sec  <<< FAILURE!
junit.framework.AssertionFailedError: expected:<10805> but was:<0>
	at junit.framework.Assert.fail(Assert.java:47)
	at junit.framework.Assert.failNotEquals(Assert.java:280)
	at junit.framework.Assert.assertEquals(Assert.java:64)
	at junit.framework.Assert.assertEquals(Assert.java:198)
	at junit.framework.Assert.assertEquals(Assert.java:204)
	at org.joda.time.TestMutablePeriod_Constructors.testConstructor_long3(TestMutablePeriod_Constructors.java:200)

testConstructor_long_PeriodType1(org.joda.time.TestMutablePeriod_Constructors)  Time elapsed: 0 sec  <<< FAILURE!
junit.framework.AssertionFailedError: expected:<101> but was:<0>
	at junit.framework.Assert.fail(Assert.java:47)
	at junit.framework.Assert.failNotEquals(Assert.java:280)
	at junit.framework.Assert.assertEquals(Assert.java:64)
	at junit.framework.Assert.assertEquals(Assert.java:198)
	at junit.framework.Assert.assertEquals(Assert.java:204)
	at org.joda.time.TestMutablePeriod_Constructors.testConstructor_long_PeriodType1(TestMutablePeriod_Constructors.java:218)

testConstructor_long_PeriodType2(org.joda.time.TestMutablePeriod_Constructors)  Time elapsed: 0.001 sec  <<< ERROR!
java.lang.ArrayIndexOutOfBoundsException: -1
	at org.joda.time.base.BasePeriod.getValue(BasePeriod.java:329)
	at org.joda.time.PeriodType.getIndexedField(PeriodType.java:172)
	at org.joda.time.MutablePeriod.getYears(MutablePeriod.java:746)
	at org.joda.time.TestMutablePeriod_Constructors.testConstructor_long_PeriodType2(TestMutablePeriod_Constructors.java:231)

testConstructor_long_PeriodType3(org.joda.time.TestMutablePeriod_Constructors)  Time elapsed: 0 sec  <<< FAILURE!
junit.framework.AssertionFailedError: expected:<101> but was:<0>
	at junit.framework.Assert.fail(Assert.java:47)
	at junit.framework.Assert.failNotEquals(Assert.java:280)
	at junit.framework.Assert.assertEquals(Assert.java:64)
	at junit.framework.Assert.assertEquals(Assert.java:198)
	at junit.framework.Assert.assertEquals(Assert.java:204)
	at org.joda.time.TestMutablePeriod_Constructors.testConstructor_long_PeriodType3(TestMutablePeriod_Constructors.java:252)

testConstructor_long_PeriodType4(org.joda.time.TestMutablePeriod_Constructors)  Time elapsed: 0.001 sec  <<< FAILURE!
junit.framework.AssertionFailedError: expected:<5> but was:<0>
	at junit.framework.Assert.fail(Assert.java:47)
	at junit.framework.Assert.failNotEquals(Assert.java:280)
	at junit.framework.Assert.assertEquals(Assert.java:64)
	at junit.framework.Assert.assertEquals(Assert.java:198)
	at junit.framework.Assert.assertEquals(Assert.java:204)
	at org.joda.time.TestMutablePeriod_Constructors.testConstructor_long_PeriodType4(TestMutablePeriod_Constructors.java:269)

testConstructor_long_Chronology1(org.joda.time.TestMutablePeriod_Constructors)  Time elapsed: 0 sec  <<< FAILURE!
junit.framework.AssertionFailedError: expected:<101> but was:<0>
	at junit.framework.Assert.fail(Assert.java:47)
	at junit.framework.Assert.failNotEquals(Assert.java:280)
	at junit.framework.Assert.assertEquals(Assert.java:64)
	at junit.framework.Assert.assertEquals(Assert.java:198)
	at junit.framework.Assert.assertEquals(Assert.java:204)
	at org.joda.time.TestMutablePeriod_Constructors.testConstructor_long_Chronology1(TestMutablePeriod_Constructors.java:287)

testConstructor_RI_RD1(org.joda.time.TestMutablePeriod_Constructors)  Time elapsed: 0 sec  <<< FAILURE!
junit.framework.AssertionFailedError: expected:<1> but was:<0>
	at junit.framework.Assert.fail(Assert.java:47)
	at junit.framework.Assert.failNotEquals(Assert.java:280)
	at junit.framework.Assert.assertEquals(Assert.java:64)
	at junit.framework.Assert.assertEquals(Assert.java:198)
	at junit.framework.Assert.assertEquals(Assert.java:204)
	at org.joda.time.TestMutablePeriod_Constructors.testConstructor_RI_RD1(TestMutablePeriod_Constructors.java:765)

testConstructor_Object_Chronology1(org.joda.time.TestMutablePeriod_Constructors)  Time elapsed: 0 sec  <<< FAILURE!
junit.framework.AssertionFailedError: expected:<10805> but was:<0>
	at junit.framework.Assert.fail(Assert.java:47)
	at junit.framework.Assert.failNotEquals(Assert.java:280)
	at junit.framework.Assert.assertEquals(Assert.java:64)
	at junit.framework.Assert.assertEquals(Assert.java:198)
	at junit.framework.Assert.assertEquals(Assert.java:204)
	at org.joda.time.TestMutablePeriod_Constructors.testConstructor_Object_Chronology1(TestMutablePeriod_Constructors.java:948)

testConstructor_Object_Chronology2(org.joda.time.TestMutablePeriod_Constructors)  Time elapsed: 0 sec  <<< FAILURE!
junit.framework.AssertionFailedError: expected:<64> but was:<0>
	at junit.framework.Assert.fail(Assert.java:47)
	at junit.framework.Assert.failNotEquals(Assert.java:280)
	at junit.framework.Assert.assertEquals(Assert.java:64)
	at junit.framework.Assert.assertEquals(Assert.java:198)
	at junit.framework.Assert.assertEquals(Assert.java:204)
	at org.joda.time.TestMutablePeriod_Constructors.testConstructor_Object_Chronology2(TestMutablePeriod_Constructors.java:964)

testConstructor_long_long2(org.joda.time.TestMutablePeriod_Constructors)  Time elapsed: 0.001 sec  <<< FAILURE!
junit.framework.AssertionFailedError: expected:<1> but was:<0>
	at junit.framework.Assert.fail(Assert.java:47)
	at junit.framework.Assert.failNotEquals(Assert.java:280)
	at junit.framework.Assert.assertEquals(Assert.java:64)
	at junit.framework.Assert.assertEquals(Assert.java:198)
	at junit.framework.Assert.assertEquals(Assert.java:204)
	at org.joda.time.TestMutablePeriod_Constructors.testConstructor_long_long2(TestMutablePeriod_Constructors.java:488)

testSetPeriod_long_long_NoYears(org.joda.time.TestMutablePeriod_Updates)  Time elapsed: 0.001 sec  <<< ERROR!
java.lang.ArrayIndexOutOfBoundsException: -1
	at org.joda.time.base.BasePeriod.getValue(BasePeriod.java:329)
	at org.joda.time.PeriodType.getIndexedField(PeriodType.java:172)
	at org.joda.time.MutablePeriod.getYears(MutablePeriod.java:746)
	at org.joda.time.TestMutablePeriod_Updates.testSetPeriod_long_long_NoYears(TestMutablePeriod_Updates.java:607)

testSetPeriod_long_long_NoMonths(org.joda.time.TestMutablePeriod_Updates)  Time elapsed: 0.001 sec  <<< FAILURE!
junit.framework.AssertionFailedError: expected:<1> but was:<0>
	at junit.framework.Assert.fail(Assert.java:47)
	at junit.framework.Assert.failNotEquals(Assert.java:280)
	at junit.framework.Assert.assertEquals(Assert.java:64)
	at junit.framework.Assert.assertEquals(Assert.java:198)
	at junit.framework.Assert.assertEquals(Assert.java:204)
	at org.joda.time.TestMutablePeriod_Updates.testSetPeriod_long_long_NoMonths(TestMutablePeriod_Updates.java:622)

testSetPeriod_long_long_NoWeeks(org.joda.time.TestMutablePeriod_Updates)  Time elapsed: 0 sec  <<< FAILURE!
junit.framework.AssertionFailedError: expected:<1> but was:<0>
	at junit.framework.Assert.fail(Assert.java:47)
	at junit.framework.Assert.failNotEquals(Assert.java:280)
	at junit.framework.Assert.assertEquals(Assert.java:64)
	at junit.framework.Assert.assertEquals(Assert.java:198)
	at junit.framework.Assert.assertEquals(Assert.java:204)
	at org.joda.time.TestMutablePeriod_Updates.testSetPeriod_long_long_NoWeeks(TestMutablePeriod_Updates.java:637)

testSetPeriod_long_long_NoDays(org.joda.time.TestMutablePeriod_Updates)  Time elapsed: 0 sec  <<< FAILURE!
junit.framework.AssertionFailedError: expected:<1> but was:<0>
	at junit.framework.Assert.fail(Assert.java:47)
	at junit.framework.Assert.failNotEquals(Assert.java:280)
	at junit.framework.Assert.assertEquals(Assert.java:64)
	at junit.framework.Assert.assertEquals(Assert.java:198)
	at junit.framework.Assert.assertEquals(Assert.java:204)
	at org.joda.time.TestMutablePeriod_Updates.testSetPeriod_long_long_NoDays(TestMutablePeriod_Updates.java:652)

testSetPeriod_long_long_NoHours(org.joda.time.TestMutablePeriod_Updates)  Time elapsed: 0 sec  <<< FAILURE!
junit.framework.AssertionFailedError: expected:<1> but was:<0>
	at junit.framework.Assert.fail(Assert.java:47)
	at junit.framework.Assert.failNotEquals(Assert.java:280)
	at junit.framework.Assert.assertEquals(Assert.java:64)
	at junit.framework.Assert.assertEquals(Assert.java:198)
	at junit.framework.Assert.assertEquals(Assert.java:204)
	at org.joda.time.TestMutablePeriod_Updates.testSetPeriod_long_long_NoHours(TestMutablePeriod_Updates.java:667)

testSetPeriod_long_long_NoMinutes(org.joda.time.TestMutablePeriod_Updates)  Time elapsed: 0.001 sec  <<< FAILURE!
junit.framework.AssertionFailedError: expected:<1> but was:<0>
	at junit.framework.Assert.fail(Assert.java:47)
	at junit.framework.Assert.failNotEquals(Assert.java:280)
	at junit.framework.Assert.assertEquals(Assert.java:64)
	at junit.framework.Assert.assertEquals(Assert.java:198)
	at junit.framework.Assert.assertEquals(Assert.java:204)
	at org.joda.time.TestMutablePeriod_Updates.testSetPeriod_long_long_NoMinutes(TestMutablePeriod_Updates.java:682)

testSetPeriod_long_long_NoSeconds(org.joda.time.TestMutablePeriod_Updates)  Time elapsed: 0.001 sec  <<< FAILURE!
junit.framework.AssertionFailedError: expected:<1> but was:<0>
	at junit.framework.Assert.fail(Assert.java:47)
	at junit.framework.Assert.failNotEquals(Assert.java:280)
	at junit.framework.Assert.assertEquals(Assert.java:64)
	at junit.framework.Assert.assertEquals(Assert.java:198)
	at junit.framework.Assert.assertEquals(Assert.java:204)
	at org.joda.time.TestMutablePeriod_Updates.testSetPeriod_long_long_NoSeconds(TestMutablePeriod_Updates.java:697)

testSetPeriod_long_long_NoMillis(org.joda.time.TestMutablePeriod_Updates)  Time elapsed: 0 sec  <<< FAILURE!
junit.framework.AssertionFailedError: expected:<1> but was:<0>
	at junit.framework.Assert.fail(Assert.java:47)
	at junit.framework.Assert.failNotEquals(Assert.java:280)
	at junit.framework.Assert.assertEquals(Assert.java:64)
	at junit.framework.Assert.assertEquals(Assert.java:198)
	at junit.framework.Assert.assertEquals(Assert.java:204)
	at org.joda.time.TestMutablePeriod_Updates.testSetPeriod_long_long_NoMillis(TestMutablePeriod_Updates.java:712)

testSetPeriod_RI_RI1(org.joda.time.TestMutablePeriod_Updates)  Time elapsed: 0.001 sec  <<< FAILURE!
junit.framework.AssertionFailedError: expected:<1> but was:<0>
	at junit.framework.Assert.fail(Assert.java:47)
	at junit.framework.Assert.failNotEquals(Assert.java:280)
	at junit.framework.Assert.assertEquals(Assert.java:64)
	at junit.framework.Assert.assertEquals(Assert.java:198)
	at junit.framework.Assert.assertEquals(Assert.java:204)
	at org.joda.time.TestMutablePeriod_Updates.testSetPeriod_RI_RI1(TestMutablePeriod_Updates.java:728)

testSetPeriod_RI_RI2(org.joda.time.TestMutablePeriod_Updates)  Time elapsed: 0 sec  <<< FAILURE!
junit.framework.AssertionFailedError: expected:<-1> but was:<0>
	at junit.framework.Assert.fail(Assert.java:47)
	at junit.framework.Assert.failNotEquals(Assert.java:280)
	at junit.framework.Assert.assertEquals(Assert.java:64)
	at junit.framework.Assert.assertEquals(Assert.java:198)
	at junit.framework.Assert.assertEquals(Assert.java:204)
	at org.joda.time.TestMutablePeriod_Updates.testSetPeriod_RI_RI2(TestMutablePeriod_Updates.java:743)

testSetPeriod_RInterval1(org.joda.time.TestMutablePeriod_Updates)  Time elapsed: 0 sec  <<< FAILURE!
junit.framework.AssertionFailedError: expected:<1> but was:<0>
	at junit.framework.Assert.fail(Assert.java:47)
	at junit.framework.Assert.failNotEquals(Assert.java:280)
	at junit.framework.Assert.assertEquals(Assert.java:64)
	at junit.framework.Assert.assertEquals(Assert.java:198)
	at junit.framework.Assert.assertEquals(Assert.java:204)
	at org.joda.time.TestMutablePeriod_Updates.testSetPeriod_RInterval1(TestMutablePeriod_Updates.java:773)

testSetPeriod_long1(org.joda.time.TestMutablePeriod_Updates)  Time elapsed: 0.001 sec  <<< FAILURE!
junit.framework.AssertionFailedError: expected:<100> but was:<0>
	at junit.framework.Assert.fail(Assert.java:47)
	at junit.framework.Assert.failNotEquals(Assert.java:280)
	at junit.framework.Assert.assertEquals(Assert.java:64)
	at junit.framework.Assert.assertEquals(Assert.java:198)
	at junit.framework.Assert.assertEquals(Assert.java:204)
	at org.joda.time.TestMutablePeriod_Updates.testSetPeriod_long1(TestMutablePeriod_Updates.java:807)

testSetPeriod_long2(org.joda.time.TestMutablePeriod_Updates)  Time elapsed: 0 sec  <<< FAILURE!
junit.framework.AssertionFailedError: expected:<10805> but was:<0>
	at junit.framework.Assert.fail(Assert.java:47)
	at junit.framework.Assert.failNotEquals(Assert.java:280)
	at junit.framework.Assert.assertEquals(Assert.java:64)
	at junit.framework.Assert.assertEquals(Assert.java:198)
	at junit.framework.Assert.assertEquals(Assert.java:204)
	at org.joda.time.TestMutablePeriod_Updates.testSetPeriod_long2(TestMutablePeriod_Updates.java:822)

testAdd_RD2(org.joda.time.TestMutablePeriod_Updates)  Time elapsed: 0 sec  <<< ERROR!
java.lang.ArrayIndexOutOfBoundsException: -1
	at org.joda.time.base.BasePeriod.getValue(BasePeriod.java:329)
	at org.joda.time.PeriodType.getIndexedField(PeriodType.java:172)
	at org.joda.time.MutablePeriod.getWeeks(MutablePeriod.java:764)
	at org.joda.time.TestMutablePeriod_Updates.testAdd_RD2(TestMutablePeriod_Updates.java:1212)

testAdd_long1(org.joda.time.TestMutablePeriod_Updates)  Time elapsed: 0.001 sec  <<< FAILURE!
junit.framework.AssertionFailedError: expected:<200> but was:<0>
	at junit.framework.Assert.fail(Assert.java:47)
	at junit.framework.Assert.failNotEquals(Assert.java:280)
	at junit.framework.Assert.assertEquals(Assert.java:64)
	at junit.framework.Assert.assertEquals(Assert.java:198)
	at junit.framework.Assert.assertEquals(Assert.java:204)
	at org.joda.time.TestMutablePeriod_Updates.testAdd_long1(TestMutablePeriod_Updates.java:1101)

testAdd_RD1(org.joda.time.TestMutablePeriod_Updates)  Time elapsed: 0 sec  <<< FAILURE!
junit.framework.AssertionFailedError: expected:<200> but was:<0>
	at junit.framework.Assert.fail(Assert.java:47)
	at junit.framework.Assert.failNotEquals(Assert.java:280)
	at junit.framework.Assert.assertEquals(Assert.java:64)
	at junit.framework.Assert.assertEquals(Assert.java:198)
	at junit.framework.Assert.assertEquals(Assert.java:204)
	at org.joda.time.TestMutablePeriod_Updates.testAdd_RD1(TestMutablePeriod_Updates.java:1199)

testAddSeconds(org.joda.time.TestMutablePeriod_Updates)  Time elapsed: 0.001 sec  <<< FAILURE!
junit.framework.AssertionFailedError: expected:<17> but was:<0>
	at junit.framework.Assert.fail(Assert.java:47)
	at junit.framework.Assert.failNotEquals(Assert.java:280)
	at junit.framework.Assert.assertEquals(Assert.java:64)
	at junit.framework.Assert.assertEquals(Assert.java:198)
	at junit.framework.Assert.assertEquals(Assert.java:204)
	at org.joda.time.TestMutablePeriod_Updates.testAddSeconds(TestMutablePeriod_Updates.java:211)

testSetYears(org.joda.time.TestMutablePeriod_Updates)  Time elapsed: 0 sec  <<< FAILURE!
junit.framework.AssertionFailedError: expected:<10> but was:<0>
	at junit.framework.Assert.fail(Assert.java:47)
	at junit.framework.Assert.failNotEquals(Assert.java:280)
	at junit.framework.Assert.assertEquals(Assert.java:64)
	at junit.framework.Assert.assertEquals(Assert.java:198)
	at junit.framework.Assert.assertEquals(Assert.java:204)
	at org.joda.time.TestMutablePeriod_Updates.testSetYears(TestMutablePeriod_Updates.java:241)

testSetMonths(org.joda.time.TestMutablePeriod_Updates)  Time elapsed: 0 sec  <<< FAILURE!
junit.framework.AssertionFailedError: expected:<10> but was:<0>
	at junit.framework.Assert.fail(Assert.java:47)
	at junit.framework.Assert.failNotEquals(Assert.java:280)
	at junit.framework.Assert.assertEquals(Assert.java:64)
	at junit.framework.Assert.assertEquals(Assert.java:198)
	at junit.framework.Assert.assertEquals(Assert.java:204)
	at org.joda.time.TestMutablePeriod_Updates.testSetMonths(TestMutablePeriod_Updates.java:266)

testSetWeeks(org.joda.time.TestMutablePeriod_Updates)  Time elapsed: 0.001 sec  <<< FAILURE!
junit.framework.AssertionFailedError: expected:<10> but was:<0>
	at junit.framework.Assert.fail(Assert.java:47)
	at junit.framework.Assert.failNotEquals(Assert.java:280)
	at junit.framework.Assert.assertEquals(Assert.java:64)
	at junit.framework.Assert.assertEquals(Assert.java:198)
	at junit.framework.Assert.assertEquals(Assert.java:204)
	at org.joda.time.TestMutablePeriod_Updates.testSetWeeks(TestMutablePeriod_Updates.java:285)

testSetDays(org.joda.time.TestMutablePeriod_Updates)  Time elapsed: 0 sec  <<< FAILURE!
junit.framework.AssertionFailedError: expected:<10> but was:<0>
	at junit.framework.Assert.fail(Assert.java:47)
	at junit.framework.Assert.failNotEquals(Assert.java:280)
	at junit.framework.Assert.assertEquals(Assert.java:64)
	at junit.framework.Assert.assertEquals(Assert.java:198)
	at junit.framework.Assert.assertEquals(Assert.java:204)
	at org.joda.time.TestMutablePeriod_Updates.testSetDays(TestMutablePeriod_Updates.java:304)

testSetHours(org.joda.time.TestMutablePeriod_Updates)  Time elapsed: 0 sec  <<< FAILURE!
junit.framework.AssertionFailedError: expected:<10> but was:<0>
	at junit.framework.Assert.fail(Assert.java:47)
	at junit.framework.Assert.failNotEquals(Assert.java:280)
	at junit.framework.Assert.assertEquals(Assert.java:64)
	at junit.framework.Assert.assertEquals(Assert.java:198)
	at junit.framework.Assert.assertEquals(Assert.java:204)
	at org.joda.time.TestMutablePeriod_Updates.testSetHours(TestMutablePeriod_Updates.java:323)

testSetMinutes(org.joda.time.TestMutablePeriod_Updates)  Time elapsed: 0.001 sec  <<< FAILURE!
junit.framework.AssertionFailedError: expected:<10> but was:<0>
	at junit.framework.Assert.fail(Assert.java:47)
	at junit.framework.Assert.failNotEquals(Assert.java:280)
	at junit.framework.Assert.assertEquals(Assert.java:64)
	at junit.framework.Assert.assertEquals(Assert.java:198)
	at junit.framework.Assert.assertEquals(Assert.java:204)
	at org.joda.time.TestMutablePeriod_Updates.testSetMinutes(TestMutablePeriod_Updates.java:342)

testSetSeconds(org.joda.time.TestMutablePeriod_Updates)  Time elapsed: 0 sec  <<< FAILURE!
junit.framework.AssertionFailedError: expected:<10> but was:<0>
	at junit.framework.Assert.fail(Assert.java:47)
	at junit.framework.Assert.failNotEquals(Assert.java:280)
	at junit.framework.Assert.assertEquals(Assert.java:64)
	at junit.framework.Assert.assertEquals(Assert.java:198)
	at junit.framework.Assert.assertEquals(Assert.java:204)
	at org.joda.time.TestMutablePeriod_Updates.testSetSeconds(TestMutablePeriod_Updates.java:361)

testSetMillis(org.joda.time.TestMutablePeriod_Updates)  Time elapsed: 0 sec  <<< FAILURE!
junit.framework.AssertionFailedError: expected:<10> but was:<0>
	at junit.framework.Assert.fail(Assert.java:47)
	at junit.framework.Assert.failNotEquals(Assert.java:280)
	at junit.framework.Assert.assertEquals(Assert.java:64)
	at junit.framework.Assert.assertEquals(Assert.java:198)
	at junit.framework.Assert.assertEquals(Assert.java:204)
	at org.joda.time.TestMutablePeriod_Updates.testSetMillis(TestMutablePeriod_Updates.java:380)

testSet_Field(org.joda.time.TestMutablePeriod_Updates)  Time elapsed: 0.001 sec  <<< FAILURE!
junit.framework.AssertionFailedError: expected:<10> but was:<0>
	at junit.framework.Assert.fail(Assert.java:47)
	at junit.framework.Assert.failNotEquals(Assert.java:280)
	at junit.framework.Assert.assertEquals(Assert.java:64)
	at junit.framework.Assert.assertEquals(Assert.java:198)
	at junit.framework.Assert.assertEquals(Assert.java:204)
	at org.joda.time.TestMutablePeriod_Updates.testSet_Field(TestMutablePeriod_Updates.java:399)

testAdd_Field(org.joda.time.TestMutablePeriod_Updates)  Time elapsed: 0 sec  <<< FAILURE!
junit.framework.AssertionFailedError: expected:<11> but was:<0>
	at junit.framework.Assert.fail(Assert.java:47)
	at junit.framework.Assert.failNotEquals(Assert.java:280)
	at junit.framework.Assert.assertEquals(Assert.java:64)
	at junit.framework.Assert.assertEquals(Assert.java:198)
	at junit.framework.Assert.assertEquals(Assert.java:204)
	at org.joda.time.TestMutablePeriod_Updates.testAdd_Field(TestMutablePeriod_Updates.java:412)

testSetPeriod_8ints1(org.joda.time.TestMutablePeriod_Updates)  Time elapsed: 0 sec  <<< FAILURE!
junit.framework.AssertionFailedError: expected:<11> but was:<0>
	at junit.framework.Assert.fail(Assert.java:47)
	at junit.framework.Assert.failNotEquals(Assert.java:280)
	at junit.framework.Assert.assertEquals(Assert.java:64)
	at junit.framework.Assert.assertEquals(Assert.java:198)
	at junit.framework.Assert.assertEquals(Assert.java:204)
	at org.joda.time.TestMutablePeriod_Updates.testSetPeriod_8ints1(TestMutablePeriod_Updates.java:436)

testSetPeriod_8ints2(org.joda.time.TestMutablePeriod_Updates)  Time elapsed: 0 sec  <<< ERROR!
java.lang.ArrayIndexOutOfBoundsException: -1
	at org.joda.time.base.BasePeriod.getValue(BasePeriod.java:329)
	at org.joda.time.PeriodType.getIndexedField(PeriodType.java:172)
	at org.joda.time.MutablePeriod.getYears(MutablePeriod.java:746)
	at org.joda.time.TestMutablePeriod_Updates.testSetPeriod_8ints2(TestMutablePeriod_Updates.java:452)

testSetPeriod_8ints3(org.joda.time.TestMutablePeriod_Updates)  Time elapsed: 0 sec  <<< ERROR!
java.lang.ArrayIndexOutOfBoundsException: -1
	at org.joda.time.base.BasePeriod.getValue(BasePeriod.java:329)
	at org.joda.time.PeriodType.getIndexedField(PeriodType.java:172)
	at org.joda.time.MutablePeriod.getYears(MutablePeriod.java:746)
	at org.joda.time.TestMutablePeriod_Updates.testSetPeriod_8ints3(TestMutablePeriod_Updates.java:465)

testSetPeriod_8ints4(org.joda.time.TestMutablePeriod_Updates)  Time elapsed: 0.001 sec  <<< FAILURE!
junit.framework.AssertionFailedError: expected:<11> but was:<0>
	at junit.framework.Assert.fail(Assert.java:47)
	at junit.framework.Assert.failNotEquals(Assert.java:280)
	at junit.framework.Assert.assertEquals(Assert.java:64)
	at junit.framework.Assert.assertEquals(Assert.java:198)
	at junit.framework.Assert.assertEquals(Assert.java:204)
	at org.joda.time.TestMutablePeriod_Updates.testSetPeriod_8ints4(TestMutablePeriod_Updates.java:478)

testSetPeriod_RP1(org.joda.time.TestMutablePeriod_Updates)  Time elapsed: 0 sec  <<< FAILURE!
junit.framework.AssertionFailedError: expected:<11> but was:<0>
	at junit.framework.Assert.fail(Assert.java:47)
	at junit.framework.Assert.failNotEquals(Assert.java:280)
	at junit.framework.Assert.assertEquals(Assert.java:64)
	at junit.framework.Assert.assertEquals(Assert.java:198)
	at junit.framework.Assert.assertEquals(Assert.java:204)
	at org.joda.time.TestMutablePeriod_Updates.testSetPeriod_RP1(TestMutablePeriod_Updates.java:492)

testSetPeriod_RP2(org.joda.time.TestMutablePeriod_Updates)  Time elapsed: 0 sec  <<< ERROR!
java.lang.ArrayIndexOutOfBoundsException: -1
	at org.joda.time.base.BasePeriod.getValue(BasePeriod.java:329)
	at org.joda.time.PeriodType.getIndexedField(PeriodType.java:172)
	at org.joda.time.MutablePeriod.getYears(MutablePeriod.java:746)
	at org.joda.time.TestMutablePeriod_Updates.testSetPeriod_RP2(TestMutablePeriod_Updates.java:508)

testSetPeriod_RP3(org.joda.time.TestMutablePeriod_Updates)  Time elapsed: 0.001 sec  <<< ERROR!
java.lang.ArrayIndexOutOfBoundsException: -1
	at org.joda.time.base.BasePeriod.getValue(BasePeriod.java:329)
	at org.joda.time.PeriodType.getIndexedField(PeriodType.java:172)
	at org.joda.time.MutablePeriod.getYears(MutablePeriod.java:746)
	at org.joda.time.TestMutablePeriod_Updates.testSetPeriod_RP3(TestMutablePeriod_Updates.java:521)

testSetPeriod_RP4(org.joda.time.TestMutablePeriod_Updates)  Time elapsed: 0 sec  <<< FAILURE!
junit.framework.AssertionFailedError: expected:<11> but was:<0>
	at junit.framework.Assert.fail(Assert.java:47)
	at junit.framework.Assert.failNotEquals(Assert.java:280)
	at junit.framework.Assert.assertEquals(Assert.java:64)
	at junit.framework.Assert.assertEquals(Assert.java:198)
	at junit.framework.Assert.assertEquals(Assert.java:204)
	at org.joda.time.TestMutablePeriod_Updates.testSetPeriod_RP4(TestMutablePeriod_Updates.java:534)

testSetPeriod_long_long1(org.joda.time.TestMutablePeriod_Updates)  Time elapsed: 0.001 sec  <<< FAILURE!
junit.framework.AssertionFailedError: expected:<1> but was:<0>
	at junit.framework.Assert.fail(Assert.java:47)
	at junit.framework.Assert.failNotEquals(Assert.java:280)
	at junit.framework.Assert.assertEquals(Assert.java:64)
	at junit.framework.Assert.assertEquals(Assert.java:198)
	at junit.framework.Assert.assertEquals(Assert.java:204)
	at org.joda.time.TestMutablePeriod_Updates.testSetPeriod_long_long1(TestMutablePeriod_Updates.java:563)

testSetPeriod_long_long2(org.joda.time.TestMutablePeriod_Updates)  Time elapsed: 0 sec  <<< FAILURE!
junit.framework.AssertionFailedError: expected:<-1> but was:<0>
	at junit.framework.Assert.fail(Assert.java:47)
	at junit.framework.Assert.failNotEquals(Assert.java:280)
	at junit.framework.Assert.assertEquals(Assert.java:64)
	at junit.framework.Assert.assertEquals(Assert.java:198)
	at junit.framework.Assert.assertEquals(Assert.java:204)
	at org.joda.time.TestMutablePeriod_Updates.testSetPeriod_long_long2(TestMutablePeriod_Updates.java:578)

testAdd_long2(org.joda.time.TestMutablePeriod_Updates)  Time elapsed: 0.001 sec  <<< FAILURE!
junit.framework.AssertionFailedError: expected:<10805> but was:<0>
	at junit.framework.Assert.fail(Assert.java:47)
	at junit.framework.Assert.failNotEquals(Assert.java:280)
	at junit.framework.Assert.assertEquals(Assert.java:64)
	at junit.framework.Assert.assertEquals(Assert.java:198)
	at junit.framework.Assert.assertEquals(Assert.java:204)
	at org.joda.time.TestMutablePeriod_Updates.testAdd_long2(TestMutablePeriod_Updates.java:1117)

testSetPeriod_RD1(org.joda.time.TestMutablePeriod_Updates)  Time elapsed: 0 sec  <<< FAILURE!
junit.framework.AssertionFailedError: expected:<100> but was:<0>
	at junit.framework.Assert.fail(Assert.java:47)
	at junit.framework.Assert.failNotEquals(Assert.java:280)
	at junit.framework.Assert.assertEquals(Assert.java:64)
	at junit.framework.Assert.assertEquals(Assert.java:198)
	at junit.framework.Assert.assertEquals(Assert.java:204)
	at org.joda.time.TestMutablePeriod_Updates.testSetPeriod_RD1(TestMutablePeriod_Updates.java:1025)

testSetPeriod_RD2(org.joda.time.TestMutablePeriod_Updates)  Time elapsed: 0 sec  <<< FAILURE!
junit.framework.AssertionFailedError: expected:<10805> but was:<0>
	at junit.framework.Assert.fail(Assert.java:47)
	at junit.framework.Assert.failNotEquals(Assert.java:280)
	at junit.framework.Assert.assertEquals(Assert.java:64)
	at junit.framework.Assert.assertEquals(Assert.java:198)
	at junit.framework.Assert.assertEquals(Assert.java:204)
	at org.joda.time.TestMutablePeriod_Updates.testSetPeriod_RD2(TestMutablePeriod_Updates.java:1041)

testAdd_8ints1(org.joda.time.TestMutablePeriod_Updates)  Time elapsed: 0 sec  <<< FAILURE!
junit.framework.AssertionFailedError: expected:<1> but was:<0>
	at junit.framework.Assert.fail(Assert.java:47)
	at junit.framework.Assert.failNotEquals(Assert.java:280)
	at junit.framework.Assert.assertEquals(Assert.java:64)
	at junit.framework.Assert.assertEquals(Assert.java:198)
	at junit.framework.Assert.assertEquals(Assert.java:204)
	at org.joda.time.TestMutablePeriod_Updates.testAdd_8ints1(TestMutablePeriod_Updates.java:1064)

testAdd_8ints2(org.joda.time.TestMutablePeriod_Updates)  Time elapsed: 0 sec  <<< ERROR!
java.lang.ArrayIndexOutOfBoundsException: -1
	at org.joda.time.base.BasePeriod.getValue(BasePeriod.java:329)
	at org.joda.time.PeriodType.getIndexedField(PeriodType.java:172)
	at org.joda.time.MutablePeriod.getWeeks(MutablePeriod.java:764)
	at org.joda.time.MutablePeriod.add(MutablePeriod.java:657)
	at org.joda.time.TestMutablePeriod_Updates.testAdd_8ints2(TestMutablePeriod_Updates.java:1077)

testAdd_long3(org.joda.time.TestMutablePeriod_Updates)  Time elapsed: 0.001 sec  <<< FAILURE!
junit.framework.AssertionFailedError: expected:<1> but was:<0>
	at junit.framework.Assert.fail(Assert.java:47)
	at junit.framework.Assert.failNotEquals(Assert.java:280)
	at junit.framework.Assert.assertEquals(Assert.java:64)
	at junit.framework.Assert.assertEquals(Assert.java:198)
	at junit.framework.Assert.assertEquals(Assert.java:204)
	at org.joda.time.TestMutablePeriod_Updates.testAdd_long3(TestMutablePeriod_Updates.java:1126)

testAdd_long_Chronology1(org.joda.time.TestMutablePeriod_Updates)  Time elapsed: 0 sec  <<< FAILURE!
junit.framework.AssertionFailedError: expected:<200> but was:<0>
	at junit.framework.Assert.fail(Assert.java:47)
	at junit.framework.Assert.failNotEquals(Assert.java:280)
	at junit.framework.Assert.assertEquals(Assert.java:64)
	at junit.framework.Assert.assertEquals(Assert.java:198)
	at junit.framework.Assert.assertEquals(Assert.java:204)
	at org.joda.time.TestMutablePeriod_Updates.testAdd_long_Chronology1(TestMutablePeriod_Updates.java:1147)

testAdd_long_Chronology2(org.joda.time.TestMutablePeriod_Updates)  Time elapsed: 0 sec  <<< FAILURE!
junit.framework.AssertionFailedError: expected:<10805> but was:<0>
	at junit.framework.Assert.fail(Assert.java:47)
	at junit.framework.Assert.failNotEquals(Assert.java:280)
	at junit.framework.Assert.assertEquals(Assert.java:64)
	at junit.framework.Assert.assertEquals(Assert.java:198)
	at junit.framework.Assert.assertEquals(Assert.java:204)
	at org.joda.time.TestMutablePeriod_Updates.testAdd_long_Chronology2(TestMutablePeriod_Updates.java:1163)

testAdd_long_Chronology3(org.joda.time.TestMutablePeriod_Updates)  Time elapsed: 0.001 sec  <<< FAILURE!
junit.framework.AssertionFailedError: expected:<64> but was:<0>
	at junit.framework.Assert.fail(Assert.java:47)
	at junit.framework.Assert.failNotEquals(Assert.java:280)
	at junit.framework.Assert.assertEquals(Assert.java:64)
	at junit.framework.Assert.assertEquals(Assert.java:198)
	at junit.framework.Assert.assertEquals(Assert.java:204)
	at org.joda.time.TestMutablePeriod_Updates.testAdd_long_Chronology3(TestMutablePeriod_Updates.java:1180)

testAdd_RD3(org.joda.time.TestMutablePeriod_Updates)  Time elapsed: 0 sec  <<< FAILURE!
junit.framework.AssertionFailedError: expected:<1> but was:<0>
	at junit.framework.Assert.fail(Assert.java:47)
	at junit.framework.Assert.failNotEquals(Assert.java:280)
	at junit.framework.Assert.assertEquals(Assert.java:64)
	at junit.framework.Assert.assertEquals(Assert.java:198)
	at junit.framework.Assert.assertEquals(Assert.java:204)
	at org.joda.time.TestMutablePeriod_Updates.testAdd_RD3(TestMutablePeriod_Updates.java:1223)

testAdd_RP3(org.joda.time.TestMutablePeriod_Updates)  Time elapsed: 0.001 sec  <<< FAILURE!
junit.framework.AssertionFailedError: expected:<100> but was:<0>
	at junit.framework.Assert.fail(Assert.java:47)
	at junit.framework.Assert.failNotEquals(Assert.java:280)
	at junit.framework.Assert.assertEquals(Assert.java:64)
	at junit.framework.Assert.assertEquals(Assert.java:198)
	at junit.framework.Assert.assertEquals(Assert.java:204)
	at org.joda.time.TestMutablePeriod_Updates.testAdd_RP3(TestMutablePeriod_Updates.java:1271)

testAdd_RP4(org.joda.time.TestMutablePeriod_Updates)  Time elapsed: 0 sec  <<< FAILURE!
junit.framework.AssertionFailedError: expected:<1> but was:<0>
	at junit.framework.Assert.fail(Assert.java:47)
	at junit.framework.Assert.failNotEquals(Assert.java:280)
	at junit.framework.Assert.assertEquals(Assert.java:64)
	at junit.framework.Assert.assertEquals(Assert.java:198)
	at junit.framework.Assert.assertEquals(Assert.java:204)
	at org.joda.time.TestMutablePeriod_Updates.testAdd_RP4(TestMutablePeriod_Updates.java:1280)

testAdd_RP5(org.joda.time.TestMutablePeriod_Updates)  Time elapsed: 0 sec  <<< FAILURE!
junit.framework.AssertionFailedError: expected:<2> but was:<0>
	at junit.framework.Assert.fail(Assert.java:47)
	at junit.framework.Assert.failNotEquals(Assert.java:280)
	at junit.framework.Assert.assertEquals(Assert.java:64)
	at junit.framework.Assert.assertEquals(Assert.java:198)
	at junit.framework.Assert.assertEquals(Assert.java:204)
	at org.joda.time.TestMutablePeriod_Updates.testAdd_RP5(TestMutablePeriod_Updates.java:1293)

testAdd_RP6(org.joda.time.TestMutablePeriod_Updates)  Time elapsed: 0.001 sec  <<< FAILURE!
junit.framework.AssertionFailedError: expected:<1> but was:<0>
	at junit.framework.Assert.fail(Assert.java:47)
	at junit.framework.Assert.failNotEquals(Assert.java:280)
	at junit.framework.Assert.assertEquals(Assert.java:64)
	at junit.framework.Assert.assertEquals(Assert.java:198)
	at junit.framework.Assert.assertEquals(Assert.java:204)
	at org.joda.time.TestMutablePeriod_Updates.testAdd_RP6(TestMutablePeriod_Updates.java:1306)

testAdd_RInterval1(org.joda.time.TestMutablePeriod_Updates)  Time elapsed: 0 sec  <<< FAILURE!
junit.framework.AssertionFailedError: expected:<200> but was:<0>
	at junit.framework.Assert.fail(Assert.java:47)
	at junit.framework.Assert.failNotEquals(Assert.java:280)
	at junit.framework.Assert.assertEquals(Assert.java:64)
	at junit.framework.Assert.assertEquals(Assert.java:198)
	at junit.framework.Assert.assertEquals(Assert.java:204)
	at org.joda.time.TestMutablePeriod_Updates.testAdd_RInterval1(TestMutablePeriod_Updates.java:1327)

testAdd_RInterval2(org.joda.time.TestMutablePeriod_Updates)  Time elapsed: 0.001 sec  <<< FAILURE!
junit.framework.AssertionFailedError: expected:<1> but was:<0>
	at junit.framework.Assert.fail(Assert.java:47)
	at junit.framework.Assert.failNotEquals(Assert.java:280)
	at junit.framework.Assert.assertEquals(Assert.java:64)
	at junit.framework.Assert.assertEquals(Assert.java:198)
	at junit.framework.Assert.assertEquals(Assert.java:204)
	at org.joda.time.TestMutablePeriod_Updates.testAdd_RInterval2(TestMutablePeriod_Updates.java:1335)

testAdd_RInterval3(org.joda.time.TestMutablePeriod_Updates)  Time elapsed: 0 sec  <<< ERROR!
java.lang.ArrayIndexOutOfBoundsException: -1
	at org.joda.time.base.BasePeriod.getValue(BasePeriod.java:329)
	at org.joda.time.PeriodType.getIndexedField(PeriodType.java:172)
	at org.joda.time.MutablePeriod.getWeeks(MutablePeriod.java:764)
	at org.joda.time.TestMutablePeriod_Updates.testAdd_RInterval3(TestMutablePeriod_Updates.java:1350)

testAdd_RInterval4(org.joda.time.TestMutablePeriod_Updates)  Time elapsed: 0.001 sec  <<< FAILURE!
junit.framework.AssertionFailedError: expected:<1> but was:<0>
	at junit.framework.Assert.fail(Assert.java:47)
	at junit.framework.Assert.failNotEquals(Assert.java:280)
	at junit.framework.Assert.assertEquals(Assert.java:64)
	at junit.framework.Assert.assertEquals(Assert.java:198)
	at junit.framework.Assert.assertEquals(Assert.java:204)
	at org.joda.time.TestMutablePeriod_Updates.testAdd_RInterval4(TestMutablePeriod_Updates.java:1363)

testAdd_RInterval5(org.joda.time.TestMutablePeriod_Updates)  Time elapsed: 0 sec  <<< FAILURE!
junit.framework.AssertionFailedError: expected:<1> but was:<0>
	at junit.framework.Assert.fail(Assert.java:47)
	at junit.framework.Assert.failNotEquals(Assert.java:280)
	at junit.framework.Assert.assertEquals(Assert.java:64)
	at junit.framework.Assert.assertEquals(Assert.java:198)
	at junit.framework.Assert.assertEquals(Assert.java:204)
	at org.joda.time.TestMutablePeriod_Updates.testAdd_RInterval5(TestMutablePeriod_Updates.java:1376)

testMergePeriod_RP1(org.joda.time.TestMutablePeriod_Updates)  Time elapsed: 0 sec  <<< FAILURE!
junit.framework.AssertionFailedError: expected:<1> but was:<0>
	at junit.framework.Assert.fail(Assert.java:47)
	at junit.framework.Assert.failNotEquals(Assert.java:280)
	at junit.framework.Assert.assertEquals(Assert.java:64)
	at junit.framework.Assert.assertEquals(Assert.java:198)
	at junit.framework.Assert.assertEquals(Assert.java:204)
	at org.joda.time.TestMutablePeriod_Updates.testMergePeriod_RP1(TestMutablePeriod_Updates.java:1390)

testMergePeriod_RP2(org.joda.time.TestMutablePeriod_Updates)  Time elapsed: 0.001 sec  <<< ERROR!
java.lang.ArrayIndexOutOfBoundsException: -1
	at org.joda.time.base.BasePeriod.getValue(BasePeriod.java:329)
	at org.joda.time.PeriodType.getIndexedField(PeriodType.java:172)
	at org.joda.time.MutablePeriod.getYears(MutablePeriod.java:746)
	at org.joda.time.TestMutablePeriod_Updates.testMergePeriod_RP2(TestMutablePeriod_Updates.java:1406)

testMergePeriod_RP3(org.joda.time.TestMutablePeriod_Updates)  Time elapsed: 0 sec  <<< ERROR!
java.lang.ArrayIndexOutOfBoundsException: -1
	at org.joda.time.base.BasePeriod.getValue(BasePeriod.java:329)
	at org.joda.time.PeriodType.getIndexedField(PeriodType.java:172)
	at org.joda.time.MutablePeriod.getYears(MutablePeriod.java:746)
	at org.joda.time.TestMutablePeriod_Updates.testMergePeriod_RP3(TestMutablePeriod_Updates.java:1419)

testMergePeriod_RP4(org.joda.time.TestMutablePeriod_Updates)  Time elapsed: 0 sec  <<< FAILURE!
junit.framework.AssertionFailedError: expected:<11> but was:<0>
	at junit.framework.Assert.fail(Assert.java:47)
	at junit.framework.Assert.failNotEquals(Assert.java:280)
	at junit.framework.Assert.assertEquals(Assert.java:64)
	at junit.framework.Assert.assertEquals(Assert.java:198)
	at junit.framework.Assert.assertEquals(Assert.java:204)
	at org.joda.time.TestMutablePeriod_Updates.testMergePeriod_RP4(TestMutablePeriod_Updates.java:1432)

testMergePeriod_RP5(org.joda.time.TestMutablePeriod_Updates)  Time elapsed: 0.001 sec  <<< FAILURE!
junit.framework.AssertionFailedError: expected:<1> but was:<0>
	at junit.framework.Assert.fail(Assert.java:47)
	at junit.framework.Assert.failNotEquals(Assert.java:280)
	at junit.framework.Assert.assertEquals(Assert.java:64)
	at junit.framework.Assert.assertEquals(Assert.java:198)
	at junit.framework.Assert.assertEquals(Assert.java:204)
	at org.joda.time.TestMutablePeriod_Updates.testMergePeriod_RP5(TestMutablePeriod_Updates.java:1445)

testAddYears(org.joda.time.TestMutablePeriod_Updates)  Time elapsed: 0 sec  <<< FAILURE!
junit.framework.AssertionFailedError: expected:<11> but was:<0>
	at junit.framework.Assert.fail(Assert.java:47)
	at junit.framework.Assert.failNotEquals(Assert.java:280)
	at junit.framework.Assert.assertEquals(Assert.java:64)
	at junit.framework.Assert.assertEquals(Assert.java:198)
	at junit.framework.Assert.assertEquals(Assert.java:204)
	at org.joda.time.TestMutablePeriod_Updates.testAddYears(TestMutablePeriod_Updates.java:121)

testAddMonths(org.joda.time.TestMutablePeriod_Updates)  Time elapsed: 0.001 sec  <<< FAILURE!
junit.framework.AssertionFailedError: expected:<12> but was:<0>
	at junit.framework.Assert.fail(Assert.java:47)
	at junit.framework.Assert.failNotEquals(Assert.java:280)
	at junit.framework.Assert.assertEquals(Assert.java:64)
	at junit.framework.Assert.assertEquals(Assert.java:198)
	at junit.framework.Assert.assertEquals(Assert.java:204)
	at org.joda.time.TestMutablePeriod_Updates.testAddMonths(TestMutablePeriod_Updates.java:136)

testAddWeeks(org.joda.time.TestMutablePeriod_Updates)  Time elapsed: 0 sec  <<< FAILURE!
junit.framework.AssertionFailedError: expected:<13> but was:<0>
	at junit.framework.Assert.fail(Assert.java:47)
	at junit.framework.Assert.failNotEquals(Assert.java:280)
	at junit.framework.Assert.assertEquals(Assert.java:64)
	at junit.framework.Assert.assertEquals(Assert.java:198)
	at junit.framework.Assert.assertEquals(Assert.java:204)
	at org.joda.time.TestMutablePeriod_Updates.testAddWeeks(TestMutablePeriod_Updates.java:151)

testAddDays(org.joda.time.TestMutablePeriod_Updates)  Time elapsed: 0 sec  <<< FAILURE!
junit.framework.AssertionFailedError: expected:<14> but was:<0>
	at junit.framework.Assert.fail(Assert.java:47)
	at junit.framework.Assert.failNotEquals(Assert.java:280)
	at junit.framework.Assert.assertEquals(Assert.java:64)
	at junit.framework.Assert.assertEquals(Assert.java:198)
	at junit.framework.Assert.assertEquals(Assert.java:204)
	at org.joda.time.TestMutablePeriod_Updates.testAddDays(TestMutablePeriod_Updates.java:166)

testAddHours(org.joda.time.TestMutablePeriod_Updates)  Time elapsed: 0.001 sec  <<< FAILURE!
junit.framework.AssertionFailedError: expected:<15> but was:<0>
	at junit.framework.Assert.fail(Assert.java:47)
	at junit.framework.Assert.failNotEquals(Assert.java:280)
	at junit.framework.Assert.assertEquals(Assert.java:64)
	at junit.framework.Assert.assertEquals(Assert.java:198)
	at junit.framework.Assert.assertEquals(Assert.java:204)
	at org.joda.time.TestMutablePeriod_Updates.testAddHours(TestMutablePeriod_Updates.java:181)

testAddMinutes(org.joda.time.TestMutablePeriod_Updates)  Time elapsed: 0 sec  <<< FAILURE!
junit.framework.AssertionFailedError: expected:<16> but was:<0>
	at junit.framework.Assert.fail(Assert.java:47)
	at junit.framework.Assert.failNotEquals(Assert.java:280)
	at junit.framework.Assert.assertEquals(Assert.java:64)
	at junit.framework.Assert.assertEquals(Assert.java:198)
	at junit.framework.Assert.assertEquals(Assert.java:204)
	at org.joda.time.TestMutablePeriod_Updates.testAddMinutes(TestMutablePeriod_Updates.java:196)

testAddMillis(org.joda.time.TestMutablePeriod_Updates)  Time elapsed: 0 sec  <<< FAILURE!
junit.framework.AssertionFailedError: expected:<18> but was:<0>
	at junit.framework.Assert.fail(Assert.java:47)
	at junit.framework.Assert.failNotEquals(Assert.java:280)
	at junit.framework.Assert.assertEquals(Assert.java:64)
	at junit.framework.Assert.assertEquals(Assert.java:198)
	at junit.framework.Assert.assertEquals(Assert.java:204)
	at org.joda.time.TestMutablePeriod_Updates.testAddMillis(TestMutablePeriod_Updates.java:226)

testAdd_RP1(org.joda.time.TestMutablePeriod_Updates)  Time elapsed: 0.001 sec  <<< FAILURE!
junit.framework.AssertionFailedError: expected:<200> but was:<0>
	at junit.framework.Assert.fail(Assert.java:47)
	at junit.framework.Assert.failNotEquals(Assert.java:280)
	at junit.framework.Assert.assertEquals(Assert.java:64)
	at junit.framework.Assert.assertEquals(Assert.java:198)
	at junit.framework.Assert.assertEquals(Assert.java:204)
	at org.joda.time.TestMutablePeriod_Updates.testAdd_RP1(TestMutablePeriod_Updates.java:1244)

testAdd_RP2(org.joda.time.TestMutablePeriod_Updates)  Time elapsed: 0 sec  <<< FAILURE!
junit.framework.AssertionFailedError: expected:<1> but was:<0>
	at junit.framework.Assert.fail(Assert.java:47)
	at junit.framework.Assert.failNotEquals(Assert.java:280)
	at junit.framework.Assert.assertEquals(Assert.java:64)
	at junit.framework.Assert.assertEquals(Assert.java:198)
	at junit.framework.Assert.assertEquals(Assert.java:204)
	at org.joda.time.TestMutablePeriod_Updates.testAdd_RP2(TestMutablePeriod_Updates.java:1251)

testFactory_parseYears_String(org.joda.time.TestYears)  Time elapsed: 0.001 sec  <<< FAILURE!
junit.framework.AssertionFailedError: expected:<1> but was:<0>
	at junit.framework.Assert.fail(Assert.java:47)
	at junit.framework.Assert.failNotEquals(Assert.java:280)
	at junit.framework.Assert.assertEquals(Assert.java:64)
	at junit.framework.Assert.assertEquals(Assert.java:198)
	at junit.framework.Assert.assertEquals(Assert.java:204)
	at org.joda.time.TestYears.testFactory_parseYears_String(TestYears.java:117)

testFactory_parseMonths_String(org.joda.time.TestMonths)  Time elapsed: 0.001 sec  <<< FAILURE!
junit.framework.AssertionFailedError: expected:<1> but was:<0>
	at junit.framework.Assert.fail(Assert.java:47)
	at junit.framework.Assert.failNotEquals(Assert.java:280)
	at junit.framework.Assert.assertEquals(Assert.java:64)
	at junit.framework.Assert.assertEquals(Assert.java:198)
	at junit.framework.Assert.assertEquals(Assert.java:204)
	at org.joda.time.TestMonths.testFactory_parseMonths_String(TestMonths.java:162)

testFactory_parseWeeks_String(org.joda.time.TestWeeks)  Time elapsed: 0 sec  <<< FAILURE!
junit.framework.AssertionFailedError: expected:<1> but was:<0>
	at junit.framework.Assert.fail(Assert.java:47)
	at junit.framework.Assert.failNotEquals(Assert.java:280)
	at junit.framework.Assert.assertEquals(Assert.java:64)
	at junit.framework.Assert.assertEquals(Assert.java:198)
	at junit.framework.Assert.assertEquals(Assert.java:204)
	at org.joda.time.TestWeeks.testFactory_parseWeeks_String(TestWeeks.java:134)

testFactory_parseDays_String(org.joda.time.TestDays)  Time elapsed: 0.001 sec  <<< FAILURE!
junit.framework.AssertionFailedError: expected:<1> but was:<0>
	at junit.framework.Assert.fail(Assert.java:47)
	at junit.framework.Assert.failNotEquals(Assert.java:280)
	at junit.framework.Assert.assertEquals(Assert.java:64)
	at junit.framework.Assert.assertEquals(Assert.java:198)
	at junit.framework.Assert.assertEquals(Assert.java:204)
	at org.joda.time.TestDays.testFactory_parseDays_String(TestDays.java:176)

testFactory_parseHours_String(org.joda.time.TestHours)  Time elapsed: 0 sec  <<< FAILURE!
junit.framework.AssertionFailedError: expected:<1> but was:<0>
	at junit.framework.Assert.fail(Assert.java:47)
	at junit.framework.Assert.failNotEquals(Assert.java:280)
	at junit.framework.Assert.assertEquals(Assert.java:64)
	at junit.framework.Assert.assertEquals(Assert.java:198)
	at junit.framework.Assert.assertEquals(Assert.java:204)
	at org.joda.time.TestHours.testFactory_parseHours_String(TestHours.java:145)

testFactory_parseMinutes_String(org.joda.time.TestMinutes)  Time elapsed: 0 sec  <<< FAILURE!
junit.framework.AssertionFailedError: expected:<1> but was:<0>
	at junit.framework.Assert.fail(Assert.java:47)
	at junit.framework.Assert.failNotEquals(Assert.java:280)
	at junit.framework.Assert.assertEquals(Assert.java:64)
	at junit.framework.Assert.assertEquals(Assert.java:198)
	at junit.framework.Assert.assertEquals(Assert.java:204)
	at org.joda.time.TestMinutes.testFactory_parseMinutes_String(TestMinutes.java:135)

testFactory_parseSeconds_String(org.joda.time.TestSeconds)  Time elapsed: 0.001 sec  <<< FAILURE!
junit.framework.AssertionFailedError: expected:<1> but was:<0>
	at junit.framework.Assert.fail(Assert.java:47)
	at junit.framework.Assert.failNotEquals(Assert.java:280)
	at junit.framework.Assert.assertEquals(Assert.java:64)
	at junit.framework.Assert.assertEquals(Assert.java:198)
	at junit.framework.Assert.assertEquals(Assert.java:204)
	at org.joda.time.TestSeconds.testFactory_parseSeconds_String(TestSeconds.java:132)

testYears(org.joda.time.TestStringConvert)  Time elapsed: 0.001 sec  <<< FAILURE!
junit.framework.AssertionFailedError: expected:<P5Y> but was:<P0Y>
	at junit.framework.Assert.fail(Assert.java:47)
	at junit.framework.Assert.failNotEquals(Assert.java:280)
	at junit.framework.Assert.assertEquals(Assert.java:64)
	at junit.framework.Assert.assertEquals(Assert.java:71)
	at org.joda.time.TestStringConvert.testYears(TestStringConvert.java:158)

testMonths(org.joda.time.TestStringConvert)  Time elapsed: 0.001 sec  <<< FAILURE!
junit.framework.AssertionFailedError: expected:<P5M> but was:<P0M>
	at junit.framework.Assert.fail(Assert.java:47)
	at junit.framework.Assert.failNotEquals(Assert.java:280)
	at junit.framework.Assert.assertEquals(Assert.java:64)
	at junit.framework.Assert.assertEquals(Assert.java:71)
	at org.joda.time.TestStringConvert.testMonths(TestStringConvert.java:165)

testWeeks(org.joda.time.TestStringConvert)  Time elapsed: 0.001 sec  <<< FAILURE!
junit.framework.AssertionFailedError: expected:<P5W> but was:<P0W>
	at junit.framework.Assert.fail(Assert.java:47)
	at junit.framework.Assert.failNotEquals(Assert.java:280)
	at junit.framework.Assert.assertEquals(Assert.java:64)
	at junit.framework.Assert.assertEquals(Assert.java:71)
	at org.joda.time.TestStringConvert.testWeeks(TestStringConvert.java:172)

testDays(org.joda.time.TestStringConvert)  Time elapsed: 0.001 sec  <<< FAILURE!
junit.framework.AssertionFailedError: expected:<P5D> but was:<P0D>
	at junit.framework.Assert.fail(Assert.java:47)
	at junit.framework.Assert.failNotEquals(Assert.java:280)
	at junit.framework.Assert.assertEquals(Assert.java:64)
	at junit.framework.Assert.assertEquals(Assert.java:71)
	at org.joda.time.TestStringConvert.testDays(TestStringConvert.java:179)

testHours(org.joda.time.TestStringConvert)  Time elapsed: 0.001 sec  <<< FAILURE!
junit.framework.AssertionFailedError: expected:<PT5H> but was:<PT0H>
	at junit.framework.Assert.fail(Assert.java:47)
	at junit.framework.Assert.failNotEquals(Assert.java:280)
	at junit.framework.Assert.assertEquals(Assert.java:64)
	at junit.framework.Assert.assertEquals(Assert.java:71)
	at org.joda.time.TestStringConvert.testHours(TestStringConvert.java:186)

testMinutes(org.joda.time.TestStringConvert)  Time elapsed: 0 sec  <<< FAILURE!
junit.framework.AssertionFailedError: expected:<PT5M> but was:<PT0M>
	at junit.framework.Assert.fail(Assert.java:47)
	at junit.framework.Assert.failNotEquals(Assert.java:280)
	at junit.framework.Assert.assertEquals(Assert.java:64)
	at junit.framework.Assert.assertEquals(Assert.java:71)
	at org.joda.time.TestStringConvert.testMinutes(TestStringConvert.java:193)

testSeconds(org.joda.time.TestStringConvert)  Time elapsed: 0 sec  <<< FAILURE!
junit.framework.AssertionFailedError: expected:<PT5S> but was:<PT0S>
	at junit.framework.Assert.fail(Assert.java:47)
	at junit.framework.Assert.failNotEquals(Assert.java:280)
	at junit.framework.Assert.assertEquals(Assert.java:64)
	at junit.framework.Assert.assertEquals(Assert.java:71)
	at org.joda.time.TestStringConvert.testSeconds(TestStringConvert.java:200)

testSetInto_Object(org.joda.time.convert.TestReadableDurationConverter)  Time elapsed: 0.001 sec  <<< ERROR!
java.lang.ArrayIndexOutOfBoundsException: -1
	at org.joda.time.base.BasePeriod.getValue(BasePeriod.java:329)
	at org.joda.time.PeriodType.getIndexedField(PeriodType.java:172)
	at org.joda.time.MutablePeriod.getWeeks(MutablePeriod.java:764)
	at org.joda.time.convert.TestReadableDurationConverter.testSetInto_Object(TestReadableDurationConverter.java:118)

testSetIntoPeriod_Object1(org.joda.time.convert.TestReadableIntervalConverter)  Time elapsed: 0 sec  <<< ERROR!
java.lang.ArrayIndexOutOfBoundsException: -1
	at org.joda.time.base.BasePeriod.getValue(BasePeriod.java:329)
	at org.joda.time.PeriodType.getIndexedField(PeriodType.java:172)
	at org.joda.time.MutablePeriod.getYears(MutablePeriod.java:746)
	at org.joda.time.convert.TestReadableIntervalConverter.testSetIntoPeriod_Object1(TestReadableIntervalConverter.java:109)

testSetIntoPeriod_Object2(org.joda.time.convert.TestReadableIntervalConverter)  Time elapsed: 0.001 sec  <<< ERROR!
java.lang.ArrayIndexOutOfBoundsException: -1
	at org.joda.time.base.BasePeriod.getValue(BasePeriod.java:329)
	at org.joda.time.PeriodType.getIndexedField(PeriodType.java:172)
	at org.joda.time.MutablePeriod.getYears(MutablePeriod.java:746)
	at org.joda.time.convert.TestReadableIntervalConverter.testSetIntoPeriod_Object2(TestReadableIntervalConverter.java:123)

testSetInto_Object(org.joda.time.convert.TestReadablePeriodConverter)  Time elapsed: 0.001 sec  <<< ERROR!
java.lang.ArrayIndexOutOfBoundsException: -1
	at org.joda.time.base.BasePeriod.getValue(BasePeriod.java:329)
	at org.joda.time.PeriodType.getIndexedField(PeriodType.java:172)
	at org.joda.time.MutablePeriod.getWeeks(MutablePeriod.java:764)
	at org.joda.time.convert.TestReadablePeriodConverter.testSetInto_Object(TestReadablePeriodConverter.java:101)

testSetIntoPeriod_Object6(org.joda.time.convert.TestStringConverter)  Time elapsed: 0.001 sec  <<< FAILURE!
junit.framework.AssertionFailedError: expected:<2> but was:<0>
	at junit.framework.Assert.fail(Assert.java:47)
	at junit.framework.Assert.failNotEquals(Assert.java:280)
	at junit.framework.Assert.assertEquals(Assert.java:64)
	at junit.framework.Assert.assertEquals(Assert.java:198)
	at junit.framework.Assert.assertEquals(Assert.java:204)
	at org.joda.time.convert.TestStringConverter.testSetIntoPeriod_Object6(TestStringConverter.java:426)

testSetIntoPeriod_Object7(org.joda.time.convert.TestStringConverter)  Time elapsed: 0 sec  <<< FAILURE!
junit.framework.AssertionFailedError: expected:<2> but was:<0>
	at junit.framework.Assert.fail(Assert.java:47)
	at junit.framework.Assert.failNotEquals(Assert.java:280)
	at junit.framework.Assert.assertEquals(Assert.java:64)
	at junit.framework.Assert.assertEquals(Assert.java:198)
	at junit.framework.Assert.assertEquals(Assert.java:204)
	at org.joda.time.convert.TestStringConverter.testSetIntoPeriod_Object7(TestStringConverter.java:438)

testSetIntoPeriod_Object3(org.joda.time.convert.TestStringConverter)  Time elapsed: 0.001 sec  <<< FAILURE!
junit.framework.AssertionFailedError: expected:<2> but was:<0>
	at junit.framework.Assert.fail(Assert.java:47)
	at junit.framework.Assert.failNotEquals(Assert.java:280)
	at junit.framework.Assert.assertEquals(Assert.java:64)
	at junit.framework.Assert.assertEquals(Assert.java:198)
	at junit.framework.Assert.assertEquals(Assert.java:204)
	at org.joda.time.convert.TestStringConverter.testSetIntoPeriod_Object3(TestStringConverter.java:390)

testSetIntoPeriod_Object4(org.joda.time.convert.TestStringConverter)  Time elapsed: 0 sec  <<< FAILURE!
junit.framework.AssertionFailedError: expected:<2> but was:<0>
	at junit.framework.Assert.fail(Assert.java:47)
	at junit.framework.Assert.failNotEquals(Assert.java:280)
	at junit.framework.Assert.assertEquals(Assert.java:64)
	at junit.framework.Assert.assertEquals(Assert.java:198)
	at junit.framework.Assert.assertEquals(Assert.java:204)
	at org.joda.time.convert.TestStringConverter.testSetIntoPeriod_Object4(TestStringConverter.java:402)

testSetIntoPeriod_Object5(org.joda.time.convert.TestStringConverter)  Time elapsed: 0.001 sec  <<< FAILURE!
junit.framework.AssertionFailedError: expected:<2> but was:<0>
	at junit.framework.Assert.fail(Assert.java:47)
	at junit.framework.Assert.failNotEquals(Assert.java:280)
	at junit.framework.Assert.assertEquals(Assert.java:64)
	at junit.framework.Assert.assertEquals(Assert.java:198)
	at junit.framework.Assert.assertEquals(Assert.java:204)
	at org.joda.time.convert.TestStringConverter.testSetIntoPeriod_Object5(TestStringConverter.java:414)

testSetIntoPeriod_Object1(org.joda.time.convert.TestStringConverter)  Time elapsed: 0 sec  <<< FAILURE!
junit.framework.AssertionFailedError: expected:<2> but was:<0>
	at junit.framework.Assert.fail(Assert.java:47)
	at junit.framework.Assert.failNotEquals(Assert.java:280)
	at junit.framework.Assert.assertEquals(Assert.java:64)
	at junit.framework.Assert.assertEquals(Assert.java:198)
	at junit.framework.Assert.assertEquals(Assert.java:204)
	at org.joda.time.convert.TestStringConverter.testSetIntoPeriod_Object1(TestStringConverter.java:366)

testSetIntoPeriod_Object2(org.joda.time.convert.TestStringConverter)  Time elapsed: 0.001 sec  <<< FAILURE!
junit.framework.AssertionFailedError: expected:<2> but was:<0>
	at junit.framework.Assert.fail(Assert.java:47)
	at junit.framework.Assert.failNotEquals(Assert.java:280)
	at junit.framework.Assert.assertEquals(Assert.java:64)
	at junit.framework.Assert.assertEquals(Assert.java:198)
	at junit.framework.Assert.assertEquals(Assert.java:204)
	at org.joda.time.convert.TestStringConverter.testSetIntoPeriod_Object2(TestStringConverter.java:378)


Results :

Failed tests: 
  org.joda.time.TestDays#testFactory_parseDays_String AssertionFailedError expec...
  org.joda.time.TestDuration_Basics#testToPeriod AssertionFailedError expected:<...
  org.joda.time.TestDuration_Basics#testToPeriod_fixedZone AssertionFailedError ...
  org.joda.time.TestHours#testFactory_parseHours_String AssertionFailedError exp...
  org.joda.time.TestMinutes#testFactory_parseMinutes_String AssertionFailedError
  org.joda.time.TestMonths#testFactory_parseMonths_String AssertionFailedError e...
  org.joda.time.TestMutablePeriod_Constructors#testConstructor_4int1 AssertionFailedError
  org.joda.time.TestMutablePeriod_Constructors#testConstructor_8int1 AssertionFailedError
  org.joda.time.TestMutablePeriod_Constructors#testConstructor_8int__PeriodType1 AssertionFailedError
  org.joda.time.TestMutablePeriod_Constructors#testConstructor_Object1 AssertionFailedError
  org.joda.time.TestMutablePeriod_Constructors#testConstructor_Object4 AssertionFailedError
  org.joda.time.TestMutablePeriod_Constructors#testConstructor_Object_Chronology1 AssertionFailedError
  org.joda.time.TestMutablePeriod_Constructors#testConstructor_Object_Chronology2 AssertionFailedError
  org.joda.time.TestMutablePeriod_Constructors#testConstructor_Object_PeriodType1 AssertionFailedError
  org.joda.time.TestMutablePeriod_Constructors#testConstructor_RI_RD1 AssertionFailedError
  org.joda.time.TestMutablePeriod_Constructors#testConstructor_RI_RD_PeriodType1 AssertionFailedError
  org.joda.time.TestMutablePeriod_Constructors#testConstructor_RI_RI1 AssertionFailedError
  org.joda.time.TestMutablePeriod_Constructors#testConstructor_RI_RI2 AssertionFailedError
  org.joda.time.TestMutablePeriod_Constructors#testConstructor_RI_RI3 AssertionFailedError
  org.joda.time.TestMutablePeriod_Constructors#testConstructor_RI_RI4 AssertionFailedError
  org.joda.time.TestMutablePeriod_Constructors#testConstructor_RI_RI_PeriodType1 AssertionFailedError
  org.joda.time.TestMutablePeriod_Constructors#testConstructor_RI_RI_PeriodType3 AssertionFailedError
  org.joda.time.TestMutablePeriod_Constructors#testConstructor_RI_RI_PeriodType4 AssertionFailedError
  org.joda.time.TestMutablePeriod_Constructors#testConstructor_long1 AssertionFailedError
  org.joda.time.TestMutablePeriod_Constructors#testConstructor_long2 AssertionFailedError
  org.joda.time.TestMutablePeriod_Constructors#testConstructor_long3 AssertionFailedError
  org.joda.time.TestMutablePeriod_Constructors#testConstructor_long_Chronology1 AssertionFailedError
  org.joda.time.TestMutablePeriod_Constructors#testConstructor_long_Chronology2 AssertionFailedError
  org.joda.time.TestMutablePeriod_Constructors#testConstructor_long_Chronology3 AssertionFailedError
  org.joda.time.TestMutablePeriod_Constructors#testConstructor_long_PeriodType1 AssertionFailedError
  org.joda.time.TestMutablePeriod_Constructors#testConstructor_long_PeriodType3 AssertionFailedError
  org.joda.time.TestMutablePeriod_Constructors#testConstructor_long_PeriodType4 AssertionFailedError
  org.joda.time.TestMutablePeriod_Constructors#testConstructor_long_PeriodType_Chronology2 AssertionFailedError
  org.joda.time.TestMutablePeriod_Constructors#testConstructor_long_PeriodType_Chronology3 AssertionFailedError
  org.joda.time.TestMutablePeriod_Constructors#testConstructor_long_PeriodType_Chronology4 AssertionFailedError
  org.joda.time.TestMutablePeriod_Constructors#testConstructor_long_long1 AssertionFailedError
  org.joda.time.TestMutablePeriod_Constructors#testConstructor_long_long2 AssertionFailedError
  org.joda.time.TestMutablePeriod_Constructors#testConstructor_long_long_Chronology1 AssertionFailedError
  org.joda.time.TestMutablePeriod_Constructors#testConstructor_long_long_Chronology2 AssertionFailedError
  org.joda.time.TestMutablePeriod_Constructors#testConstructor_long_long_PeriodType1 AssertionFailedError
  org.joda.time.TestMutablePeriod_Constructors#testConstructor_long_long_PeriodType3 AssertionFailedError
  org.joda.time.TestMutablePeriod_Constructors#testConstructor_long_long_PeriodType_Chronology1 AssertionFailedError
  org.joda.time.TestMutablePeriod_Constructors#testConstructor_long_long_PeriodType_Chronology2 AssertionFailedError
  org.joda.time.TestMutablePeriod_Updates#testAddDays AssertionFailedError expec...
  org.joda.time.TestMutablePeriod_Updates#testAddHours AssertionFailedError expe...
  org.joda.time.TestMutablePeriod_Updates#testAddMillis AssertionFailedError exp...
  org.joda.time.TestMutablePeriod_Updates#testAddMinutes AssertionFailedError ex...
  org.joda.time.TestMutablePeriod_Updates#testAddMonths AssertionFailedError exp...
  org.joda.time.TestMutablePeriod_Updates#testAddSeconds AssertionFailedError ex...
  org.joda.time.TestMutablePeriod_Updates#testAddWeeks AssertionFailedError expe...
  org.joda.time.TestMutablePeriod_Updates#testAddYears AssertionFailedError expe...
  org.joda.time.TestMutablePeriod_Updates#testAdd_8ints1 AssertionFailedError ex...
  org.joda.time.TestMutablePeriod_Updates#testAdd_Field AssertionFailedError exp...
  org.joda.time.TestMutablePeriod_Updates#testAdd_RD1 AssertionFailedError expec...
  org.joda.time.TestMutablePeriod_Updates#testAdd_RD3 AssertionFailedError expec...
  org.joda.time.TestMutablePeriod_Updates#testAdd_RInterval1 AssertionFailedError
  org.joda.time.TestMutablePeriod_Updates#testAdd_RInterval2 AssertionFailedError
  org.joda.time.TestMutablePeriod_Updates#testAdd_RInterval4 AssertionFailedError
  org.joda.time.TestMutablePeriod_Updates#testAdd_RInterval5 AssertionFailedError
  org.joda.time.TestMutablePeriod_Updates#testAdd_RP1 AssertionFailedError expec...
  org.joda.time.TestMutablePeriod_Updates#testAdd_RP2 AssertionFailedError expec...
  org.joda.time.TestMutablePeriod_Updates#testAdd_RP3 AssertionFailedError expec...
  org.joda.time.TestMutablePeriod_Updates#testAdd_RP4 AssertionFailedError expec...
  org.joda.time.TestMutablePeriod_Updates#testAdd_RP5 AssertionFailedError expec...
  org.joda.time.TestMutablePeriod_Updates#testAdd_RP6 AssertionFailedError expec...
  org.joda.time.TestMutablePeriod_Updates#testAdd_long1 AssertionFailedError exp...
  org.joda.time.TestMutablePeriod_Updates#testAdd_long2 AssertionFailedError exp...
  org.joda.time.TestMutablePeriod_Updates#testAdd_long3 AssertionFailedError exp...
  org.joda.time.TestMutablePeriod_Updates#testAdd_long_Chronology1 AssertionFailedError
  org.joda.time.TestMutablePeriod_Updates#testAdd_long_Chronology2 AssertionFailedError
  org.joda.time.TestMutablePeriod_Updates#testAdd_long_Chronology3 AssertionFailedError
  org.joda.time.TestMutablePeriod_Updates#testMergePeriod_RP1 AssertionFailedError
  org.joda.time.TestMutablePeriod_Updates#testMergePeriod_RP4 AssertionFailedError
  org.joda.time.TestMutablePeriod_Updates#testMergePeriod_RP5 AssertionFailedError
  org.joda.time.TestMutablePeriod_Updates#testSetDays AssertionFailedError expec...
  org.joda.time.TestMutablePeriod_Updates#testSetHours AssertionFailedError expe...
  org.joda.time.TestMutablePeriod_Updates#testSetMillis AssertionFailedError exp...
  org.joda.time.TestMutablePeriod_Updates#testSetMinutes AssertionFailedError ex...
  org.joda.time.TestMutablePeriod_Updates#testSetMonths AssertionFailedError exp...
  org.joda.time.TestMutablePeriod_Updates#testSetPeriod_8ints1 AssertionFailedError
  org.joda.time.TestMutablePeriod_Updates#testSetPeriod_8ints4 AssertionFailedError
  org.joda.time.TestMutablePeriod_Updates#testSetPeriod_RD1 AssertionFailedError
  org.joda.time.TestMutablePeriod_Updates#testSetPeriod_RD2 AssertionFailedError
  org.joda.time.TestMutablePeriod_Updates#testSetPeriod_RI_RI1 AssertionFailedError
  org.joda.time.TestMutablePeriod_Updates#testSetPeriod_RI_RI2 AssertionFailedError
  org.joda.time.TestMutablePeriod_Updates#testSetPeriod_RInterval1 AssertionFailedError
  org.joda.time.TestMutablePeriod_Updates#testSetPeriod_RP1 AssertionFailedError
  org.joda.time.TestMutablePeriod_Updates#testSetPeriod_RP4 AssertionFailedError
  org.joda.time.TestMutablePeriod_Updates#testSetPeriod_long1 AssertionFailedError
  org.joda.time.TestMutablePeriod_Updates#testSetPeriod_long2 AssertionFailedError
  org.joda.time.TestMutablePeriod_Updates#testSetPeriod_long_long1 AssertionFailedError
  org.joda.time.TestMutablePeriod_Updates#testSetPeriod_long_long2 AssertionFailedError
  org.joda.time.TestMutablePeriod_Updates#testSetPeriod_long_long_NoDays AssertionFailedError
  org.joda.time.TestMutablePeriod_Updates#testSetPeriod_long_long_NoHours AssertionFailedError
  org.joda.time.TestMutablePeriod_Updates#testSetPeriod_long_long_NoMillis AssertionFailedError
  org.joda.time.TestMutablePeriod_Updates#testSetPeriod_long_long_NoMinutes AssertionFailedError
  org.joda.time.TestMutablePeriod_Updates#testSetPeriod_long_long_NoMonths AssertionFailedError
  org.joda.time.TestMutablePeriod_Updates#testSetPeriod_long_long_NoSeconds AssertionFailedError
  org.joda.time.TestMutablePeriod_Updates#testSetPeriod_long_long_NoWeeks AssertionFailedError
  org.joda.time.TestMutablePeriod_Updates#testSetSeconds AssertionFailedError ex...
  org.joda.time.TestMutablePeriod_Updates#testSetWeeks AssertionFailedError expe...
  org.joda.time.TestMutablePeriod_Updates#testSetYears AssertionFailedError expe...
  org.joda.time.TestMutablePeriod_Updates#testSet_Field AssertionFailedError exp...
  org.joda.time.TestPeriod_Basics#testMinus AssertionFailedError expected:<-9> b...
  org.joda.time.TestPeriod_Basics#testMultipliedBy AssertionFailedError expected...
  org.joda.time.TestPeriod_Basics#testNegated AssertionFailedError expected:<-1>...
  org.joda.time.TestPeriod_Basics#testNormalizedStandard_fullNegative AssertionFailedError
  org.joda.time.TestPeriod_Basics#testNormalizedStandard_negative AssertionFailedError
  org.joda.time.TestPeriod_Basics#testNormalizedStandard_periodType_months1 AssertionFailedError
  org.joda.time.TestPeriod_Basics#testNormalizedStandard_periodType_months2 AssertionFailedError
  org.joda.time.TestPeriod_Basics#testNormalizedStandard_periodType_months3 AssertionFailedError
  org.joda.time.TestPeriod_Basics#testNormalizedStandard_periodType_monthsWeeks AssertionFailedError
  org.joda.time.TestPeriod_Basics#testNormalizedStandard_periodType_weekDay1 AssertionFailedError
  org.joda.time.TestPeriod_Basics#testNormalizedStandard_periodType_weekDay2 AssertionFailedError
  org.joda.time.TestPeriod_Basics#testNormalizedStandard_periodType_weekDay3 AssertionFailedError
  org.joda.time.TestPeriod_Basics#testNormalizedStandard_periodType_yearMonth1 AssertionFailedError
  org.joda.time.TestPeriod_Basics#testNormalizedStandard_periodType_yearMonth2 AssertionFailedError
  org.joda.time.TestPeriod_Basics#testNormalizedStandard_periodType_yearMonth3 AssertionFailedError
  org.joda.time.TestPeriod_Basics#testNormalizedStandard_periodType_yearMonthDay AssertionFailedError
  org.joda.time.TestPeriod_Basics#testNormalizedStandard_periodType_yearMonthWeekDay AssertionFailedError
  org.joda.time.TestPeriod_Basics#testNormalizedStandard_periodType_years AssertionFailedError
  org.joda.time.TestPeriod_Basics#testNormalizedStandard_weekDay1 AssertionFailedError
  org.joda.time.TestPeriod_Basics#testNormalizedStandard_weekDay2 AssertionFailedError
  org.joda.time.TestPeriod_Basics#testNormalizedStandard_yearMonth1 AssertionFailedError
  org.joda.time.TestPeriod_Basics#testNormalizedStandard_yearMonth2 AssertionFailedError
  org.joda.time.TestPeriod_Basics#testNormalizedStandard_yearMonthDay AssertionFailedError
  org.joda.time.TestPeriod_Basics#testNormalizedStandard_yearMonthWeekDay AssertionFailedError
  org.joda.time.TestPeriod_Basics#testPlus AssertionFailedError expected:<11> bu...
  org.joda.time.TestPeriod_Basics#testToStandardDays AssertionFailedError expect...
  org.joda.time.TestPeriod_Basics#testToStandardDays_months AssertionFailedError
  org.joda.time.TestPeriod_Basics#testToStandardDays_years AssertionFailedError
  org.joda.time.TestPeriod_Basics#testToStandardDuration AssertionFailedError ex...
  org.joda.time.TestPeriod_Basics#testToStandardDuration_months AssertionFailedError
  org.joda.time.TestPeriod_Basics#testToStandardDuration_years AssertionFailedError
  org.joda.time.TestPeriod_Basics#testToStandardHours AssertionFailedError expec...
  org.joda.time.TestPeriod_Basics#testToStandardHours_months AssertionFailedError
  org.joda.time.TestPeriod_Basics#testToStandardHours_years AssertionFailedError
  org.joda.time.TestPeriod_Basics#testToStandardMinutes AssertionFailedError exp...
  org.joda.time.TestPeriod_Basics#testToStandardMinutes_months AssertionFailedError
  org.joda.time.TestPeriod_Basics#testToStandardMinutes_years AssertionFailedError
  org.joda.time.TestPeriod_Basics#testToStandardSeconds AssertionFailedError exp...
  org.joda.time.TestPeriod_Basics#testToStandardSeconds_months AssertionFailedError
  org.joda.time.TestPeriod_Basics#testToStandardSeconds_years AssertionFailedError
  org.joda.time.TestPeriod_Basics#testToStandardWeeks AssertionFailedError expec...
  org.joda.time.TestPeriod_Basics#testToStandardWeeks_months AssertionFailedError
  org.joda.time.TestPeriod_Basics#testToStandardWeeks_years AssertionFailedError
  org.joda.time.TestPeriod_Basics#testWithPeriodType2 AssertionFailedError expec...
  org.joda.time.TestPeriod_Basics#testWithPeriodType4 AssertionFailedError expec...
  org.joda.time.TestPeriod_Basics#testWithPeriodType5 AssertionFailedError expec...
  org.joda.time.TestPeriod_Constructors#testConstructor_4int1 AssertionFailedError
  org.joda.time.TestPeriod_Constructors#testConstructor_8int1 AssertionFailedError
  org.joda.time.TestPeriod_Constructors#testConstructor_8int__PeriodType1 AssertionFailedError
  org.joda.time.TestPeriod_Constructors#testConstructor_Object1 AssertionFailedError
  org.joda.time.TestPeriod_Constructors#testConstructor_Object4 AssertionFailedError
  org.joda.time.TestPeriod_Constructors#testConstructor_Object_PeriodType1 AssertionFailedError
  org.joda.time.TestPeriod_Constructors#testConstructor_RD_RI1 AssertionFailedError
  org.joda.time.TestPeriod_Constructors#testConstructor_RD_RI_PeriodType1 AssertionFailedError
  org.joda.time.TestPeriod_Constructors#testConstructor_RI_RD1 AssertionFailedError
  org.joda.time.TestPeriod_Constructors#testConstructor_RI_RD_PeriodType1 AssertionFailedError
  org.joda.time.TestPeriod_Constructors#testConstructor_RI_RI1 AssertionFailedError
  org.joda.time.TestPeriod_Constructors#testConstructor_RI_RI2 AssertionFailedError
  org.joda.time.TestPeriod_Constructors#testConstructor_RI_RI3 AssertionFailedError
  org.joda.time.TestPeriod_Constructors#testConstructor_RI_RI4 AssertionFailedError
  org.joda.time.TestPeriod_Constructors#testConstructor_RI_RI6 AssertionFailedError
  org.joda.time.TestPeriod_Constructors#testConstructor_RI_RI7 AssertionFailedError
  org.joda.time.TestPeriod_Constructors#testConstructor_RI_RI_PeriodType1 AssertionFailedError
  org.joda.time.TestPeriod_Constructors#testConstructor_RI_RI_PeriodType3 AssertionFailedError
  org.joda.time.TestPeriod_Constructors#testConstructor_RI_RI_PeriodType4 AssertionFailedError
  org.joda.time.TestPeriod_Constructors#testConstructor_RP_RP1 AssertionFailedError
  org.joda.time.TestPeriod_Constructors#testConstructor_RP_RP2 AssertionFailedError
  org.joda.time.TestPeriod_Constructors#testConstructor_RP_RP2Local AssertionFailedError
  org.joda.time.TestPeriod_Constructors#testConstructor_RP_RP_PeriodType1 AssertionFailedError
  org.joda.time.TestPeriod_Constructors#testConstructor_RP_RP_PeriodType2 AssertionFailedError
  org.joda.time.TestPeriod_Constructors#testConstructor_RP_RP_PeriodType2Local AssertionFailedError
  org.joda.time.TestPeriod_Constructors#testConstructor_long1 AssertionFailedError
  org.joda.time.TestPeriod_Constructors#testConstructor_long2 AssertionFailedError
  org.joda.time.TestPeriod_Constructors#testConstructor_long3 AssertionFailedError
  org.joda.time.TestPeriod_Constructors#testConstructor_long_Chronology1 AssertionFailedError
  org.joda.time.TestPeriod_Constructors#testConstructor_long_Chronology2 AssertionFailedError
  org.joda.time.TestPeriod_Constructors#testConstructor_long_Chronology3 AssertionFailedError
  org.joda.time.TestPeriod_Constructors#testConstructor_long_PeriodType1 AssertionFailedError
  org.joda.time.TestPeriod_Constructors#testConstructor_long_PeriodType4 AssertionFailedError
  org.joda.time.TestPeriod_Constructors#testConstructor_long_PeriodType_Chronology2 AssertionFailedError
  org.joda.time.TestPeriod_Constructors#testConstructor_long_PeriodType_Chronology3 AssertionFailedError
  org.joda.time.TestPeriod_Constructors#testConstructor_long_PeriodType_Chronology4 AssertionFailedError
  org.joda.time.TestPeriod_Constructors#testConstructor_long_fixedZone AssertionFailedError
  org.joda.time.TestPeriod_Constructors#testConstructor_long_long1 AssertionFailedError
  org.joda.time.TestPeriod_Constructors#testConstructor_long_long2 AssertionFailedError
  org.joda.time.TestPeriod_Constructors#testConstructor_long_long_Chronology1 AssertionFailedError
  org.joda.time.TestPeriod_Constructors#testConstructor_long_long_Chronology2 AssertionFailedError
  org.joda.time.TestPeriod_Constructors#testConstructor_long_long_PeriodType1 AssertionFailedError
  org.joda.time.TestPeriod_Constructors#testConstructor_long_long_PeriodType3 AssertionFailedError
  org.joda.time.TestPeriod_Constructors#testConstructor_long_long_PeriodType_Chronology1 AssertionFailedError
  org.joda.time.TestPeriod_Constructors#testConstructor_long_long_PeriodType_Chronology2 AssertionFailedError
  org.joda.time.TestPeriod_Constructors#testFactoryDays AssertionFailedError exp...
  org.joda.time.TestPeriod_Constructors#testFactoryFieldDifference1 AssertionFailedError
  org.joda.time.TestPeriod_Constructors#testFactoryHours AssertionFailedError ex...
  org.joda.time.TestPeriod_Constructors#testFactoryMillis AssertionFailedError e...
  org.joda.time.TestPeriod_Constructors#testFactoryMinutes AssertionFailedError ...
  org.joda.time.TestPeriod_Constructors#testFactoryMonths AssertionFailedError e...
  org.joda.time.TestPeriod_Constructors#testFactorySeconds AssertionFailedError ...
  org.joda.time.TestPeriod_Constructors#testFactoryWeeks AssertionFailedError ex...
  org.joda.time.TestPeriod_Constructors#testFactoryYears AssertionFailedError ex...
  org.joda.time.TestPeriod_Constructors#testToPeriod_PeriodType3 AssertionFailedError
  org.joda.time.TestSeconds#testFactory_parseSeconds_String AssertionFailedError
  org.joda.time.TestStringConvert#testDays AssertionFailedError expected:<P5D> b...
  org.joda.time.TestStringConvert#testHours AssertionFailedError expected:<PT5H>...
  org.joda.time.TestStringConvert#testMinutes AssertionFailedError expected:<PT5...
  org.joda.time.TestStringConvert#testMonths AssertionFailedError expected:<P5M>...
  org.joda.time.TestStringConvert#testSeconds AssertionFailedError expected:<PT5...
  org.joda.time.TestStringConvert#testWeeks AssertionFailedError expected:<P5W> ...
  org.joda.time.TestStringConvert#testYears AssertionFailedError expected:<P5Y> ...
  org.joda.time.TestWeeks#testFactory_parseWeeks_String AssertionFailedError exp...
  org.joda.time.TestYears#testFactory_parseYears_String AssertionFailedError exp...
  org.joda.time.convert.TestStringConverter#testSetIntoPeriod_Object1 AssertionFailedError
  org.joda.time.convert.TestStringConverter#testSetIntoPeriod_Object2 AssertionFailedError
  org.joda.time.convert.TestStringConverter#testSetIntoPeriod_Object3 AssertionFailedError
  org.joda.time.convert.TestStringConverter#testSetIntoPeriod_Object4 AssertionFailedError
  org.joda.time.convert.TestStringConverter#testSetIntoPeriod_Object5 AssertionFailedError
  org.joda.time.convert.TestStringConverter#testSetIntoPeriod_Object6 AssertionFailedError
  org.joda.time.convert.TestStringConverter#testSetIntoPeriod_Object7 AssertionFailedError
Tests in error: 
  org.joda.time.TestMutablePeriod_Constructors#testConstructor_8int__PeriodType2 ArrayIndexOutOfBoundsException
  org.joda.time.TestMutablePeriod_Constructors#testConstructor_Object3 ArrayIndexOutOfBoundsException
  org.joda.time.TestMutablePeriod_Constructors#testConstructor_Object_PeriodType2 ArrayIndexOutOfBoundsException
  org.joda.time.TestMutablePeriod_Constructors#testConstructor_Object_PeriodType3 ArrayIndexOutOfBoundsException
  org.joda.time.TestMutablePeriod_Constructors#testConstructor_Object_PeriodType4 ArrayIndexOutOfBoundsException
  org.joda.time.TestMutablePeriod_Constructors#testConstructor_PeriodType1 ArrayIndexOutOfBoundsException
  org.joda.time.TestMutablePeriod_Constructors#testConstructor_RI_RI_PeriodType2 ArrayIndexOutOfBoundsException
  org.joda.time.TestMutablePeriod_Constructors#testConstructor_long_PeriodType2 ArrayIndexOutOfBoundsException
  org.joda.time.TestMutablePeriod_Constructors#testConstructor_long_PeriodType_Chronology1 ArrayIndexOutOfBoundsException
  org.joda.time.TestMutablePeriod_Constructors#testConstructor_long_long_PeriodType2 ArrayIndexOutOfBoundsException
  org.joda.time.TestMutablePeriod_Updates#testAdd_8ints2 ArrayIndexOutOfBoundsException
  org.joda.time.TestMutablePeriod_Updates#testAdd_RD2 ArrayIndexOutOfBoundsException
  org.joda.time.TestMutablePeriod_Updates#testAdd_RInterval3 ArrayIndexOutOfBoundsException
  org.joda.time.TestMutablePeriod_Updates#testMergePeriod_RP2 ArrayIndexOutOfBoundsException
  org.joda.time.TestMutablePeriod_Updates#testMergePeriod_RP3 ArrayIndexOutOfBoundsException
  org.joda.time.TestMutablePeriod_Updates#testSetPeriod_8ints2 ArrayIndexOutOfBoundsException
  org.joda.time.TestMutablePeriod_Updates#testSetPeriod_8ints3 ArrayIndexOutOfBoundsException
  org.joda.time.TestMutablePeriod_Updates#testSetPeriod_RP2 ArrayIndexOutOfBoundsException
  org.joda.time.TestMutablePeriod_Updates#testSetPeriod_RP3 ArrayIndexOutOfBoundsException
  org.joda.time.TestMutablePeriod_Updates#testSetPeriod_long_long_NoYears ArrayIndexOutOfBoundsException
  org.joda.time.TestPeriod_Constructors#testConstructor_8int__PeriodType2 ArrayIndexOutOfBoundsException
  org.joda.time.TestPeriod_Constructors#testConstructor_Object3 ArrayIndexOutOfBoundsException
  org.joda.time.TestPeriod_Constructors#testConstructor_Object_PeriodType2 ArrayIndexOutOfBoundsException
  org.joda.time.TestPeriod_Constructors#testConstructor_Object_PeriodType3 ArrayIndexOutOfBoundsException
  org.joda.time.TestPeriod_Constructors#testConstructor_Object_PeriodType4 ArrayIndexOutOfBoundsException
  org.joda.time.TestPeriod_Constructors#testConstructor_RI_RI_PeriodType2 ArrayIndexOutOfBoundsException
  org.joda.time.TestPeriod_Constructors#testConstructor_long_PeriodType2 ArrayIndexOutOfBoundsException
  org.joda.time.TestPeriod_Constructors#testConstructor_long_PeriodType3 ArrayIndexOutOfBoundsException
  org.joda.time.TestPeriod_Constructors#testConstructor_long_PeriodType_Chronology1 ArrayIndexOutOfBoundsException
  org.joda.time.TestPeriod_Constructors#testConstructor_long_long_PeriodType2 ArrayIndexOutOfBoundsException
  org.joda.time.convert.TestReadableDurationConverter#testSetInto_Object ArrayIndexOutOfBoundsException
  org.joda.time.convert.TestReadableIntervalConverter#testSetIntoPeriod_Object1 ArrayIndexOutOfBoundsException
  org.joda.time.convert.TestReadableIntervalConverter#testSetIntoPeriod_Object2 ArrayIndexOutOfBoundsException
  org.joda.time.convert.TestReadablePeriodConverter#testSetInto_Object ArrayIndexOutOfBoundsException

Tests run: 4157, Failures: 221, Errors: 34, Skipped: 0

[INFO] ------------------------------------------------------------------------
[INFO] BUILD FAILURE
[INFO] ------------------------------------------------------------------------
[INFO] Total time: 14.957s
[INFO] Finished at: Wed Aug 05 19:28:15 BST 2015
[INFO] Final Memory: 9M/213M
[INFO] ------------------------------------------------------------------------
[ERROR] Failed to execute goal org.apache.maven.plugins:maven-surefire-plugin:2.18.1:test (default-test) on project joda-time: There are test failures.
[ERROR] 
[ERROR] Please refer to /home/perham/Study/LittleDarwin/Cases/joda-time-2.8.1/target/surefire-reports for the individual test results.
[ERROR] -> [Help 1]
[ERROR] 
[ERROR] To see the full stack trace of the errors, re-run Maven with the -e switch.
[ERROR] Re-run Maven using the -X switch to enable full debug logging.
[ERROR] 
[ERROR] For more information about the errors and possible solutions, please read the following articles:
[ERROR] [Help 1] http://cwiki.apache.org/confluence/display/MAVEN/MojoFailureException
