[INFO] Scanning for projects...
[INFO]                                                                         
[INFO] ------------------------------------------------------------------------
[INFO] Building Joda-Time 2.8.1
[INFO] ------------------------------------------------------------------------
[INFO] 
[INFO] --- maven-resources-plugin:2.7:resources (default-resources) @ joda-time ---
[INFO] Using 'UTF-8' encoding to copy filtered resources.
[INFO] Copying 2 resources to META-INF
[INFO] Copying 10 resources
[INFO] 
[INFO] --- maven-compiler-plugin:3.3:compile (default-compile) @ joda-time ---
[INFO] Changes detected - recompiling the module!
[INFO] Compiling 166 source files to /home/perham/Study/LittleDarwin/Cases/joda-time-2.8.1/target/classes
[INFO] 
[INFO] --- exec-maven-plugin:1.4.0:java (compile-tzdb) @ joda-time ---
Writing zoneinfo files
Writing ZoneInfoMap
[INFO] 
[INFO] --- maven-resources-plugin:2.7:testResources (default-testResources) @ joda-time ---
[INFO] Using 'UTF-8' encoding to copy filtered resources.
[INFO] Copying 34 resources
[INFO] 
[INFO] --- maven-compiler-plugin:3.3:testCompile (default-testCompile) @ joda-time ---
[INFO] Nothing to compile - all classes are up to date
[INFO] 
[INFO] --- maven-surefire-plugin:2.18.1:test (default-test) @ joda-time ---
[INFO] Surefire report directory: /home/perham/Study/LittleDarwin/Cases/joda-time-2.8.1/target/surefire-reports

-------------------------------------------------------
 T E S T S
-------------------------------------------------------
Running org.joda.time.TestAllPackages

TestBuddhistChronology.testCalendar

TestCopticChronology.testCalendar

TestEthiopicChronology.testCalendar

TestIslamicChronology.testCalendar

Testing Gregorian chronology over 1000 iterations
100% complete (i=1000)

Testing Julian chronology over 1000 iterations
100% complete (i=1000)
Writing zoneinfo files
Writing ZoneInfoMap
Tests run: 4157, Failures: 18, Errors: 7, Skipped: 0, Time elapsed: 5.278 sec <<< FAILURE! - in org.joda.time.TestAllPackages
testConstructor_long_long_PeriodType3(org.joda.time.TestPeriod_Constructors)  Time elapsed: 0.004 sec  <<< FAILURE!
junit.framework.AssertionFailedError: expected:<1> but was:<0>
	at junit.framework.Assert.fail(Assert.java:47)
	at junit.framework.Assert.failNotEquals(Assert.java:280)
	at junit.framework.Assert.assertEquals(Assert.java:64)
	at junit.framework.Assert.assertEquals(Assert.java:198)
	at junit.framework.Assert.assertEquals(Assert.java:204)
	at org.joda.time.TestPeriod_Constructors.testConstructor_long_long_PeriodType3(TestPeriod_Constructors.java:532)

testConstructor_RI_RI_PeriodType3(org.joda.time.TestPeriod_Constructors)  Time elapsed: 0.001 sec  <<< FAILURE!
junit.framework.AssertionFailedError: expected:<1> but was:<0>
	at junit.framework.Assert.fail(Assert.java:47)
	at junit.framework.Assert.failNotEquals(Assert.java:280)
	at junit.framework.Assert.assertEquals(Assert.java:64)
	at junit.framework.Assert.assertEquals(Assert.java:198)
	at junit.framework.Assert.assertEquals(Assert.java:204)
	at org.joda.time.TestPeriod_Constructors.testConstructor_RI_RI_PeriodType3(TestPeriod_Constructors.java:764)

testConstructor_long_PeriodType4(org.joda.time.TestPeriod_Constructors)  Time elapsed: 0 sec  <<< FAILURE!
junit.framework.AssertionFailedError: expected:<5> but was:<0>
	at junit.framework.Assert.fail(Assert.java:47)
	at junit.framework.Assert.failNotEquals(Assert.java:280)
	at junit.framework.Assert.assertEquals(Assert.java:64)
	at junit.framework.Assert.assertEquals(Assert.java:198)
	at junit.framework.Assert.assertEquals(Assert.java:204)
	at org.joda.time.TestPeriod_Constructors.testConstructor_long_PeriodType4(TestPeriod_Constructors.java:263)

testConstructor_long_PeriodType_Chronology1(org.joda.time.TestPeriod_Constructors)  Time elapsed: 0 sec  <<< FAILURE!
junit.framework.AssertionFailedError: expected:<101> but was:<0>
	at junit.framework.Assert.fail(Assert.java:47)
	at junit.framework.Assert.failNotEquals(Assert.java:280)
	at junit.framework.Assert.assertEquals(Assert.java:64)
	at junit.framework.Assert.assertEquals(Assert.java:198)
	at junit.framework.Assert.assertEquals(Assert.java:204)
	at org.joda.time.TestPeriod_Constructors.testConstructor_long_PeriodType_Chronology1(TestPeriod_Constructors.java:333)

testNormalizedStandard_periodType_monthsWeeks(org.joda.time.TestPeriod_Basics)  Time elapsed: 0 sec  <<< ERROR!
java.lang.ArrayIndexOutOfBoundsException: 4
	at org.joda.time.PeriodType.withFieldRemoved(PeriodType.java:195)
	at org.joda.time.PeriodType.withSecondsRemoved(PeriodType.java:188)
	at org.joda.time.PeriodType.forFields(PeriodType.java:145)
	at org.joda.time.TestPeriod_Basics.testNormalizedStandard_periodType_monthsWeeks(TestPeriod_Basics.java:1552)

testConstructor_long_long_PeriodType3(org.joda.time.TestMutablePeriod_Constructors)  Time elapsed: 0 sec  <<< FAILURE!
junit.framework.AssertionFailedError: expected:<1> but was:<0>
	at junit.framework.Assert.fail(Assert.java:47)
	at junit.framework.Assert.failNotEquals(Assert.java:280)
	at junit.framework.Assert.assertEquals(Assert.java:64)
	at junit.framework.Assert.assertEquals(Assert.java:198)
	at junit.framework.Assert.assertEquals(Assert.java:204)
	at org.joda.time.TestMutablePeriod_Constructors.testConstructor_long_long_PeriodType3(TestMutablePeriod_Constructors.java:538)

testConstructor_RI_RI_PeriodType3(org.joda.time.TestMutablePeriod_Constructors)  Time elapsed: 0.001 sec  <<< FAILURE!
junit.framework.AssertionFailedError: expected:<1> but was:<0>
	at junit.framework.Assert.fail(Assert.java:47)
	at junit.framework.Assert.failNotEquals(Assert.java:280)
	at junit.framework.Assert.assertEquals(Assert.java:64)
	at junit.framework.Assert.assertEquals(Assert.java:198)
	at junit.framework.Assert.assertEquals(Assert.java:204)
	at org.joda.time.TestMutablePeriod_Constructors.testConstructor_RI_RI_PeriodType3(TestMutablePeriod_Constructors.java:722)

testConstructor_long_PeriodType4(org.joda.time.TestMutablePeriod_Constructors)  Time elapsed: 0.001 sec  <<< FAILURE!
junit.framework.AssertionFailedError: expected:<5> but was:<0>
	at junit.framework.Assert.fail(Assert.java:47)
	at junit.framework.Assert.failNotEquals(Assert.java:280)
	at junit.framework.Assert.assertEquals(Assert.java:64)
	at junit.framework.Assert.assertEquals(Assert.java:198)
	at junit.framework.Assert.assertEquals(Assert.java:204)
	at org.joda.time.TestMutablePeriod_Constructors.testConstructor_long_PeriodType4(TestMutablePeriod_Constructors.java:269)

testConstructor_long_PeriodType_Chronology1(org.joda.time.TestMutablePeriod_Constructors)  Time elapsed: 0 sec  <<< FAILURE!
junit.framework.AssertionFailedError: expected:<101> but was:<0>
	at junit.framework.Assert.fail(Assert.java:47)
	at junit.framework.Assert.failNotEquals(Assert.java:280)
	at junit.framework.Assert.assertEquals(Assert.java:64)
	at junit.framework.Assert.assertEquals(Assert.java:198)
	at junit.framework.Assert.assertEquals(Assert.java:204)
	at org.joda.time.TestMutablePeriod_Constructors.testConstructor_long_PeriodType_Chronology1(TestMutablePeriod_Constructors.java:339)

testSetPeriod_long_long_NoYears(org.joda.time.TestMutablePeriod_Updates)  Time elapsed: 0.001 sec  <<< FAILURE!
junit.framework.AssertionFailedError: expected:<0> but was:<13>
	at junit.framework.Assert.fail(Assert.java:47)
	at junit.framework.Assert.failNotEquals(Assert.java:280)
	at junit.framework.Assert.assertEquals(Assert.java:64)
	at junit.framework.Assert.assertEquals(Assert.java:198)
	at junit.framework.Assert.assertEquals(Assert.java:204)
	at org.joda.time.TestMutablePeriod_Updates.testSetPeriod_long_long_NoYears(TestMutablePeriod_Updates.java:607)

testSetPeriod_long_long_NoMonths(org.joda.time.TestMutablePeriod_Updates)  Time elapsed: 0 sec  <<< FAILURE!
junit.framework.AssertionFailedError: expected:<1> but was:<0>
	at junit.framework.Assert.fail(Assert.java:47)
	at junit.framework.Assert.failNotEquals(Assert.java:280)
	at junit.framework.Assert.assertEquals(Assert.java:64)
	at junit.framework.Assert.assertEquals(Assert.java:198)
	at junit.framework.Assert.assertEquals(Assert.java:204)
	at org.joda.time.TestMutablePeriod_Updates.testSetPeriod_long_long_NoMonths(TestMutablePeriod_Updates.java:622)

testSetPeriod_long_long_NoWeeks(org.joda.time.TestMutablePeriod_Updates)  Time elapsed: 0 sec  <<< FAILURE!
junit.framework.AssertionFailedError: expected:<1> but was:<0>
	at junit.framework.Assert.fail(Assert.java:47)
	at junit.framework.Assert.failNotEquals(Assert.java:280)
	at junit.framework.Assert.assertEquals(Assert.java:64)
	at junit.framework.Assert.assertEquals(Assert.java:198)
	at junit.framework.Assert.assertEquals(Assert.java:204)
	at org.joda.time.TestMutablePeriod_Updates.testSetPeriod_long_long_NoWeeks(TestMutablePeriod_Updates.java:637)

testSetPeriod_long_long_NoDays(org.joda.time.TestMutablePeriod_Updates)  Time elapsed: 0.001 sec  <<< FAILURE!
junit.framework.AssertionFailedError: expected:<1> but was:<0>
	at junit.framework.Assert.fail(Assert.java:47)
	at junit.framework.Assert.failNotEquals(Assert.java:280)
	at junit.framework.Assert.assertEquals(Assert.java:64)
	at junit.framework.Assert.assertEquals(Assert.java:198)
	at junit.framework.Assert.assertEquals(Assert.java:204)
	at org.joda.time.TestMutablePeriod_Updates.testSetPeriod_long_long_NoDays(TestMutablePeriod_Updates.java:652)

testSetPeriod_long_long_NoHours(org.joda.time.TestMutablePeriod_Updates)  Time elapsed: 0.002 sec  <<< FAILURE!
junit.framework.AssertionFailedError: expected:<1> but was:<0>
	at junit.framework.Assert.fail(Assert.java:47)
	at junit.framework.Assert.failNotEquals(Assert.java:280)
	at junit.framework.Assert.assertEquals(Assert.java:64)
	at junit.framework.Assert.assertEquals(Assert.java:198)
	at junit.framework.Assert.assertEquals(Assert.java:204)
	at org.joda.time.TestMutablePeriod_Updates.testSetPeriod_long_long_NoHours(TestMutablePeriod_Updates.java:667)

testSetPeriod_long_long_NoMinutes(org.joda.time.TestMutablePeriod_Updates)  Time elapsed: 0 sec  <<< FAILURE!
junit.framework.AssertionFailedError: expected:<1> but was:<0>
	at junit.framework.Assert.fail(Assert.java:47)
	at junit.framework.Assert.failNotEquals(Assert.java:280)
	at junit.framework.Assert.assertEquals(Assert.java:64)
	at junit.framework.Assert.assertEquals(Assert.java:198)
	at junit.framework.Assert.assertEquals(Assert.java:204)
	at org.joda.time.TestMutablePeriod_Updates.testSetPeriod_long_long_NoMinutes(TestMutablePeriod_Updates.java:682)

testSetPeriod_long_long_NoSeconds(org.joda.time.TestMutablePeriod_Updates)  Time elapsed: 0.001 sec  <<< FAILURE!
junit.framework.AssertionFailedError: expected:<1> but was:<0>
	at junit.framework.Assert.fail(Assert.java:47)
	at junit.framework.Assert.failNotEquals(Assert.java:280)
	at junit.framework.Assert.assertEquals(Assert.java:64)
	at junit.framework.Assert.assertEquals(Assert.java:198)
	at junit.framework.Assert.assertEquals(Assert.java:204)
	at org.joda.time.TestMutablePeriod_Updates.testSetPeriod_long_long_NoSeconds(TestMutablePeriod_Updates.java:697)

testSetPeriod_long_long_NoMillis(org.joda.time.TestMutablePeriod_Updates)  Time elapsed: 0 sec  <<< FAILURE!
junit.framework.AssertionFailedError: expected:<1> but was:<0>
	at junit.framework.Assert.fail(Assert.java:47)
	at junit.framework.Assert.failNotEquals(Assert.java:280)
	at junit.framework.Assert.assertEquals(Assert.java:64)
	at junit.framework.Assert.assertEquals(Assert.java:198)
	at junit.framework.Assert.assertEquals(Assert.java:204)
	at org.joda.time.TestMutablePeriod_Updates.testSetPeriod_long_long_NoMillis(TestMutablePeriod_Updates.java:712)

testForFields2(org.joda.time.TestPeriodType)  Time elapsed: 0.001 sec  <<< ERROR!
java.lang.ArrayIndexOutOfBoundsException: 4
	at org.joda.time.PeriodType.withFieldRemoved(PeriodType.java:195)
	at org.joda.time.PeriodType.withMinutesRemoved(PeriodType.java:187)
	at org.joda.time.PeriodType.forFields(PeriodType.java:144)
	at org.joda.time.TestPeriodType.testForFields2(TestPeriodType.java:488)

testForFields3(org.joda.time.TestPeriodType)  Time elapsed: 0 sec  <<< ERROR!
java.lang.ArrayIndexOutOfBoundsException: 4
	at org.joda.time.PeriodType.withFieldRemoved(PeriodType.java:195)
	at org.joda.time.PeriodType.withMinutesRemoved(PeriodType.java:187)
	at org.joda.time.PeriodType.forFields(PeriodType.java:144)
	at org.joda.time.TestPeriodType.testForFields3(TestPeriodType.java:508)

testForFields4(org.joda.time.TestPeriodType)  Time elapsed: 0 sec  <<< ERROR!
java.lang.ArrayIndexOutOfBoundsException: 4
	at org.joda.time.PeriodType.withFieldRemoved(PeriodType.java:195)
	at org.joda.time.PeriodType.withSecondsRemoved(PeriodType.java:188)
	at org.joda.time.PeriodType.forFields(PeriodType.java:145)
	at org.joda.time.TestPeriodType.testForFields4(TestPeriodType.java:534)

testForFields5(org.joda.time.TestPeriodType)  Time elapsed: 0 sec  <<< ERROR!
java.lang.ArrayIndexOutOfBoundsException: 3
	at org.joda.time.PeriodType.withFieldRemoved(PeriodType.java:195)
	at org.joda.time.PeriodType.withMinutesRemoved(PeriodType.java:187)
	at org.joda.time.PeriodType.forFields(PeriodType.java:144)
	at org.joda.time.TestPeriodType.testForFields5(TestPeriodType.java:545)

testForFields7(org.joda.time.TestPeriodType)  Time elapsed: 0 sec  <<< ERROR!
java.lang.ArrayIndexOutOfBoundsException: 4
	at org.joda.time.PeriodType.withFieldRemoved(PeriodType.java:195)
	at org.joda.time.PeriodType.withMinutesRemoved(PeriodType.java:187)
	at org.joda.time.PeriodType.forFields(PeriodType.java:144)
	at org.joda.time.TestPeriodType.testForFields7(TestPeriodType.java:607)

testMaskHoursMinutesSeconds(org.joda.time.TestPeriodType)  Time elapsed: 0 sec  <<< ERROR!
java.lang.ArrayIndexOutOfBoundsException: 5
	at org.joda.time.PeriodType.withFieldRemoved(PeriodType.java:195)
	at org.joda.time.PeriodType.withSecondsRemoved(PeriodType.java:188)
	at org.joda.time.TestPeriodType.testMaskHoursMinutesSeconds(TestPeriodType.java:792)

testMaskTwice1(org.joda.time.TestPeriodType)  Time elapsed: 0.001 sec  <<< FAILURE!
junit.framework.AssertionFailedError: expected:<true> but was:<false>
	at junit.framework.Assert.fail(Assert.java:47)
	at junit.framework.Assert.failNotEquals(Assert.java:280)
	at junit.framework.Assert.assertEquals(Assert.java:64)
	at junit.framework.Assert.assertEquals(Assert.java:146)
	at junit.framework.Assert.assertEquals(Assert.java:152)
	at org.joda.time.TestPeriodType.testMaskTwice1(TestPeriodType.java:814)

testFormatStandard(org.joda.time.format.TestISOPeriodFormat)  Time elapsed: 0.002 sec  <<< FAILURE!
junit.framework.ComparisonFailure: expected:<PT0[M]> but was:<PT0[S]>
	at junit.framework.Assert.assertEquals(Assert.java:81)
	at junit.framework.Assert.assertEquals(Assert.java:87)
	at org.joda.time.format.TestISOPeriodFormat.testFormatStandard(TestISOPeriodFormat.java:110)


Results :

Failed tests: 
  org.joda.time.TestMutablePeriod_Constructors#testConstructor_RI_RI_PeriodType3 AssertionFailedError
  org.joda.time.TestMutablePeriod_Constructors#testConstructor_long_PeriodType4 AssertionFailedError
  org.joda.time.TestMutablePeriod_Constructors#testConstructor_long_PeriodType_Chronology1 AssertionFailedError
  org.joda.time.TestMutablePeriod_Constructors#testConstructor_long_long_PeriodType3 AssertionFailedError
  org.joda.time.TestMutablePeriod_Updates#testSetPeriod_long_long_NoDays AssertionFailedError
  org.joda.time.TestMutablePeriod_Updates#testSetPeriod_long_long_NoHours AssertionFailedError
  org.joda.time.TestMutablePeriod_Updates#testSetPeriod_long_long_NoMillis AssertionFailedError
  org.joda.time.TestMutablePeriod_Updates#testSetPeriod_long_long_NoMinutes AssertionFailedError
  org.joda.time.TestMutablePeriod_Updates#testSetPeriod_long_long_NoMonths AssertionFailedError
  org.joda.time.TestMutablePeriod_Updates#testSetPeriod_long_long_NoSeconds AssertionFailedError
  org.joda.time.TestMutablePeriod_Updates#testSetPeriod_long_long_NoWeeks AssertionFailedError
  org.joda.time.TestMutablePeriod_Updates#testSetPeriod_long_long_NoYears AssertionFailedError
  org.joda.time.TestPeriodType#testMaskTwice1 AssertionFailedError expected:<tru...
  org.joda.time.TestPeriod_Constructors#testConstructor_RI_RI_PeriodType3 AssertionFailedError
  org.joda.time.TestPeriod_Constructors#testConstructor_long_PeriodType4 AssertionFailedError
  org.joda.time.TestPeriod_Constructors#testConstructor_long_PeriodType_Chronology1 AssertionFailedError
  org.joda.time.TestPeriod_Constructors#testConstructor_long_long_PeriodType3 AssertionFailedError
  org.joda.time.format.TestISOPeriodFormat#testFormatStandard ComparisonFailure ...
Tests in error: 
  org.joda.time.TestPeriodType#testForFields2 ArrayIndexOutOfBoundsException 4
  org.joda.time.TestPeriodType#testForFields3 ArrayIndexOutOfBoundsException 4
  org.joda.time.TestPeriodType#testForFields4 ArrayIndexOutOfBoundsException 4
  org.joda.time.TestPeriodType#testForFields5 ArrayIndexOutOfBoundsException 3
  org.joda.time.TestPeriodType#testForFields7 ArrayIndexOutOfBoundsException 4
  org.joda.time.TestPeriodType#testMaskHoursMinutesSeconds ArrayIndexOutOfBoundsException
  org.joda.time.TestPeriod_Basics#testNormalizedStandard_periodType_monthsWeeks ArrayIndexOutOfBoundsException

Tests run: 4157, Failures: 18, Errors: 7, Skipped: 0

[INFO] ------------------------------------------------------------------------
[INFO] BUILD FAILURE
[INFO] ------------------------------------------------------------------------
[INFO] Total time: 15.386s
[INFO] Finished at: Wed Aug 05 19:25:38 BST 2015
[INFO] Final Memory: 10M/339M
[INFO] ------------------------------------------------------------------------
[ERROR] Failed to execute goal org.apache.maven.plugins:maven-surefire-plugin:2.18.1:test (default-test) on project joda-time: There are test failures.
[ERROR] 
[ERROR] Please refer to /home/perham/Study/LittleDarwin/Cases/joda-time-2.8.1/target/surefire-reports for the individual test results.
[ERROR] -> [Help 1]
[ERROR] 
[ERROR] To see the full stack trace of the errors, re-run Maven with the -e switch.
[ERROR] Re-run Maven using the -X switch to enable full debug logging.
[ERROR] 
[ERROR] For more information about the errors and possible solutions, please read the following articles:
[ERROR] [Help 1] http://cwiki.apache.org/confluence/display/MAVEN/MojoFailureException
