[INFO] Scanning for projects...
[INFO]                                                                         
[INFO] ------------------------------------------------------------------------
[INFO] Building Joda-Time 2.8.1
[INFO] ------------------------------------------------------------------------
[INFO] 
[INFO] --- maven-resources-plugin:2.7:resources (default-resources) @ joda-time ---
[INFO] Using 'UTF-8' encoding to copy filtered resources.
[INFO] Copying 2 resources to META-INF
[INFO] Copying 10 resources
[INFO] 
[INFO] --- maven-compiler-plugin:3.3:compile (default-compile) @ joda-time ---
[INFO] Changes detected - recompiling the module!
[INFO] Compiling 166 source files to /home/perham/Study/LittleDarwin/Cases/joda-time-2.8.1/target/classes
[INFO] 
[INFO] --- exec-maven-plugin:1.4.0:java (compile-tzdb) @ joda-time ---
Writing zoneinfo files
Writing ZoneInfoMap
[INFO] 
[INFO] --- maven-resources-plugin:2.7:testResources (default-testResources) @ joda-time ---
[INFO] Using 'UTF-8' encoding to copy filtered resources.
[INFO] Copying 34 resources
[INFO] 
[INFO] --- maven-compiler-plugin:3.3:testCompile (default-testCompile) @ joda-time ---
[INFO] Nothing to compile - all classes are up to date
[INFO] 
[INFO] --- maven-surefire-plugin:2.18.1:test (default-test) @ joda-time ---
[INFO] Surefire report directory: /home/perham/Study/LittleDarwin/Cases/joda-time-2.8.1/target/surefire-reports

-------------------------------------------------------
 T E S T S
-------------------------------------------------------
Running org.joda.time.TestAllPackages

TestBuddhistChronology.testCalendar

TestCopticChronology.testCalendar

TestEthiopicChronology.testCalendar

TestIslamicChronology.testCalendar

Testing Gregorian chronology over 1000 iterations
100% complete (i=1000)

Testing Julian chronology over 1000 iterations
100% complete (i=1000)
Writing zoneinfo files
Writing ZoneInfoMap
Tests run: 4157, Failures: 0, Errors: 10, Skipped: 0, Time elapsed: 5.326 sec <<< FAILURE! - in org.joda.time.TestAllPackages
testNormalizedStandard_yearMonth1(org.joda.time.TestPeriod_Basics)  Time elapsed: 0.004 sec  <<< ERROR!
java.lang.UnsupportedOperationException: Unable to normalize as PeriodType is missing either years or months but period has a month/year amount: P1Y15M
	at org.joda.time.Period.normalizedStandard(Period.java:253)
	at org.joda.time.Period.normalizedStandard(Period.java:235)
	at org.joda.time.TestPeriod_Basics.testNormalizedStandard_yearMonth1(TestPeriod_Basics.java:1404)

testNormalizedStandard_yearMonthWeekDay(org.joda.time.TestPeriod_Basics)  Time elapsed: 0 sec  <<< ERROR!
java.lang.UnsupportedOperationException: Unable to normalize as PeriodType is missing either years or months but period has a month/year amount: P1Y15M1W12D
	at org.joda.time.Period.normalizedStandard(Period.java:253)
	at org.joda.time.Period.normalizedStandard(Period.java:235)
	at org.joda.time.TestPeriod_Basics.testNormalizedStandard_yearMonthWeekDay(TestPeriod_Basics.java:1434)

testNormalizedStandard_yearMonthDay(org.joda.time.TestPeriod_Basics)  Time elapsed: 0.001 sec  <<< ERROR!
java.lang.UnsupportedOperationException: Unable to normalize as PeriodType is missing either years or months but period has a month/year amount: P1Y15M36D
	at org.joda.time.Period.normalizedStandard(Period.java:253)
	at org.joda.time.Period.normalizedStandard(Period.java:235)
	at org.joda.time.TestPeriod_Basics.testNormalizedStandard_yearMonthDay(TestPeriod_Basics.java:1441)

testNormalizedStandard_periodType_yearMonth1(org.joda.time.TestPeriod_Basics)  Time elapsed: 0.001 sec  <<< ERROR!
java.lang.UnsupportedOperationException: Unable to normalize as PeriodType is missing either years or months but period has a month/year amount: P1Y15M
	at org.joda.time.Period.normalizedStandard(Period.java:253)
	at org.joda.time.TestPeriod_Basics.testNormalizedStandard_periodType_yearMonth1(TestPeriod_Basics.java:1463)

testNormalizedStandard_periodType_yearMonthWeekDay(org.joda.time.TestPeriod_Basics)  Time elapsed: 0.001 sec  <<< ERROR!
java.lang.UnsupportedOperationException: Unable to normalize as PeriodType is missing either years or months but period has a month/year amount: P1Y15M1W12D
	at org.joda.time.Period.normalizedStandard(Period.java:253)
	at org.joda.time.TestPeriod_Basics.testNormalizedStandard_periodType_yearMonthWeekDay(TestPeriod_Basics.java:1508)

testNormalizedStandard_periodType_yearMonthDay(org.joda.time.TestPeriod_Basics)  Time elapsed: 0.001 sec  <<< ERROR!
java.lang.UnsupportedOperationException: Unable to normalize as PeriodType is missing either years or months but period has a month/year amount: P1Y15M36DT27H
	at org.joda.time.Period.normalizedStandard(Period.java:253)
	at org.joda.time.TestPeriod_Basics.testNormalizedStandard_periodType_yearMonthDay(TestPeriod_Basics.java:1515)

testNormalizedStandard_periodType_months1(org.joda.time.TestPeriod_Basics)  Time elapsed: 0.001 sec  <<< ERROR!
java.lang.UnsupportedOperationException: Unable to normalize as PeriodType is missing either years or months but period has a month/year amount: P1Y15M
	at org.joda.time.Period.normalizedStandard(Period.java:253)
	at org.joda.time.TestPeriod_Basics.testNormalizedStandard_periodType_months1(TestPeriod_Basics.java:1522)

testNormalizedStandard_periodType_months2(org.joda.time.TestPeriod_Basics)  Time elapsed: 0.001 sec  <<< ERROR!
java.lang.UnsupportedOperationException: Unable to normalize as PeriodType is missing either years or months but period has a month/year amount: P-2Y15M
	at org.joda.time.Period.normalizedStandard(Period.java:253)
	at org.joda.time.TestPeriod_Basics.testNormalizedStandard_periodType_months2(TestPeriod_Basics.java:1529)

testNormalizedStandard_periodType_months3(org.joda.time.TestPeriod_Basics)  Time elapsed: 0.001 sec  <<< ERROR!
java.lang.UnsupportedOperationException: Unable to normalize as PeriodType is missing either years or months but period has a month/year amount: P4M
	at org.joda.time.Period.normalizedStandard(Period.java:253)
	at org.joda.time.TestPeriod_Basics.testNormalizedStandard_periodType_months3(TestPeriod_Basics.java:1536)

testNormalizedStandard_periodType_monthsWeeks(org.joda.time.TestPeriod_Basics)  Time elapsed: 0 sec  <<< ERROR!
java.lang.UnsupportedOperationException: Unable to normalize as PeriodType is missing either years or months but period has a month/year amount: P2Y4M6W
	at org.joda.time.Period.normalizedStandard(Period.java:253)
	at org.joda.time.TestPeriod_Basics.testNormalizedStandard_periodType_monthsWeeks(TestPeriod_Basics.java:1557)


Results :

Tests in error: 
  org.joda.time.TestPeriod_Basics#testNormalizedStandard_periodType_months1 UnsupportedOperationException
  org.joda.time.TestPeriod_Basics#testNormalizedStandard_periodType_months2 UnsupportedOperationException
  org.joda.time.TestPeriod_Basics#testNormalizedStandard_periodType_months3 UnsupportedOperationException
  org.joda.time.TestPeriod_Basics#testNormalizedStandard_periodType_monthsWeeks UnsupportedOperationException
  org.joda.time.TestPeriod_Basics#testNormalizedStandard_periodType_yearMonth1 UnsupportedOperationException
  org.joda.time.TestPeriod_Basics#testNormalizedStandard_periodType_yearMonthDay UnsupportedOperationException
  org.joda.time.TestPeriod_Basics#testNormalizedStandard_periodType_yearMonthWeekDay UnsupportedOperationException
  org.joda.time.TestPeriod_Basics#testNormalizedStandard_yearMonth1 UnsupportedOperationException
  org.joda.time.TestPeriod_Basics#testNormalizedStandard_yearMonthDay UnsupportedOperationException
  org.joda.time.TestPeriod_Basics#testNormalizedStandard_yearMonthWeekDay UnsupportedOperationException

Tests run: 4157, Failures: 0, Errors: 10, Skipped: 0

[INFO] ------------------------------------------------------------------------
[INFO] BUILD FAILURE
[INFO] ------------------------------------------------------------------------
[INFO] Total time: 15.544s
[INFO] Finished at: Wed Aug 05 18:21:39 BST 2015
[INFO] Final Memory: 9M/213M
[INFO] ------------------------------------------------------------------------
[ERROR] Failed to execute goal org.apache.maven.plugins:maven-surefire-plugin:2.18.1:test (default-test) on project joda-time: There are test failures.
[ERROR] 
[ERROR] Please refer to /home/perham/Study/LittleDarwin/Cases/joda-time-2.8.1/target/surefire-reports for the individual test results.
[ERROR] -> [Help 1]
[ERROR] 
[ERROR] To see the full stack trace of the errors, re-run Maven with the -e switch.
[ERROR] Re-run Maven using the -X switch to enable full debug logging.
[ERROR] 
[ERROR] For more information about the errors and possible solutions, please read the following articles:
[ERROR] [Help 1] http://cwiki.apache.org/confluence/display/MAVEN/MojoFailureException
