[INFO] Scanning for projects...
[INFO]                                                                         
[INFO] ------------------------------------------------------------------------
[INFO] Building Joda-Time 2.8.1
[INFO] ------------------------------------------------------------------------
[INFO] 
[INFO] --- maven-resources-plugin:2.7:resources (default-resources) @ joda-time ---
[INFO] Using 'UTF-8' encoding to copy filtered resources.
[INFO] Copying 2 resources to META-INF
[INFO] Copying 10 resources
[INFO] 
[INFO] --- maven-compiler-plugin:3.3:compile (default-compile) @ joda-time ---
[INFO] Changes detected - recompiling the module!
[INFO] Compiling 166 source files to /home/perham/Study/LittleDarwin/Cases/joda-time-2.8.1/target/classes
[INFO] 
[INFO] --- exec-maven-plugin:1.4.0:java (compile-tzdb) @ joda-time ---
Writing zoneinfo files
Writing ZoneInfoMap
[INFO] 
[INFO] --- maven-resources-plugin:2.7:testResources (default-testResources) @ joda-time ---
[INFO] Using 'UTF-8' encoding to copy filtered resources.
[INFO] Copying 34 resources
[INFO] 
[INFO] --- maven-compiler-plugin:3.3:testCompile (default-testCompile) @ joda-time ---
[INFO] Nothing to compile - all classes are up to date
[INFO] 
[INFO] --- maven-surefire-plugin:2.18.1:test (default-test) @ joda-time ---
[INFO] Surefire report directory: /home/perham/Study/LittleDarwin/Cases/joda-time-2.8.1/target/surefire-reports

-------------------------------------------------------
 T E S T S
-------------------------------------------------------
Running org.joda.time.TestAllPackages

TestBuddhistChronology.testCalendar

TestCopticChronology.testCalendar

TestEthiopicChronology.testCalendar

TestIslamicChronology.testCalendar

Testing Gregorian chronology over 1000 iterations
100% complete (i=1000)

Testing Julian chronology over 1000 iterations
100% complete (i=1000)
Writing zoneinfo files
Writing ZoneInfoMap
Tests run: 4157, Failures: 0, Errors: 18, Skipped: 0, Time elapsed: 5.333 sec <<< FAILURE! - in org.joda.time.TestAllPackages
testToString3(org.joda.time.TestPartial_Basics)  Time elapsed: 0.005 sec  <<< ERROR!
java.lang.IllegalArgumentException: The field type must not be null
	at org.joda.time.Partial.<init>(Partial.java:34)
	at org.joda.time.Partial.<init>(Partial.java:30)
	at org.joda.time.TestPartial_Basics.testToString3(TestPartial_Basics.java:845)

testToString4(org.joda.time.TestPartial_Basics)  Time elapsed: 0 sec  <<< ERROR!
java.lang.IllegalArgumentException: The field type must not be null
	at org.joda.time.Partial.<init>(Partial.java:34)
	at org.joda.time.Partial.<init>(Partial.java:30)
	at org.joda.time.TestPartial_Basics.testToString4(TestPartial_Basics.java:859)

testToString5(org.joda.time.TestPartial_Basics)  Time elapsed: 0 sec  <<< ERROR!
java.lang.IllegalArgumentException: The field type must not be null
	at org.joda.time.Partial.<init>(Partial.java:34)
	at org.joda.time.Partial.<init>(Partial.java:30)
	at org.joda.time.TestPartial_Basics.testToString5(TestPartial_Basics.java:867)

testWith_baseHasNoRange(org.joda.time.TestPartial_Basics)  Time elapsed: 0.001 sec  <<< ERROR!
java.lang.IllegalArgumentException: The field type must not be null
	at org.joda.time.Partial.<init>(Partial.java:34)
	at org.joda.time.Partial.<init>(Partial.java:30)
	at org.joda.time.TestPartial_Basics.testWith_baseHasNoRange(TestPartial_Basics.java:452)

testWith_argHasNoRange(org.joda.time.TestPartial_Basics)  Time elapsed: 0.001 sec  <<< ERROR!
java.lang.IllegalArgumentException: The field type must not be null
	at org.joda.time.Partial.<init>(Partial.java:34)
	at org.joda.time.Partial.<init>(Partial.java:30)
	at org.joda.time.TestPartial_Basics.testWith_argHasNoRange(TestPartial_Basics.java:460)

testWith_baseAndArgHaveNoRange(org.joda.time.TestPartial_Basics)  Time elapsed: 0 sec  <<< ERROR!
java.lang.IllegalArgumentException: The field type must not be null
	at org.joda.time.Partial.<init>(Partial.java:34)
	at org.joda.time.Partial.<init>(Partial.java:30)
	at org.joda.time.TestPartial_Basics.testWith_baseAndArgHaveNoRange(TestPartial_Basics.java:468)

testWithout5(org.joda.time.TestPartial_Basics)  Time elapsed: 0.001 sec  <<< ERROR!
java.lang.IllegalArgumentException: The field type must not be null
	at org.joda.time.Partial.<init>(Partial.java:34)
	at org.joda.time.Partial.<init>(Partial.java:30)
	at org.joda.time.TestPartial_Basics.testWithout5(TestPartial_Basics.java:511)

testGetFormatter1(org.joda.time.TestPartial_Basics)  Time elapsed: 0.001 sec  <<< ERROR!
java.lang.IllegalArgumentException: The field type must not be null
	at org.joda.time.Partial.<init>(Partial.java:34)
	at org.joda.time.Partial.<init>(Partial.java:30)
	at org.joda.time.TestPartial_Basics.testGetFormatter1(TestPartial_Basics.java:800)

testGetFormatter3(org.joda.time.TestPartial_Basics)  Time elapsed: 0.001 sec  <<< ERROR!
java.lang.IllegalArgumentException: The field type must not be null
	at org.joda.time.Partial.<init>(Partial.java:34)
	at org.joda.time.Partial.<init>(Partial.java:30)
	at org.joda.time.TestPartial_Basics.testGetFormatter3(TestPartial_Basics.java:825)

testWith3d(org.joda.time.TestPartial_Basics)  Time elapsed: 0 sec  <<< ERROR!
java.lang.IllegalArgumentException: The field type must not be null
	at org.joda.time.Partial.<init>(Partial.java:34)
	at org.joda.time.Partial.<init>(Partial.java:30)
	at org.joda.time.TestPartial_Basics.testWith3d(TestPartial_Basics.java:418)

testWith3e(org.joda.time.TestPartial_Basics)  Time elapsed: 0 sec  <<< ERROR!
java.lang.IllegalArgumentException: The field type must not be null
	at org.joda.time.Partial.<init>(Partial.java:34)
	at org.joda.time.Partial.<init>(Partial.java:30)
	at org.joda.time.TestPartial_Basics.testWith3e(TestPartial_Basics.java:426)

testWith3f(org.joda.time.TestPartial_Basics)  Time elapsed: 0.001 sec  <<< ERROR!
java.lang.IllegalArgumentException: The field type must not be null
	at org.joda.time.Partial.<init>(Partial.java:34)
	at org.joda.time.Partial.<init>(Partial.java:30)
	at org.joda.time.TestPartial_Basics.testWith3f(TestPartial_Basics.java:436)

testConstructor_Type_int(org.joda.time.TestPartial_Constructors)  Time elapsed: 0.001 sec  <<< ERROR!
java.lang.IllegalArgumentException: The field type must not be null
	at org.joda.time.Partial.<init>(Partial.java:34)
	at org.joda.time.Partial.<init>(Partial.java:30)
	at org.joda.time.TestPartial_Constructors.testConstructor_Type_int(TestPartial_Constructors.java:100)

testConstructorEx1_Type_int(org.joda.time.TestPartial_Constructors)  Time elapsed: 0 sec  <<< ERROR!
java.lang.NullPointerException
	at org.joda.time.Partial.getField(Partial.java:92)
	at org.joda.time.base.AbstractPartial.getField(AbstractPartial.java:105)
	at org.joda.time.chrono.BaseChronology.validate(BaseChronology.java:186)
	at org.joda.time.Partial.<init>(Partial.java:37)
	at org.joda.time.Partial.<init>(Partial.java:30)
	at org.joda.time.TestPartial_Constructors.testConstructorEx1_Type_int(TestPartial_Constructors.java:113)

testConstructor_Type_int_Chrono(org.joda.time.TestPartial_Constructors)  Time elapsed: 0.001 sec  <<< ERROR!
java.lang.IllegalArgumentException: The field type must not be null
	at org.joda.time.Partial.<init>(Partial.java:34)
	at org.joda.time.TestPartial_Constructors.testConstructor_Type_int_Chrono(TestPartial_Constructors.java:137)

testConstructorEx_Type_int_Chrono(org.joda.time.TestPartial_Constructors)  Time elapsed: 0.001 sec  <<< ERROR!
java.lang.NullPointerException
	at org.joda.time.Partial.getField(Partial.java:92)
	at org.joda.time.base.AbstractPartial.getField(AbstractPartial.java:105)
	at org.joda.time.chrono.BaseChronology.validate(BaseChronology.java:186)
	at org.joda.time.Partial.<init>(Partial.java:37)
	at org.joda.time.TestPartial_Constructors.testConstructorEx_Type_int_Chrono(TestPartial_Constructors.java:150)

testIsContiguous_RP(org.joda.time.TestDateTimeUtils)  Time elapsed: 0 sec  <<< ERROR!
java.lang.IllegalArgumentException: The field type must not be null
	at org.joda.time.Partial.<init>(Partial.java:34)
	at org.joda.time.Partial.<init>(Partial.java:30)
	at org.joda.time.TestDateTimeUtils.testIsContiguous_RP(TestDateTimeUtils.java:434)

testIsContiguous_RP_GJChronology(org.joda.time.TestDateTimeUtils)  Time elapsed: 0.001 sec  <<< ERROR!
java.lang.IllegalArgumentException: The field type must not be null
	at org.joda.time.Partial.<init>(Partial.java:34)
	at org.joda.time.TestDateTimeUtils.testIsContiguous_RP_GJChronology(TestDateTimeUtils.java:458)


Results :

Tests in error: 
  org.joda.time.TestDateTimeUtils#testIsContiguous_RP IllegalArgumentException T...
  org.joda.time.TestDateTimeUtils#testIsContiguous_RP_GJChronology IllegalArgumentException
  org.joda.time.TestPartial_Basics#testGetFormatter1 IllegalArgumentException Th...
  org.joda.time.TestPartial_Basics#testGetFormatter3 IllegalArgumentException Th...
  org.joda.time.TestPartial_Basics#testToString3 IllegalArgumentException The fi...
  org.joda.time.TestPartial_Basics#testToString4 IllegalArgumentException The fi...
  org.joda.time.TestPartial_Basics#testToString5 IllegalArgumentException The fi...
  org.joda.time.TestPartial_Basics#testWith3d IllegalArgumentException The field...
  org.joda.time.TestPartial_Basics#testWith3e IllegalArgumentException The field...
  org.joda.time.TestPartial_Basics#testWith3f IllegalArgumentException The field...
  org.joda.time.TestPartial_Basics#testWith_argHasNoRange IllegalArgumentException
  org.joda.time.TestPartial_Basics#testWith_baseAndArgHaveNoRange IllegalArgumentException
  org.joda.time.TestPartial_Basics#testWith_baseHasNoRange IllegalArgumentException
  org.joda.time.TestPartial_Basics#testWithout5 IllegalArgumentException The fie...
  org.joda.time.TestPartial_Constructors#testConstructorEx1_Type_int NullPointerException
  org.joda.time.TestPartial_Constructors#testConstructorEx_Type_int_Chrono NullPointerException
  org.joda.time.TestPartial_Constructors#testConstructor_Type_int IllegalArgumentException
  org.joda.time.TestPartial_Constructors#testConstructor_Type_int_Chrono IllegalArgumentException

Tests run: 4157, Failures: 0, Errors: 18, Skipped: 0

[INFO] ------------------------------------------------------------------------
[INFO] BUILD FAILURE
[INFO] ------------------------------------------------------------------------
[INFO] Total time: 15.192s
[INFO] Finished at: Wed Aug 05 18:20:47 BST 2015
[INFO] Final Memory: 9M/214M
[INFO] ------------------------------------------------------------------------
[ERROR] Failed to execute goal org.apache.maven.plugins:maven-surefire-plugin:2.18.1:test (default-test) on project joda-time: There are test failures.
[ERROR] 
[ERROR] Please refer to /home/perham/Study/LittleDarwin/Cases/joda-time-2.8.1/target/surefire-reports for the individual test results.
[ERROR] -> [Help 1]
[ERROR] 
[ERROR] To see the full stack trace of the errors, re-run Maven with the -e switch.
[ERROR] Re-run Maven using the -X switch to enable full debug logging.
[ERROR] 
[ERROR] For more information about the errors and possible solutions, please read the following articles:
[ERROR] [Help 1] http://cwiki.apache.org/confluence/display/MAVEN/MojoFailureException
