[INFO] Scanning for projects...
[INFO]                                                                         
[INFO] ------------------------------------------------------------------------
[INFO] Building Joda-Time 2.8.1
[INFO] ------------------------------------------------------------------------
[INFO] 
[INFO] --- maven-resources-plugin:2.7:resources (default-resources) @ joda-time ---
[INFO] Using 'UTF-8' encoding to copy filtered resources.
[INFO] Copying 2 resources to META-INF
[INFO] Copying 10 resources
[INFO] 
[INFO] --- maven-compiler-plugin:3.3:compile (default-compile) @ joda-time ---
[INFO] Changes detected - recompiling the module!
[INFO] Compiling 166 source files to /home/perham/Study/LittleDarwin/Cases/joda-time-2.8.1/target/classes
[INFO] 
[INFO] --- exec-maven-plugin:1.4.0:java (compile-tzdb) @ joda-time ---
Writing zoneinfo files
Writing ZoneInfoMap
[INFO] 
[INFO] --- maven-resources-plugin:2.7:testResources (default-testResources) @ joda-time ---
[INFO] Using 'UTF-8' encoding to copy filtered resources.
[INFO] Copying 34 resources
[INFO] 
[INFO] --- maven-compiler-plugin:3.3:testCompile (default-testCompile) @ joda-time ---
[INFO] Nothing to compile - all classes are up to date
[INFO] 
[INFO] --- maven-surefire-plugin:2.18.1:test (default-test) @ joda-time ---
[INFO] Surefire report directory: /home/perham/Study/LittleDarwin/Cases/joda-time-2.8.1/target/surefire-reports

-------------------------------------------------------
 T E S T S
-------------------------------------------------------
Running org.joda.time.TestAllPackages

TestBuddhistChronology.testCalendar

TestCopticChronology.testCalendar

TestEthiopicChronology.testCalendar

TestIslamicChronology.testCalendar

Testing Gregorian chronology over 1000 iterations
100% complete (i=1000)

Testing Julian chronology over 1000 iterations
100% complete (i=1000)
Writing zoneinfo files
Writing ZoneInfoMap
Tests run: 4157, Failures: 5, Errors: 153, Skipped: 0, Time elapsed: 5.412 sec <<< FAILURE! - in org.joda.time.TestAllPackages
testCompareTo(org.joda.time.TestLocalDateTime_Basics)  Time elapsed: 0.004 sec  <<< ERROR!
java.lang.IllegalArgumentException: Values array must not be null
	at org.joda.time.Partial.<init>(Partial.java:43)
	at org.joda.time.Partial.<init>(Partial.java:38)
	at org.joda.time.TestLocalDateTime_Basics.testCompareTo(TestLocalDateTime_Basics.java:355)

testEqualsHashCode(org.joda.time.TestLocalDateTime_Basics)  Time elapsed: 0.001 sec  <<< ERROR!
java.lang.IllegalArgumentException: Values array must not be null
	at org.joda.time.Partial.<init>(Partial.java:43)
	at org.joda.time.TestLocalDateTime_Basics.testEqualsHashCode(TestLocalDateTime_Basics.java:303)

testCompareTo(org.joda.time.TestLocalDate_Basics)  Time elapsed: 0.001 sec  <<< ERROR!
java.lang.IllegalArgumentException: Values array must not be null
	at org.joda.time.Partial.<init>(Partial.java:43)
	at org.joda.time.Partial.<init>(Partial.java:38)
	at org.joda.time.TestLocalDate_Basics.testCompareTo(TestLocalDate_Basics.java:348)

testCompareTo(org.joda.time.TestLocalTime_Basics)  Time elapsed: 0.001 sec  <<< ERROR!
java.lang.IllegalArgumentException: Values array must not be null
	at org.joda.time.Partial.<init>(Partial.java:43)
	at org.joda.time.Partial.<init>(Partial.java:38)
	at org.joda.time.TestLocalTime_Basics.testCompareTo(TestLocalTime_Basics.java:338)

testConstructor_RP_RP7(org.joda.time.TestPeriod_Constructors)  Time elapsed: 0 sec  <<< ERROR!
java.lang.IllegalArgumentException: Values array must not be null
	at org.joda.time.Partial.<init>(Partial.java:43)
	at org.joda.time.Partial.with(Partial.java:126)
	at org.joda.time.TestPeriod_Constructors.testConstructor_RP_RP7(TestPeriod_Constructors.java:889)

testConstructor_RP_RP8(org.joda.time.TestPeriod_Constructors)  Time elapsed: 0.001 sec  <<< ERROR!
java.lang.IllegalArgumentException: Values array must not be null
	at org.joda.time.Partial.<init>(Partial.java:43)
	at org.joda.time.Partial.with(Partial.java:126)
	at org.joda.time.TestPeriod_Constructors.testConstructor_RP_RP8(TestPeriod_Constructors.java:898)

testConstructor_RP_RP_PeriodType7(org.joda.time.TestPeriod_Constructors)  Time elapsed: 0 sec  <<< ERROR!
java.lang.IllegalArgumentException: Values array must not be null
	at org.joda.time.Partial.<init>(Partial.java:43)
	at org.joda.time.Partial.with(Partial.java:126)
	at org.joda.time.TestPeriod_Constructors.testConstructor_RP_RP_PeriodType7(TestPeriod_Constructors.java:995)

testFactoryFieldDifference1(org.joda.time.TestPeriod_Constructors)  Time elapsed: 0.001 sec  <<< ERROR!
java.lang.IllegalArgumentException: Values array must not be null
	at org.joda.time.Partial.<init>(Partial.java:43)
	at org.joda.time.Partial.<init>(Partial.java:38)
	at org.joda.time.TestPeriod_Constructors.testFactoryFieldDifference1(TestPeriod_Constructors.java:1497)

testFactoryFieldDifference4(org.joda.time.TestPeriod_Constructors)  Time elapsed: 0 sec  <<< ERROR!
java.lang.IllegalArgumentException: Values array must not be null
	at org.joda.time.Partial.<init>(Partial.java:43)
	at org.joda.time.Partial.<init>(Partial.java:38)
	at org.joda.time.TestPeriod_Constructors.testFactoryFieldDifference4(TestPeriod_Constructors.java:1541)

testFactoryFieldDifference5(org.joda.time.TestPeriod_Constructors)  Time elapsed: 0.001 sec  <<< ERROR!
java.lang.IllegalArgumentException: Values array must not be null
	at org.joda.time.Partial.<init>(Partial.java:43)
	at org.joda.time.Partial.<init>(Partial.java:38)
	at org.joda.time.TestPeriod_Constructors.testFactoryFieldDifference5(TestPeriod_Constructors.java:1554)

testConstructor_RP_RP_PeriodType8(org.joda.time.TestPeriod_Constructors)  Time elapsed: 0.001 sec  <<< ERROR!
java.lang.IllegalArgumentException: Values array must not be null
	at org.joda.time.Partial.<init>(Partial.java:43)
	at org.joda.time.Partial.with(Partial.java:126)
	at org.joda.time.TestPeriod_Constructors.testConstructor_RP_RP_PeriodType8(TestPeriod_Constructors.java:1004)

testFactory_between_RPartial(org.joda.time.TestBaseSingleFieldPeriod)  Time elapsed: 0.001 sec  <<< ERROR!
java.lang.IllegalArgumentException: Values array must not be null
	at org.joda.time.Partial.<init>(Partial.java:43)
	at org.joda.time.Partial.<init>(Partial.java:38)
	at org.joda.time.TestBaseSingleFieldPeriod.testFactory_between_RPartial(TestBaseSingleFieldPeriod.java:125)

testCompareTo(org.joda.time.TestTimeOfDay_Basics)  Time elapsed: 0 sec  <<< ERROR!
java.lang.IllegalArgumentException: Values array must not be null
	at org.joda.time.Partial.<init>(Partial.java:43)
	at org.joda.time.Partial.<init>(Partial.java:38)
	at org.joda.time.TestTimeOfDay_Basics.testCompareTo(TestTimeOfDay_Basics.java:263)

testCompareTo(org.joda.time.TestYearMonthDay_Basics)  Time elapsed: 0 sec  <<< ERROR!
java.lang.IllegalArgumentException: Values array must not be null
	at org.joda.time.Partial.<init>(Partial.java:43)
	at org.joda.time.Partial.<init>(Partial.java:38)
	at org.joda.time.TestYearMonthDay_Basics.testCompareTo(TestYearMonthDay_Basics.java:242)

testCompareTo(org.joda.time.TestYearMonth_Basics)  Time elapsed: 0.001 sec  <<< ERROR!
java.lang.IllegalArgumentException: Values array must not be null
	at org.joda.time.Partial.<init>(Partial.java:43)
	at org.joda.time.Partial.<init>(Partial.java:38)
	at org.joda.time.TestYearMonth_Basics.testCompareTo(TestYearMonth_Basics.java:240)

testCompareTo(org.joda.time.TestMonthDay_Basics)  Time elapsed: 0 sec  <<< ERROR!
java.lang.IllegalArgumentException: Values array must not be null
	at org.joda.time.Partial.<init>(Partial.java:43)
	at org.joda.time.Partial.<init>(Partial.java:38)
	at org.joda.time.TestMonthDay_Basics.testCompareTo(TestMonthDay_Basics.java:245)

testSerialization(org.joda.time.TestPartial_Basics)  Time elapsed: 0 sec  <<< ERROR!
java.lang.IllegalArgumentException: Values array must not be null
	at org.joda.time.Partial.<init>(Partial.java:43)
	at org.joda.time.TestPartial_Basics.createHourMinPartial(TestPartial_Basics.java:911)
	at org.joda.time.TestPartial_Basics.createHourMinPartial(TestPartial_Basics.java:903)
	at org.joda.time.TestPartial_Basics.testSerialization(TestPartial_Basics.java:779)

testToString_String(org.joda.time.TestPartial_Basics)  Time elapsed: 0.001 sec  <<< ERROR!
java.lang.IllegalArgumentException: Values array must not be null
	at org.joda.time.Partial.<init>(Partial.java:43)
	at org.joda.time.TestPartial_Basics.createHourMinPartial(TestPartial_Basics.java:911)
	at org.joda.time.TestPartial_Basics.createHourMinPartial(TestPartial_Basics.java:903)
	at org.joda.time.TestPartial_Basics.createHourMinPartial(TestPartial_Basics.java:899)
	at org.joda.time.TestPartial_Basics.testToString_String(TestPartial_Basics.java:876)

testToString_String_Locale(org.joda.time.TestPartial_Basics)  Time elapsed: 0.001 sec  <<< ERROR!
java.lang.IllegalArgumentException: Values array must not be null
	at org.joda.time.Partial.<init>(Partial.java:43)
	at org.joda.time.TestPartial_Basics.createHourMinPartial(TestPartial_Basics.java:911)
	at org.joda.time.TestPartial_Basics.createHourMinPartial(TestPartial_Basics.java:903)
	at org.joda.time.TestPartial_Basics.createHourMinPartial(TestPartial_Basics.java:899)
	at org.joda.time.TestPartial_Basics.testToString_String_Locale(TestPartial_Basics.java:883)

testToString_DTFormatter(org.joda.time.TestPartial_Basics)  Time elapsed: 0 sec  <<< ERROR!
java.lang.IllegalArgumentException: Values array must not be null
	at org.joda.time.Partial.<init>(Partial.java:43)
	at org.joda.time.TestPartial_Basics.createHourMinPartial(TestPartial_Basics.java:911)
	at org.joda.time.TestPartial_Basics.createHourMinPartial(TestPartial_Basics.java:903)
	at org.joda.time.TestPartial_Basics.createHourMinPartial(TestPartial_Basics.java:899)
	at org.joda.time.TestPartial_Basics.testToString_DTFormatter(TestPartial_Basics.java:892)

testWithField1(org.joda.time.TestPartial_Basics)  Time elapsed: 0.001 sec  <<< ERROR!
java.lang.IllegalArgumentException: Values array must not be null
	at org.joda.time.Partial.<init>(Partial.java:43)
	at org.joda.time.TestPartial_Basics.createHourMinPartial(TestPartial_Basics.java:911)
	at org.joda.time.TestPartial_Basics.createHourMinPartial(TestPartial_Basics.java:903)
	at org.joda.time.TestPartial_Basics.createHourMinPartial(TestPartial_Basics.java:899)
	at org.joda.time.TestPartial_Basics.testWithField1(TestPartial_Basics.java:519)

testWithField2(org.joda.time.TestPartial_Basics)  Time elapsed: 0 sec  <<< ERROR!
java.lang.IllegalArgumentException: Values array must not be null
	at org.joda.time.Partial.<init>(Partial.java:43)
	at org.joda.time.TestPartial_Basics.createHourMinPartial(TestPartial_Basics.java:911)
	at org.joda.time.TestPartial_Basics.createHourMinPartial(TestPartial_Basics.java:903)
	at org.joda.time.TestPartial_Basics.createHourMinPartial(TestPartial_Basics.java:899)
	at org.joda.time.TestPartial_Basics.testWithField2(TestPartial_Basics.java:526)

testWithFieldAdded1(org.joda.time.TestPartial_Basics)  Time elapsed: 0.001 sec  <<< ERROR!
java.lang.IllegalArgumentException: Values array must not be null
	at org.joda.time.Partial.<init>(Partial.java:43)
	at org.joda.time.TestPartial_Basics.createHourMinPartial(TestPartial_Basics.java:911)
	at org.joda.time.TestPartial_Basics.createHourMinPartial(TestPartial_Basics.java:903)
	at org.joda.time.TestPartial_Basics.createHourMinPartial(TestPartial_Basics.java:899)
	at org.joda.time.TestPartial_Basics.testWithFieldAdded1(TestPartial_Basics.java:551)

testWithFieldAdded2(org.joda.time.TestPartial_Basics)  Time elapsed: 0 sec  <<< ERROR!
java.lang.IllegalArgumentException: Values array must not be null
	at org.joda.time.Partial.<init>(Partial.java:43)
	at org.joda.time.TestPartial_Basics.createHourMinPartial(TestPartial_Basics.java:911)
	at org.joda.time.TestPartial_Basics.createHourMinPartial(TestPartial_Basics.java:903)
	at org.joda.time.TestPartial_Basics.createHourMinPartial(TestPartial_Basics.java:899)
	at org.joda.time.TestPartial_Basics.testWithFieldAdded2(TestPartial_Basics.java:560)

testWithFieldAdded3(org.joda.time.TestPartial_Basics)  Time elapsed: 0 sec  <<< ERROR!
java.lang.IllegalArgumentException: Values array must not be null
	at org.joda.time.Partial.<init>(Partial.java:43)
	at org.joda.time.TestPartial_Basics.createHourMinPartial(TestPartial_Basics.java:911)
	at org.joda.time.TestPartial_Basics.createHourMinPartial(TestPartial_Basics.java:903)
	at org.joda.time.TestPartial_Basics.createHourMinPartial(TestPartial_Basics.java:899)
	at org.joda.time.TestPartial_Basics.testWithFieldAdded3(TestPartial_Basics.java:569)

testWithFieldAdded4(org.joda.time.TestPartial_Basics)  Time elapsed: 0.001 sec  <<< ERROR!
java.lang.IllegalArgumentException: Values array must not be null
	at org.joda.time.Partial.<init>(Partial.java:43)
	at org.joda.time.TestPartial_Basics.createHourMinPartial(TestPartial_Basics.java:911)
	at org.joda.time.TestPartial_Basics.createHourMinPartial(TestPartial_Basics.java:903)
	at org.joda.time.TestPartial_Basics.createHourMinPartial(TestPartial_Basics.java:899)
	at org.joda.time.TestPartial_Basics.testWithFieldAdded4(TestPartial_Basics.java:578)

testPlus_RP(org.joda.time.TestPartial_Basics)  Time elapsed: 0 sec  <<< ERROR!
java.lang.IllegalArgumentException: Values array must not be null
	at org.joda.time.Partial.<init>(Partial.java:43)
	at org.joda.time.TestPartial_Basics.createHourMinPartial(TestPartial_Basics.java:911)
	at org.joda.time.TestPartial_Basics.createHourMinPartial(TestPartial_Basics.java:903)
	at org.joda.time.TestPartial_Basics.testPlus_RP(TestPartial_Basics.java:721)

testMinus_RP(org.joda.time.TestPartial_Basics)  Time elapsed: 0.001 sec  <<< ERROR!
java.lang.IllegalArgumentException: Values array must not be null
	at org.joda.time.Partial.<init>(Partial.java:43)
	at org.joda.time.TestPartial_Basics.createHourMinPartial(TestPartial_Basics.java:911)
	at org.joda.time.TestPartial_Basics.createHourMinPartial(TestPartial_Basics.java:903)
	at org.joda.time.TestPartial_Basics.testMinus_RP(TestPartial_Basics.java:732)

testProperty(org.joda.time.TestPartial_Basics)  Time elapsed: 0 sec  <<< ERROR!
java.lang.IllegalArgumentException: Values array must not be null
	at org.joda.time.Partial.<init>(Partial.java:43)
	at org.joda.time.TestPartial_Basics.createHourMinPartial(TestPartial_Basics.java:911)
	at org.joda.time.TestPartial_Basics.createHourMinPartial(TestPartial_Basics.java:903)
	at org.joda.time.TestPartial_Basics.createHourMinPartial(TestPartial_Basics.java:899)
	at org.joda.time.TestPartial_Basics.testProperty(TestPartial_Basics.java:764)

testCompareTo(org.joda.time.TestPartial_Basics)  Time elapsed: 0.001 sec  <<< ERROR!
java.lang.IllegalArgumentException: Values array must not be null
	at org.joda.time.Partial.<init>(Partial.java:43)
	at org.joda.time.TestPartial_Basics.createHourMinPartial(TestPartial_Basics.java:911)
	at org.joda.time.TestPartial_Basics.createHourMinPartial(TestPartial_Basics.java:903)
	at org.joda.time.TestPartial_Basics.createHourMinPartial(TestPartial_Basics.java:899)
	at org.joda.time.TestPartial_Basics.testCompareTo(TestPartial_Basics.java:210)

testEqualsHashCode(org.joda.time.TestPartial_Basics)  Time elapsed: 0.001 sec  <<< ERROR!
java.lang.IllegalArgumentException: Values array must not be null
	at org.joda.time.Partial.<init>(Partial.java:43)
	at org.joda.time.TestPartial_Basics.createHourMinPartial(TestPartial_Basics.java:911)
	at org.joda.time.TestPartial_Basics.createHourMinPartial(TestPartial_Basics.java:903)
	at org.joda.time.TestPartial_Basics.testEqualsHashCode(TestPartial_Basics.java:184)

testSize(org.joda.time.TestPartial_Basics)  Time elapsed: 0 sec  <<< ERROR!
java.lang.IllegalArgumentException: Values array must not be null
	at org.joda.time.Partial.<init>(Partial.java:43)
	at org.joda.time.TestPartial_Basics.createHourMinPartial(TestPartial_Basics.java:911)
	at org.joda.time.TestPartial_Basics.createHourMinPartial(TestPartial_Basics.java:903)
	at org.joda.time.TestPartial_Basics.createHourMinPartial(TestPartial_Basics.java:899)
	at org.joda.time.TestPartial_Basics.testSize(TestPartial_Basics.java:106)

testGetField(org.joda.time.TestPartial_Basics)  Time elapsed: 0.001 sec  <<< ERROR!
java.lang.IllegalArgumentException: Values array must not be null
	at org.joda.time.Partial.<init>(Partial.java:43)
	at org.joda.time.TestPartial_Basics.createHourMinPartial(TestPartial_Basics.java:911)
	at org.joda.time.TestPartial_Basics.createHourMinPartial(TestPartial_Basics.java:903)
	at org.joda.time.TestPartial_Basics.testGetField(TestPartial_Basics.java:132)

testGetValue(org.joda.time.TestPartial_Basics)  Time elapsed: 0 sec  <<< ERROR!
java.lang.IllegalArgumentException: Values array must not be null
	at org.joda.time.Partial.<init>(Partial.java:43)
	at org.joda.time.TestPartial_Basics.createHourMinPartial(TestPartial_Basics.java:911)
	at org.joda.time.TestPartial_Basics.createHourMinPartial(TestPartial_Basics.java:903)
	at org.joda.time.TestPartial_Basics.testGetValue(TestPartial_Basics.java:153)

testIsEqual_TOD(org.joda.time.TestPartial_Basics)  Time elapsed: 0.001 sec  <<< ERROR!
java.lang.IllegalArgumentException: Values array must not be null
	at org.joda.time.Partial.<init>(Partial.java:43)
	at org.joda.time.TestPartial_Basics.createHourMinPartial(TestPartial_Basics.java:911)
	at org.joda.time.TestPartial_Basics.createHourMinPartial(TestPartial_Basics.java:903)
	at org.joda.time.TestPartial_Basics.createHourMinPartial(TestPartial_Basics.java:899)
	at org.joda.time.TestPartial_Basics.testIsEqual_TOD(TestPartial_Basics.java:248)

testIsBefore_TOD(org.joda.time.TestPartial_Basics)  Time elapsed: 0 sec  <<< ERROR!
java.lang.IllegalArgumentException: Values array must not be null
	at org.joda.time.Partial.<init>(Partial.java:43)
	at org.joda.time.TestPartial_Basics.createHourMinPartial(TestPartial_Basics.java:911)
	at org.joda.time.TestPartial_Basics.createHourMinPartial(TestPartial_Basics.java:903)
	at org.joda.time.TestPartial_Basics.createHourMinPartial(TestPartial_Basics.java:899)
	at org.joda.time.TestPartial_Basics.testIsBefore_TOD(TestPartial_Basics.java:272)

testIsAfter_TOD(org.joda.time.TestPartial_Basics)  Time elapsed: 0 sec  <<< ERROR!
java.lang.IllegalArgumentException: Values array must not be null
	at org.joda.time.Partial.<init>(Partial.java:43)
	at org.joda.time.TestPartial_Basics.createHourMinPartial(TestPartial_Basics.java:911)
	at org.joda.time.TestPartial_Basics.createHourMinPartial(TestPartial_Basics.java:903)
	at org.joda.time.TestPartial_Basics.createHourMinPartial(TestPartial_Basics.java:899)
	at org.joda.time.TestPartial_Basics.testIsAfter_TOD(TestPartial_Basics.java:296)

testWithChronologyRetainFields_Chrono(org.joda.time.TestPartial_Basics)  Time elapsed: 0.001 sec  <<< ERROR!
java.lang.IllegalArgumentException: Values array must not be null
	at org.joda.time.Partial.<init>(Partial.java:43)
	at org.joda.time.TestPartial_Basics.createHourMinPartial(TestPartial_Basics.java:911)
	at org.joda.time.TestPartial_Basics.createHourMinPartial(TestPartial_Basics.java:903)
	at org.joda.time.TestPartial_Basics.testWithChronologyRetainFields_Chrono(TestPartial_Basics.java:320)

testWithChronologyRetainFields_sameChrono(org.joda.time.TestPartial_Basics)  Time elapsed: 0 sec  <<< ERROR!
java.lang.IllegalArgumentException: Values array must not be null
	at org.joda.time.Partial.<init>(Partial.java:43)
	at org.joda.time.TestPartial_Basics.createHourMinPartial(TestPartial_Basics.java:911)
	at org.joda.time.TestPartial_Basics.createHourMinPartial(TestPartial_Basics.java:903)
	at org.joda.time.TestPartial_Basics.testWithChronologyRetainFields_sameChrono(TestPartial_Basics.java:329)

testWithChronologyRetainFields_nullChrono(org.joda.time.TestPartial_Basics)  Time elapsed: 0.001 sec  <<< ERROR!
java.lang.IllegalArgumentException: Values array must not be null
	at org.joda.time.Partial.<init>(Partial.java:43)
	at org.joda.time.TestPartial_Basics.createHourMinPartial(TestPartial_Basics.java:911)
	at org.joda.time.TestPartial_Basics.createHourMinPartial(TestPartial_Basics.java:903)
	at org.joda.time.TestPartial_Basics.testWithChronologyRetainFields_nullChrono(TestPartial_Basics.java:335)

testWithFieldAdded5(org.joda.time.TestPartial_Basics)  Time elapsed: 0 sec  <<< ERROR!
java.lang.IllegalArgumentException: Values array must not be null
	at org.joda.time.Partial.<init>(Partial.java:43)
	at org.joda.time.TestPartial_Basics.createHourMinPartial(TestPartial_Basics.java:911)
	at org.joda.time.TestPartial_Basics.createHourMinPartial(TestPartial_Basics.java:903)
	at org.joda.time.TestPartial_Basics.createHourMinPartial(TestPartial_Basics.java:899)
	at org.joda.time.TestPartial_Basics.testWithFieldAdded5(TestPartial_Basics.java:584)

testWithFieldAdded6(org.joda.time.TestPartial_Basics)  Time elapsed: 0.001 sec  <<< ERROR!
java.lang.IllegalArgumentException: Values array must not be null
	at org.joda.time.Partial.<init>(Partial.java:43)
	at org.joda.time.TestPartial_Basics.createHourMinPartial(TestPartial_Basics.java:911)
	at org.joda.time.TestPartial_Basics.createHourMinPartial(TestPartial_Basics.java:903)
	at org.joda.time.TestPartial_Basics.createHourMinPartial(TestPartial_Basics.java:899)
	at org.joda.time.TestPartial_Basics.testWithFieldAdded6(TestPartial_Basics.java:593)

testWithFieldAdded7(org.joda.time.TestPartial_Basics)  Time elapsed: 0 sec  <<< ERROR!
java.lang.IllegalArgumentException: Values array must not be null
	at org.joda.time.Partial.<init>(Partial.java:43)
	at org.joda.time.TestPartial_Basics.createHourMinPartial(TestPartial_Basics.java:911)
	at org.joda.time.TestPartial_Basics.testWithFieldAdded7(TestPartial_Basics.java:604)

testWithFieldAdded8(org.joda.time.TestPartial_Basics)  Time elapsed: 0.001 sec  <<< ERROR!
java.lang.IllegalArgumentException: Values array must not be null
	at org.joda.time.Partial.<init>(Partial.java:43)
	at org.joda.time.TestPartial_Basics.createHourMinPartial(TestPartial_Basics.java:911)
	at org.joda.time.TestPartial_Basics.testWithFieldAdded8(TestPartial_Basics.java:624)

testWithField3(org.joda.time.TestPartial_Basics)  Time elapsed: 0.001 sec  <<< ERROR!
java.lang.IllegalArgumentException: Values array must not be null
	at org.joda.time.Partial.<init>(Partial.java:43)
	at org.joda.time.TestPartial_Basics.createHourMinPartial(TestPartial_Basics.java:911)
	at org.joda.time.TestPartial_Basics.createHourMinPartial(TestPartial_Basics.java:903)
	at org.joda.time.TestPartial_Basics.createHourMinPartial(TestPartial_Basics.java:899)
	at org.joda.time.TestPartial_Basics.testWithField3(TestPartial_Basics.java:535)

testWithField4(org.joda.time.TestPartial_Basics)  Time elapsed: 0 sec  <<< ERROR!
java.lang.IllegalArgumentException: Values array must not be null
	at org.joda.time.Partial.<init>(Partial.java:43)
	at org.joda.time.TestPartial_Basics.createHourMinPartial(TestPartial_Basics.java:911)
	at org.joda.time.TestPartial_Basics.createHourMinPartial(TestPartial_Basics.java:903)
	at org.joda.time.TestPartial_Basics.createHourMinPartial(TestPartial_Basics.java:899)
	at org.joda.time.TestPartial_Basics.testWithField4(TestPartial_Basics.java:544)

testGetFieldType(org.joda.time.TestPartial_Basics)  Time elapsed: 0.001 sec  <<< ERROR!
java.lang.IllegalArgumentException: Values array must not be null
	at org.joda.time.Partial.<init>(Partial.java:43)
	at org.joda.time.TestPartial_Basics.createHourMinPartial(TestPartial_Basics.java:911)
	at org.joda.time.TestPartial_Basics.createHourMinPartial(TestPartial_Basics.java:903)
	at org.joda.time.TestPartial_Basics.createHourMinPartial(TestPartial_Basics.java:899)
	at org.joda.time.TestPartial_Basics.testGetFieldType(TestPartial_Basics.java:111)

testGetFieldTypes(org.joda.time.TestPartial_Basics)  Time elapsed: 0 sec  <<< ERROR!
java.lang.IllegalArgumentException: Values array must not be null
	at org.joda.time.Partial.<init>(Partial.java:43)
	at org.joda.time.TestPartial_Basics.createHourMinPartial(TestPartial_Basics.java:911)
	at org.joda.time.TestPartial_Basics.createHourMinPartial(TestPartial_Basics.java:903)
	at org.joda.time.TestPartial_Basics.createHourMinPartial(TestPartial_Basics.java:899)
	at org.joda.time.TestPartial_Basics.testGetFieldTypes(TestPartial_Basics.java:123)

testGetFields(org.joda.time.TestPartial_Basics)  Time elapsed: 0.001 sec  <<< ERROR!
java.lang.IllegalArgumentException: Values array must not be null
	at org.joda.time.Partial.<init>(Partial.java:43)
	at org.joda.time.TestPartial_Basics.createHourMinPartial(TestPartial_Basics.java:911)
	at org.joda.time.TestPartial_Basics.createHourMinPartial(TestPartial_Basics.java:903)
	at org.joda.time.TestPartial_Basics.testGetFields(TestPartial_Basics.java:144)

testGetValues(org.joda.time.TestPartial_Basics)  Time elapsed: 0.001 sec  <<< ERROR!
java.lang.IllegalArgumentException: Values array must not be null
	at org.joda.time.Partial.<init>(Partial.java:43)
	at org.joda.time.TestPartial_Basics.createHourMinPartial(TestPartial_Basics.java:911)
	at org.joda.time.TestPartial_Basics.createHourMinPartial(TestPartial_Basics.java:903)
	at org.joda.time.TestPartial_Basics.testGetValues(TestPartial_Basics.java:165)

testToDateTime_RI(org.joda.time.TestPartial_Basics)  Time elapsed: 0 sec  <<< ERROR!
java.lang.IllegalArgumentException: Values array must not be null
	at org.joda.time.Partial.<init>(Partial.java:43)
	at org.joda.time.TestPartial_Basics.createHourMinPartial(TestPartial_Basics.java:911)
	at org.joda.time.TestPartial_Basics.createHourMinPartial(TestPartial_Basics.java:903)
	at org.joda.time.TestPartial_Basics.testToDateTime_RI(TestPartial_Basics.java:743)

testToDateTime_nullRI(org.joda.time.TestPartial_Basics)  Time elapsed: 0.004 sec  <<< ERROR!
java.lang.IllegalArgumentException: Values array must not be null
	at org.joda.time.Partial.<init>(Partial.java:43)
	at org.joda.time.TestPartial_Basics.createHourMinPartial(TestPartial_Basics.java:911)
	at org.joda.time.TestPartial_Basics.testToDateTime_nullRI(TestPartial_Basics.java:754)

testGet(org.joda.time.TestPartial_Basics)  Time elapsed: 0 sec  <<< ERROR!
java.lang.IllegalArgumentException: Values array must not be null
	at org.joda.time.Partial.<init>(Partial.java:43)
	at org.joda.time.TestPartial_Basics.createHourMinPartial(TestPartial_Basics.java:911)
	at org.joda.time.TestPartial_Basics.createHourMinPartial(TestPartial_Basics.java:903)
	at org.joda.time.TestPartial_Basics.createHourMinPartial(TestPartial_Basics.java:899)
	at org.joda.time.TestPartial_Basics.testGet(TestPartial_Basics.java:92)

testIsSupported(org.joda.time.TestPartial_Basics)  Time elapsed: 0 sec  <<< ERROR!
java.lang.IllegalArgumentException: Values array must not be null
	at org.joda.time.Partial.<init>(Partial.java:43)
	at org.joda.time.TestPartial_Basics.createHourMinPartial(TestPartial_Basics.java:911)
	at org.joda.time.TestPartial_Basics.createHourMinPartial(TestPartial_Basics.java:903)
	at org.joda.time.TestPartial_Basics.testIsSupported(TestPartial_Basics.java:174)

testWith1(org.joda.time.TestPartial_Basics)  Time elapsed: 0 sec  <<< ERROR!
java.lang.IllegalArgumentException: Values array must not be null
	at org.joda.time.Partial.<init>(Partial.java:43)
	at org.joda.time.TestPartial_Basics.createHourMinPartial(TestPartial_Basics.java:911)
	at org.joda.time.TestPartial_Basics.createHourMinPartial(TestPartial_Basics.java:903)
	at org.joda.time.TestPartial_Basics.createHourMinPartial(TestPartial_Basics.java:899)
	at org.joda.time.TestPartial_Basics.testWith1(TestPartial_Basics.java:345)

testWith2(org.joda.time.TestPartial_Basics)  Time elapsed: 0 sec  <<< ERROR!
java.lang.IllegalArgumentException: Values array must not be null
	at org.joda.time.Partial.<init>(Partial.java:43)
	at org.joda.time.TestPartial_Basics.createHourMinPartial(TestPartial_Basics.java:911)
	at org.joda.time.TestPartial_Basics.createHourMinPartial(TestPartial_Basics.java:903)
	at org.joda.time.TestPartial_Basics.createHourMinPartial(TestPartial_Basics.java:899)
	at org.joda.time.TestPartial_Basics.testWith2(TestPartial_Basics.java:352)

testWith3(org.joda.time.TestPartial_Basics)  Time elapsed: 0 sec  <<< ERROR!
java.lang.IllegalArgumentException: Values array must not be null
	at org.joda.time.Partial.<init>(Partial.java:43)
	at org.joda.time.TestPartial_Basics.createHourMinPartial(TestPartial_Basics.java:911)
	at org.joda.time.TestPartial_Basics.createHourMinPartial(TestPartial_Basics.java:903)
	at org.joda.time.TestPartial_Basics.createHourMinPartial(TestPartial_Basics.java:899)
	at org.joda.time.TestPartial_Basics.testWith3(TestPartial_Basics.java:361)

testWith3a(org.joda.time.TestPartial_Basics)  Time elapsed: 0 sec  <<< ERROR!
java.lang.IllegalArgumentException: Values array must not be null
	at org.joda.time.Partial.<init>(Partial.java:43)
	at org.joda.time.TestPartial_Basics.createHourMinPartial(TestPartial_Basics.java:911)
	at org.joda.time.TestPartial_Basics.createHourMinPartial(TestPartial_Basics.java:903)
	at org.joda.time.TestPartial_Basics.createHourMinPartial(TestPartial_Basics.java:899)
	at org.joda.time.TestPartial_Basics.testWith3a(TestPartial_Basics.java:370)

testWith3b(org.joda.time.TestPartial_Basics)  Time elapsed: 0.001 sec  <<< ERROR!
java.lang.IllegalArgumentException: Values array must not be null
	at org.joda.time.Partial.<init>(Partial.java:43)
	at org.joda.time.TestPartial_Basics.createHourMinPartial(TestPartial_Basics.java:911)
	at org.joda.time.TestPartial_Basics.createHourMinPartial(TestPartial_Basics.java:903)
	at org.joda.time.TestPartial_Basics.createHourMinPartial(TestPartial_Basics.java:899)
	at org.joda.time.TestPartial_Basics.testWith3b(TestPartial_Basics.java:386)

testWith3c(org.joda.time.TestPartial_Basics)  Time elapsed: 0.001 sec  <<< ERROR!
java.lang.IllegalArgumentException: Values array must not be null
	at org.joda.time.Partial.<init>(Partial.java:43)
	at org.joda.time.TestPartial_Basics.createHourMinPartial(TestPartial_Basics.java:911)
	at org.joda.time.TestPartial_Basics.createHourMinPartial(TestPartial_Basics.java:903)
	at org.joda.time.TestPartial_Basics.createHourMinPartial(TestPartial_Basics.java:899)
	at org.joda.time.TestPartial_Basics.testWith3c(TestPartial_Basics.java:402)

testWith3d(org.joda.time.TestPartial_Basics)  Time elapsed: 0 sec  <<< ERROR!
java.lang.IllegalArgumentException: Values array must not be null
	at org.joda.time.Partial.<init>(Partial.java:43)
	at org.joda.time.Partial.with(Partial.java:126)
	at org.joda.time.TestPartial_Basics.testWith3d(TestPartial_Basics.java:419)

testWith3e(org.joda.time.TestPartial_Basics)  Time elapsed: 0.001 sec  <<< ERROR!
java.lang.IllegalArgumentException: Values array must not be null
	at org.joda.time.Partial.<init>(Partial.java:43)
	at org.joda.time.Partial.with(Partial.java:126)
	at org.joda.time.TestPartial_Basics.testWith3e(TestPartial_Basics.java:427)

testWith3f(org.joda.time.TestPartial_Basics)  Time elapsed: 0.001 sec  <<< ERROR!
java.lang.IllegalArgumentException: Values array must not be null
	at org.joda.time.Partial.<init>(Partial.java:43)
	at org.joda.time.Partial.with(Partial.java:126)
	at org.joda.time.TestPartial_Basics.testWith3f(TestPartial_Basics.java:437)

testWith4(org.joda.time.TestPartial_Basics)  Time elapsed: 0 sec  <<< ERROR!
java.lang.IllegalArgumentException: Values array must not be null
	at org.joda.time.Partial.<init>(Partial.java:43)
	at org.joda.time.TestPartial_Basics.createHourMinPartial(TestPartial_Basics.java:911)
	at org.joda.time.TestPartial_Basics.createHourMinPartial(TestPartial_Basics.java:903)
	at org.joda.time.TestPartial_Basics.createHourMinPartial(TestPartial_Basics.java:899)
	at org.joda.time.TestPartial_Basics.testWith4(TestPartial_Basics.java:446)

testWith_baseHasNoRange(org.joda.time.TestPartial_Basics)  Time elapsed: 0 sec  <<< ERROR!
java.lang.IllegalArgumentException: Values array must not be null
	at org.joda.time.Partial.<init>(Partial.java:43)
	at org.joda.time.Partial.with(Partial.java:126)
	at org.joda.time.TestPartial_Basics.testWith_baseHasNoRange(TestPartial_Basics.java:453)

testWith_argHasNoRange(org.joda.time.TestPartial_Basics)  Time elapsed: 0.001 sec  <<< ERROR!
java.lang.IllegalArgumentException: Values array must not be null
	at org.joda.time.Partial.<init>(Partial.java:43)
	at org.joda.time.Partial.with(Partial.java:126)
	at org.joda.time.TestPartial_Basics.testWith_argHasNoRange(TestPartial_Basics.java:461)

testWith_baseAndArgHaveNoRange(org.joda.time.TestPartial_Basics)  Time elapsed: 0.001 sec  <<< ERROR!
java.lang.IllegalArgumentException: Values array must not be null
	at org.joda.time.Partial.<init>(Partial.java:43)
	at org.joda.time.Partial.with(Partial.java:126)
	at org.joda.time.TestPartial_Basics.testWith_baseAndArgHaveNoRange(TestPartial_Basics.java:469)

testWithout1(org.joda.time.TestPartial_Basics)  Time elapsed: 0 sec  <<< ERROR!
java.lang.IllegalArgumentException: Values array must not be null
	at org.joda.time.Partial.<init>(Partial.java:43)
	at org.joda.time.TestPartial_Basics.createHourMinPartial(TestPartial_Basics.java:911)
	at org.joda.time.TestPartial_Basics.createHourMinPartial(TestPartial_Basics.java:903)
	at org.joda.time.TestPartial_Basics.createHourMinPartial(TestPartial_Basics.java:899)
	at org.joda.time.TestPartial_Basics.testWithout1(TestPartial_Basics.java:477)

testWithout2(org.joda.time.TestPartial_Basics)  Time elapsed: 0.001 sec  <<< ERROR!
java.lang.IllegalArgumentException: Values array must not be null
	at org.joda.time.Partial.<init>(Partial.java:43)
	at org.joda.time.TestPartial_Basics.createHourMinPartial(TestPartial_Basics.java:911)
	at org.joda.time.TestPartial_Basics.createHourMinPartial(TestPartial_Basics.java:903)
	at org.joda.time.TestPartial_Basics.createHourMinPartial(TestPartial_Basics.java:899)
	at org.joda.time.TestPartial_Basics.testWithout2(TestPartial_Basics.java:484)

testWithout3(org.joda.time.TestPartial_Basics)  Time elapsed: 0 sec  <<< ERROR!
java.lang.IllegalArgumentException: Values array must not be null
	at org.joda.time.Partial.<init>(Partial.java:43)
	at org.joda.time.TestPartial_Basics.createHourMinPartial(TestPartial_Basics.java:911)
	at org.joda.time.TestPartial_Basics.createHourMinPartial(TestPartial_Basics.java:903)
	at org.joda.time.TestPartial_Basics.createHourMinPartial(TestPartial_Basics.java:899)
	at org.joda.time.TestPartial_Basics.testWithout3(TestPartial_Basics.java:491)

testWithout4(org.joda.time.TestPartial_Basics)  Time elapsed: 0.001 sec  <<< ERROR!
java.lang.IllegalArgumentException: Values array must not be null
	at org.joda.time.Partial.<init>(Partial.java:43)
	at org.joda.time.TestPartial_Basics.createHourMinPartial(TestPartial_Basics.java:911)
	at org.joda.time.TestPartial_Basics.createHourMinPartial(TestPartial_Basics.java:903)
	at org.joda.time.TestPartial_Basics.createHourMinPartial(TestPartial_Basics.java:899)
	at org.joda.time.TestPartial_Basics.testWithout4(TestPartial_Basics.java:501)

testWithFieldAddWrapped1(org.joda.time.TestPartial_Basics)  Time elapsed: 0.001 sec  <<< ERROR!
java.lang.IllegalArgumentException: Values array must not be null
	at org.joda.time.Partial.<init>(Partial.java:43)
	at org.joda.time.TestPartial_Basics.createHourMinPartial(TestPartial_Basics.java:911)
	at org.joda.time.TestPartial_Basics.createHourMinPartial(TestPartial_Basics.java:903)
	at org.joda.time.TestPartial_Basics.createHourMinPartial(TestPartial_Basics.java:899)
	at org.joda.time.TestPartial_Basics.testWithFieldAddWrapped1(TestPartial_Basics.java:645)

testWithFieldAddWrapped2(org.joda.time.TestPartial_Basics)  Time elapsed: 0 sec  <<< ERROR!
java.lang.IllegalArgumentException: Values array must not be null
	at org.joda.time.Partial.<init>(Partial.java:43)
	at org.joda.time.TestPartial_Basics.createHourMinPartial(TestPartial_Basics.java:911)
	at org.joda.time.TestPartial_Basics.createHourMinPartial(TestPartial_Basics.java:903)
	at org.joda.time.TestPartial_Basics.createHourMinPartial(TestPartial_Basics.java:899)
	at org.joda.time.TestPartial_Basics.testWithFieldAddWrapped2(TestPartial_Basics.java:654)

testWithFieldAddWrapped3(org.joda.time.TestPartial_Basics)  Time elapsed: 0.001 sec  <<< ERROR!
java.lang.IllegalArgumentException: Values array must not be null
	at org.joda.time.Partial.<init>(Partial.java:43)
	at org.joda.time.TestPartial_Basics.createHourMinPartial(TestPartial_Basics.java:911)
	at org.joda.time.TestPartial_Basics.createHourMinPartial(TestPartial_Basics.java:903)
	at org.joda.time.TestPartial_Basics.createHourMinPartial(TestPartial_Basics.java:899)
	at org.joda.time.TestPartial_Basics.testWithFieldAddWrapped3(TestPartial_Basics.java:663)

testWithFieldAddWrapped4(org.joda.time.TestPartial_Basics)  Time elapsed: 0 sec  <<< ERROR!
java.lang.IllegalArgumentException: Values array must not be null
	at org.joda.time.Partial.<init>(Partial.java:43)
	at org.joda.time.TestPartial_Basics.createHourMinPartial(TestPartial_Basics.java:911)
	at org.joda.time.TestPartial_Basics.createHourMinPartial(TestPartial_Basics.java:903)
	at org.joda.time.TestPartial_Basics.createHourMinPartial(TestPartial_Basics.java:899)
	at org.joda.time.TestPartial_Basics.testWithFieldAddWrapped4(TestPartial_Basics.java:672)

testWithFieldAddWrapped5(org.joda.time.TestPartial_Basics)  Time elapsed: 0.001 sec  <<< ERROR!
java.lang.IllegalArgumentException: Values array must not be null
	at org.joda.time.Partial.<init>(Partial.java:43)
	at org.joda.time.TestPartial_Basics.createHourMinPartial(TestPartial_Basics.java:911)
	at org.joda.time.TestPartial_Basics.createHourMinPartial(TestPartial_Basics.java:903)
	at org.joda.time.TestPartial_Basics.createHourMinPartial(TestPartial_Basics.java:899)
	at org.joda.time.TestPartial_Basics.testWithFieldAddWrapped5(TestPartial_Basics.java:678)

testWithFieldAddWrapped6(org.joda.time.TestPartial_Basics)  Time elapsed: 0 sec  <<< ERROR!
java.lang.IllegalArgumentException: Values array must not be null
	at org.joda.time.Partial.<init>(Partial.java:43)
	at org.joda.time.TestPartial_Basics.createHourMinPartial(TestPartial_Basics.java:911)
	at org.joda.time.TestPartial_Basics.createHourMinPartial(TestPartial_Basics.java:903)
	at org.joda.time.TestPartial_Basics.createHourMinPartial(TestPartial_Basics.java:899)
	at org.joda.time.TestPartial_Basics.testWithFieldAddWrapped6(TestPartial_Basics.java:687)

testWithFieldAddWrapped7(org.joda.time.TestPartial_Basics)  Time elapsed: 0.001 sec  <<< ERROR!
java.lang.IllegalArgumentException: Values array must not be null
	at org.joda.time.Partial.<init>(Partial.java:43)
	at org.joda.time.TestPartial_Basics.createHourMinPartial(TestPartial_Basics.java:911)
	at org.joda.time.TestPartial_Basics.testWithFieldAddWrapped7(TestPartial_Basics.java:696)

testWithFieldAddWrapped8(org.joda.time.TestPartial_Basics)  Time elapsed: 0.004 sec  <<< ERROR!
java.lang.IllegalArgumentException: Values array must not be null
	at org.joda.time.Partial.<init>(Partial.java:43)
	at org.joda.time.TestPartial_Basics.createHourMinPartial(TestPartial_Basics.java:911)
	at org.joda.time.TestPartial_Basics.testWithFieldAddWrapped8(TestPartial_Basics.java:708)

testGetFormatter1(org.joda.time.TestPartial_Basics)  Time elapsed: 0 sec  <<< ERROR!
java.lang.IllegalArgumentException: Values array must not be null
	at org.joda.time.Partial.<init>(Partial.java:43)
	at org.joda.time.Partial.with(Partial.java:126)
	at org.joda.time.TestPartial_Basics.testGetFormatter1(TestPartial_Basics.java:803)

testGetFormatter2(org.joda.time.TestPartial_Basics)  Time elapsed: 0 sec  <<< ERROR!
java.lang.IllegalArgumentException: Values array must not be null
	at org.joda.time.Partial.<init>(Partial.java:43)
	at org.joda.time.Partial.with(Partial.java:126)
	at org.joda.time.TestPartial_Basics.testGetFormatter2(TestPartial_Basics.java:817)

testGetFormatter3(org.joda.time.TestPartial_Basics)  Time elapsed: 0 sec  <<< ERROR!
java.lang.IllegalArgumentException: Values array must not be null
	at org.joda.time.Partial.<init>(Partial.java:43)
	at org.joda.time.Partial.with(Partial.java:126)
	at org.joda.time.TestPartial_Basics.testGetFormatter3(TestPartial_Basics.java:829)

testToString1(org.joda.time.TestPartial_Basics)  Time elapsed: 0 sec  <<< ERROR!
java.lang.IllegalArgumentException: Values array must not be null
	at org.joda.time.Partial.<init>(Partial.java:43)
	at org.joda.time.TestPartial_Basics.createHourMinPartial(TestPartial_Basics.java:911)
	at org.joda.time.TestPartial_Basics.createHourMinPartial(TestPartial_Basics.java:903)
	at org.joda.time.TestPartial_Basics.createHourMinPartial(TestPartial_Basics.java:899)
	at org.joda.time.TestPartial_Basics.testToString1(TestPartial_Basics.java:835)

testToString3(org.joda.time.TestPartial_Basics)  Time elapsed: 0 sec  <<< ERROR!
java.lang.IllegalArgumentException: Values array must not be null
	at org.joda.time.Partial.<init>(Partial.java:43)
	at org.joda.time.Partial.with(Partial.java:126)
	at org.joda.time.TestPartial_Basics.testToString3(TestPartial_Basics.java:848)

testToString4(org.joda.time.TestPartial_Basics)  Time elapsed: 0.002 sec  <<< ERROR!
java.lang.IllegalArgumentException: Values array must not be null
	at org.joda.time.Partial.<init>(Partial.java:43)
	at org.joda.time.Partial.with(Partial.java:126)
	at org.joda.time.TestPartial_Basics.testToString4(TestPartial_Basics.java:862)

testToString5(org.joda.time.TestPartial_Basics)  Time elapsed: 0 sec  <<< ERROR!
java.lang.IllegalArgumentException: Values array must not be null
	at org.joda.time.Partial.<init>(Partial.java:43)
	at org.joda.time.Partial.with(Partial.java:126)
	at org.joda.time.TestPartial_Basics.testToString5(TestPartial_Basics.java:870)

testConstructor_TypeArray_intArray(org.joda.time.TestPartial_Constructors)  Time elapsed: 0.001 sec  <<< ERROR!
java.lang.IllegalArgumentException: Values array must not be null
	at org.joda.time.Partial.<init>(Partial.java:43)
	at org.joda.time.Partial.<init>(Partial.java:38)
	at org.joda.time.TestPartial_Constructors.testConstructor_TypeArray_intArray(TestPartial_Constructors.java:179)

testConstructor_TypeArray_intArray_year_weekyear(org.joda.time.TestPartial_Constructors)  Time elapsed: 0 sec  <<< ERROR!
java.lang.IllegalArgumentException: Values array must not be null
	at org.joda.time.Partial.<init>(Partial.java:43)
	at org.joda.time.Partial.<init>(Partial.java:38)
	at org.joda.time.TestPartial_Constructors.testConstructor_TypeArray_intArray_year_weekyear(TestPartial_Constructors.java:201)

testConstructor2_TypeArray_intArray(org.joda.time.TestPartial_Constructors)  Time elapsed: 0.001 sec  <<< ERROR!
java.lang.IllegalArgumentException: Values array must not be null
	at org.joda.time.Partial.<init>(Partial.java:43)
	at org.joda.time.Partial.<init>(Partial.java:38)
	at org.joda.time.TestPartial_Constructors.testConstructor2_TypeArray_intArray(TestPartial_Constructors.java:220)

testConstructorEx3_TypeArray_intArray(org.joda.time.TestPartial_Constructors)  Time elapsed: 0.001 sec  <<< ERROR!
java.lang.NullPointerException
	at org.joda.time.Partial.<init>(Partial.java:44)
	at org.joda.time.Partial.<init>(Partial.java:38)
	at org.joda.time.TestPartial_Constructors.testConstructorEx3_TypeArray_intArray(TestPartial_Constructors.java:242)

testConstructorEx5_TypeArray_intArray(org.joda.time.TestPartial_Constructors)  Time elapsed: 0 sec  <<< FAILURE!
junit.framework.AssertionFailedError: Values array must not be null: same length expected:<true> but was:<false>
	at junit.framework.Assert.fail(Assert.java:47)
	at junit.framework.Assert.failNotEquals(Assert.java:280)
	at junit.framework.Assert.assertEquals(Assert.java:64)
	at junit.framework.Assert.assertEquals(Assert.java:146)
	at org.joda.time.TestPartial_Constructors.assertMessageContains(TestPartial_Constructors.java:478)
	at org.joda.time.TestPartial_Constructors.testConstructorEx5_TypeArray_intArray(TestPartial_Constructors.java:257)

testConstructorEx6_TypeArray_intArray(org.joda.time.TestPartial_Constructors)  Time elapsed: 0.001 sec  <<< FAILURE!
junit.framework.AssertionFailedError: Values array must not be null: contain null expected:<true> but was:<false>
	at junit.framework.Assert.fail(Assert.java:47)
	at junit.framework.Assert.failNotEquals(Assert.java:280)
	at junit.framework.Assert.assertEquals(Assert.java:64)
	at junit.framework.Assert.assertEquals(Assert.java:146)
	at org.joda.time.TestPartial_Constructors.assertMessageContains(TestPartial_Constructors.java:478)
	at org.joda.time.TestPartial_Constructors.testConstructorEx6_TypeArray_intArray(TestPartial_Constructors.java:269)

testConstructorEx7_TypeArray_intArray_inOrder(org.joda.time.TestPartial_Constructors)  Time elapsed: 0 sec  <<< FAILURE!
junit.framework.AssertionFailedError: Values array must not be null: must be in order/largest-smallest expected:<true> but was:<false>
	at junit.framework.Assert.fail(Assert.java:47)
	at junit.framework.Assert.failNotEquals(Assert.java:280)
	at junit.framework.Assert.assertEquals(Assert.java:64)
	at junit.framework.Assert.assertEquals(Assert.java:146)
	at org.joda.time.TestPartial_Constructors.assertMessageContains(TestPartial_Constructors.java:489)
	at org.joda.time.TestPartial_Constructors.testConstructorEx7_TypeArray_intArray_inOrder(TestPartial_Constructors.java:290)

testConstructorEx8_TypeArray_intArray_duplicate(org.joda.time.TestPartial_Constructors)  Time elapsed: 0.001 sec  <<< FAILURE!
junit.framework.AssertionFailedError: Values array must not be null: must not/duplicate expected:<true> but was:<false>
	at junit.framework.Assert.fail(Assert.java:47)
	at junit.framework.Assert.failNotEquals(Assert.java:280)
	at junit.framework.Assert.assertEquals(Assert.java:64)
	at junit.framework.Assert.assertEquals(Assert.java:146)
	at org.joda.time.TestPartial_Constructors.assertMessageContains(TestPartial_Constructors.java:489)
	at org.joda.time.TestPartial_Constructors.testConstructorEx8_TypeArray_intArray_duplicate(TestPartial_Constructors.java:368)

testConstructorEx9_TypeArray_intArray(org.joda.time.TestPartial_Constructors)  Time elapsed: 0 sec  <<< FAILURE!
junit.framework.AssertionFailedError: Values array must not be null: Value 0 expected:<true> but was:<false>
	at junit.framework.Assert.fail(Assert.java:47)
	at junit.framework.Assert.failNotEquals(Assert.java:280)
	at junit.framework.Assert.assertEquals(Assert.java:64)
	at junit.framework.Assert.assertEquals(Assert.java:146)
	at org.joda.time.TestPartial_Constructors.assertMessageContains(TestPartial_Constructors.java:478)
	at org.joda.time.TestPartial_Constructors.testConstructorEx9_TypeArray_intArray(TestPartial_Constructors.java:410)

testConstructor_TypeArray_intArray_Chrono(org.joda.time.TestPartial_Constructors)  Time elapsed: 0.001 sec  <<< ERROR!
java.lang.IllegalArgumentException: Values array must not be null
	at org.joda.time.Partial.<init>(Partial.java:43)
	at org.joda.time.TestPartial_Constructors.testConstructor_TypeArray_intArray_Chrono(TestPartial_Constructors.java:424)

testPropertyGetHour(org.joda.time.TestPartial_Properties)  Time elapsed: 0.001 sec  <<< ERROR!
java.lang.IllegalArgumentException: Values array must not be null
	at org.joda.time.Partial.<init>(Partial.java:43)
	at org.joda.time.Partial.<init>(Partial.java:38)
	at org.joda.time.TestPartial_Properties.testPropertyGetHour(TestPartial_Properties.java:86)

testPropertyGetMaxMinValuesHour(org.joda.time.TestPartial_Properties)  Time elapsed: 0 sec  <<< ERROR!
java.lang.IllegalArgumentException: Values array must not be null
	at org.joda.time.Partial.<init>(Partial.java:43)
	at org.joda.time.Partial.<init>(Partial.java:38)
	at org.joda.time.TestPartial_Properties.testPropertyGetMaxMinValuesHour(TestPartial_Properties.java:105)

testPropertySetHour(org.joda.time.TestPartial_Properties)  Time elapsed: 0.001 sec  <<< ERROR!
java.lang.IllegalArgumentException: Values array must not be null
	at org.joda.time.Partial.<init>(Partial.java:43)
	at org.joda.time.Partial.<init>(Partial.java:38)
	at org.joda.time.TestPartial_Properties.testPropertySetHour(TestPartial_Properties.java:179)

testPropertySetTextHour(org.joda.time.TestPartial_Properties)  Time elapsed: 0 sec  <<< ERROR!
java.lang.IllegalArgumentException: Values array must not be null
	at org.joda.time.Partial.<init>(Partial.java:43)
	at org.joda.time.Partial.<init>(Partial.java:38)
	at org.joda.time.TestPartial_Properties.testPropertySetTextHour(TestPartial_Properties.java:195)

testPropertyWithMaximumValueHour(org.joda.time.TestPartial_Properties)  Time elapsed: 0 sec  <<< ERROR!
java.lang.IllegalArgumentException: Values array must not be null
	at org.joda.time.Partial.<init>(Partial.java:43)
	at org.joda.time.Partial.<init>(Partial.java:38)
	at org.joda.time.TestPartial_Properties.testPropertyWithMaximumValueHour(TestPartial_Properties.java:202)

testPropertyWithMinimumValueHour(org.joda.time.TestPartial_Properties)  Time elapsed: 0.001 sec  <<< ERROR!
java.lang.IllegalArgumentException: Values array must not be null
	at org.joda.time.Partial.<init>(Partial.java:43)
	at org.joda.time.Partial.<init>(Partial.java:38)
	at org.joda.time.TestPartial_Properties.testPropertyWithMinimumValueHour(TestPartial_Properties.java:209)

testPropertyCompareToHour(org.joda.time.TestPartial_Properties)  Time elapsed: 0 sec  <<< ERROR!
java.lang.IllegalArgumentException: Values array must not be null
	at org.joda.time.Partial.<init>(Partial.java:43)
	at org.joda.time.Partial.<init>(Partial.java:38)
	at org.joda.time.TestPartial_Properties.testPropertyCompareToHour(TestPartial_Properties.java:216)

testPropertyGetMinute(org.joda.time.TestPartial_Properties)  Time elapsed: 0.001 sec  <<< ERROR!
java.lang.IllegalArgumentException: Values array must not be null
	at org.joda.time.Partial.<init>(Partial.java:43)
	at org.joda.time.Partial.<init>(Partial.java:38)
	at org.joda.time.TestPartial_Properties.testPropertyGetMinute(TestPartial_Properties.java:239)

testPropertyGetMaxMinValuesMinute(org.joda.time.TestPartial_Properties)  Time elapsed: 0 sec  <<< ERROR!
java.lang.IllegalArgumentException: Values array must not be null
	at org.joda.time.Partial.<init>(Partial.java:43)
	at org.joda.time.Partial.<init>(Partial.java:38)
	at org.joda.time.TestPartial_Properties.testPropertyGetMaxMinValuesMinute(TestPartial_Properties.java:258)

testPropertySetMinute(org.joda.time.TestPartial_Properties)  Time elapsed: 0.001 sec  <<< ERROR!
java.lang.IllegalArgumentException: Values array must not be null
	at org.joda.time.Partial.<init>(Partial.java:43)
	at org.joda.time.Partial.<init>(Partial.java:38)
	at org.joda.time.TestPartial_Properties.testPropertySetMinute(TestPartial_Properties.java:365)

testPropertySetTextMinute(org.joda.time.TestPartial_Properties)  Time elapsed: 0 sec  <<< ERROR!
java.lang.IllegalArgumentException: Values array must not be null
	at org.joda.time.Partial.<init>(Partial.java:43)
	at org.joda.time.Partial.<init>(Partial.java:38)
	at org.joda.time.TestPartial_Properties.testPropertySetTextMinute(TestPartial_Properties.java:381)

testPropertyCompareToMinute(org.joda.time.TestPartial_Properties)  Time elapsed: 0.001 sec  <<< ERROR!
java.lang.IllegalArgumentException: Values array must not be null
	at org.joda.time.Partial.<init>(Partial.java:43)
	at org.joda.time.Partial.<init>(Partial.java:38)
	at org.joda.time.TestPartial_Properties.testPropertyCompareToMinute(TestPartial_Properties.java:388)

testPropertyAddMinute(org.joda.time.TestPartial_Properties)  Time elapsed: 0 sec  <<< ERROR!
java.lang.IllegalArgumentException: Values array must not be null
	at org.joda.time.Partial.<init>(Partial.java:43)
	at org.joda.time.Partial.<init>(Partial.java:38)
	at org.joda.time.TestPartial_Properties.testPropertyAddMinute(TestPartial_Properties.java:306)

testPropertyAddWrapFieldMinute(org.joda.time.TestPartial_Properties)  Time elapsed: 0.001 sec  <<< ERROR!
java.lang.IllegalArgumentException: Values array must not be null
	at org.joda.time.Partial.<init>(Partial.java:43)
	at org.joda.time.Partial.<init>(Partial.java:38)
	at org.joda.time.TestPartial_Properties.testPropertyAddWrapFieldMinute(TestPartial_Properties.java:352)

testPropertyAddWrapFieldHour(org.joda.time.TestPartial_Properties)  Time elapsed: 0 sec  <<< ERROR!
java.lang.IllegalArgumentException: Values array must not be null
	at org.joda.time.Partial.<init>(Partial.java:43)
	at org.joda.time.Partial.<init>(Partial.java:38)
	at org.joda.time.TestPartial_Properties.testPropertyAddWrapFieldHour(TestPartial_Properties.java:163)

testPropertyAddHour(org.joda.time.TestPartial_Properties)  Time elapsed: 0.001 sec  <<< ERROR!
java.lang.IllegalArgumentException: Values array must not be null
	at org.joda.time.Partial.<init>(Partial.java:43)
	at org.joda.time.Partial.<init>(Partial.java:38)
	at org.joda.time.TestPartial_Properties.testPropertyAddHour(TestPartial_Properties.java:135)

testIsMatch_Instant(org.joda.time.TestPartial_Match)  Time elapsed: 0 sec  <<< ERROR!
java.lang.IllegalArgumentException: Values array must not be null
	at org.joda.time.Partial.<init>(Partial.java:43)
	at org.joda.time.TestPartial_Match.createYMDwPartial(TestPartial_Match.java:165)
	at org.joda.time.TestPartial_Match.testIsMatch_Instant(TestPartial_Match.java:97)

testIsMatch_Partial(org.joda.time.TestPartial_Match)  Time elapsed: 0.001 sec  <<< ERROR!
java.lang.IllegalArgumentException: Values array must not be null
	at org.joda.time.Partial.<init>(Partial.java:43)
	at org.joda.time.TestPartial_Match.createYMDwPartial(TestPartial_Match.java:165)
	at org.joda.time.TestPartial_Match.testIsMatch_Partial(TestPartial_Match.java:129)

testIsContiguous_RP(org.joda.time.TestDateTimeUtils)  Time elapsed: 0.001 sec  <<< ERROR!
java.lang.IllegalArgumentException: Values array must not be null
	at org.joda.time.Partial.<init>(Partial.java:43)
	at org.joda.time.Partial.with(Partial.java:126)
	at org.joda.time.TestDateTimeUtils.testIsContiguous_RP(TestDateTimeUtils.java:438)

testIsContiguous_RP_GJChronology(org.joda.time.TestDateTimeUtils)  Time elapsed: 0.001 sec  <<< ERROR!
java.lang.IllegalArgumentException: Values array must not be null
	at org.joda.time.Partial.<init>(Partial.java:43)
	at org.joda.time.Partial.with(Partial.java:126)
	at org.joda.time.TestDateTimeUtils.testIsContiguous_RP_GJChronology(TestDateTimeUtils.java:462)

testPartialDayOfYearAdd(org.joda.time.chrono.TestISOChronology)  Time elapsed: 0.001 sec  <<< ERROR!
java.lang.IllegalArgumentException: Values array must not be null
	at org.joda.time.Partial.<init>(Partial.java:43)
	at org.joda.time.Partial.with(Partial.java:126)
	at org.joda.time.chrono.TestISOChronology.testPartialDayOfYearAdd(TestISOChronology.java:440)

testFormat_date_partial(org.joda.time.format.TestISODateTimeFormat)  Time elapsed: 0.001 sec  <<< ERROR!
java.lang.IllegalArgumentException: Values array must not be null
	at org.joda.time.Partial.<init>(Partial.java:43)
	at org.joda.time.Partial.<init>(Partial.java:38)
	at org.joda.time.format.TestISODateTimeFormat.testFormat_date_partial(TestISODateTimeFormat.java:108)

testFormat_time_partial(org.joda.time.format.TestISODateTimeFormat)  Time elapsed: 0 sec  <<< ERROR!
java.lang.IllegalArgumentException: Values array must not be null
	at org.joda.time.Partial.<init>(Partial.java:43)
	at org.joda.time.Partial.<init>(Partial.java:38)
	at org.joda.time.format.TestISODateTimeFormat.testFormat_time_partial(TestISODateTimeFormat.java:126)

testFormat_timeNoMillis_partial(org.joda.time.format.TestISODateTimeFormat)  Time elapsed: 0.001 sec  <<< ERROR!
java.lang.IllegalArgumentException: Values array must not be null
	at org.joda.time.Partial.<init>(Partial.java:43)
	at org.joda.time.Partial.<init>(Partial.java:38)
	at org.joda.time.format.TestISODateTimeFormat.testFormat_timeNoMillis_partial(TestISODateTimeFormat.java:145)

testForFields_calBased_YMD(org.joda.time.format.TestISODateTimeFormat_Fields)  Time elapsed: 0.001 sec  <<< ERROR!
java.lang.IllegalArgumentException: Values array must not be null
	at org.joda.time.Partial.<init>(Partial.java:43)
	at org.joda.time.Partial.<init>(Partial.java:38)
	at org.joda.time.format.TestISODateTimeFormat_Fields.testForFields_calBased_YMD(TestISODateTimeFormat_Fields.java:83)

testForFields_calBased_YMD_unmodifiable(org.joda.time.format.TestISODateTimeFormat_Fields)  Time elapsed: 0 sec  <<< ERROR!
java.lang.IllegalArgumentException: Values array must not be null
	at org.joda.time.Partial.<init>(Partial.java:43)
	at org.joda.time.Partial.<init>(Partial.java:38)
	at org.joda.time.format.TestISODateTimeFormat_Fields.testForFields_calBased_YMD_unmodifiable(TestISODateTimeFormat_Fields.java:112)

testForFields_calBased_YMD_duplicates(org.joda.time.format.TestISODateTimeFormat_Fields)  Time elapsed: 0.001 sec  <<< ERROR!
java.lang.IllegalArgumentException: Values array must not be null
	at org.joda.time.Partial.<init>(Partial.java:43)
	at org.joda.time.Partial.<init>(Partial.java:38)
	at org.joda.time.format.TestISODateTimeFormat_Fields.testForFields_calBased_YMD_duplicates(TestISODateTimeFormat_Fields.java:137)

testForFields_calBased_Y(org.joda.time.format.TestISODateTimeFormat_Fields)  Time elapsed: 0 sec  <<< ERROR!
java.lang.IllegalArgumentException: Values array must not be null
	at org.joda.time.Partial.<init>(Partial.java:43)
	at org.joda.time.Partial.<init>(Partial.java:38)
	at org.joda.time.format.TestISODateTimeFormat_Fields.testForFields_calBased_Y(TestISODateTimeFormat_Fields.java:154)

testForFields_calBased_M(org.joda.time.format.TestISODateTimeFormat_Fields)  Time elapsed: 0 sec  <<< ERROR!
java.lang.IllegalArgumentException: Values array must not be null
	at org.joda.time.Partial.<init>(Partial.java:43)
	at org.joda.time.Partial.<init>(Partial.java:38)
	at org.joda.time.format.TestISODateTimeFormat_Fields.testForFields_calBased_M(TestISODateTimeFormat_Fields.java:181)

testForFields_calBased_D(org.joda.time.format.TestISODateTimeFormat_Fields)  Time elapsed: 0 sec  <<< ERROR!
java.lang.IllegalArgumentException: Values array must not be null
	at org.joda.time.Partial.<init>(Partial.java:43)
	at org.joda.time.Partial.<init>(Partial.java:38)
	at org.joda.time.format.TestISODateTimeFormat_Fields.testForFields_calBased_D(TestISODateTimeFormat_Fields.java:208)

testForFields_calBased_YM(org.joda.time.format.TestISODateTimeFormat_Fields)  Time elapsed: 0 sec  <<< ERROR!
java.lang.IllegalArgumentException: Values array must not be null
	at org.joda.time.Partial.<init>(Partial.java:43)
	at org.joda.time.Partial.<init>(Partial.java:38)
	at org.joda.time.format.TestISODateTimeFormat_Fields.testForFields_calBased_YM(TestISODateTimeFormat_Fields.java:236)

testForFields_calBased_MD(org.joda.time.format.TestISODateTimeFormat_Fields)  Time elapsed: 0.001 sec  <<< ERROR!
java.lang.IllegalArgumentException: Values array must not be null
	at org.joda.time.Partial.<init>(Partial.java:43)
	at org.joda.time.Partial.<init>(Partial.java:38)
	at org.joda.time.format.TestISODateTimeFormat_Fields.testForFields_calBased_MD(TestISODateTimeFormat_Fields.java:264)

testForFields_calBased_YD(org.joda.time.format.TestISODateTimeFormat_Fields)  Time elapsed: 0 sec  <<< ERROR!
java.lang.IllegalArgumentException: Values array must not be null
	at org.joda.time.Partial.<init>(Partial.java:43)
	at org.joda.time.Partial.<init>(Partial.java:38)
	at org.joda.time.format.TestISODateTimeFormat_Fields.testForFields_calBased_YD(TestISODateTimeFormat_Fields.java:292)

testForFields_weekBased_YWD(org.joda.time.format.TestISODateTimeFormat_Fields)  Time elapsed: 0.001 sec  <<< ERROR!
java.lang.IllegalArgumentException: Values array must not be null
	at org.joda.time.Partial.<init>(Partial.java:43)
	at org.joda.time.Partial.<init>(Partial.java:38)
	at org.joda.time.format.TestISODateTimeFormat_Fields.testForFields_weekBased_YWD(TestISODateTimeFormat_Fields.java:325)

testForFields_weekBased_Y(org.joda.time.format.TestISODateTimeFormat_Fields)  Time elapsed: 0 sec  <<< ERROR!
java.lang.IllegalArgumentException: Values array must not be null
	at org.joda.time.Partial.<init>(Partial.java:43)
	at org.joda.time.Partial.<init>(Partial.java:38)
	at org.joda.time.format.TestISODateTimeFormat_Fields.testForFields_weekBased_Y(TestISODateTimeFormat_Fields.java:352)

testForFields_weekBased_W(org.joda.time.format.TestISODateTimeFormat_Fields)  Time elapsed: 0 sec  <<< ERROR!
java.lang.IllegalArgumentException: Values array must not be null
	at org.joda.time.Partial.<init>(Partial.java:43)
	at org.joda.time.Partial.<init>(Partial.java:38)
	at org.joda.time.format.TestISODateTimeFormat_Fields.testForFields_weekBased_W(TestISODateTimeFormat_Fields.java:379)

testForFields_weekBased_D(org.joda.time.format.TestISODateTimeFormat_Fields)  Time elapsed: 0.001 sec  <<< ERROR!
java.lang.IllegalArgumentException: Values array must not be null
	at org.joda.time.Partial.<init>(Partial.java:43)
	at org.joda.time.Partial.<init>(Partial.java:38)
	at org.joda.time.format.TestISODateTimeFormat_Fields.testForFields_weekBased_D(TestISODateTimeFormat_Fields.java:406)

testForFields_weekBased_YW(org.joda.time.format.TestISODateTimeFormat_Fields)  Time elapsed: 0 sec  <<< ERROR!
java.lang.IllegalArgumentException: Values array must not be null
	at org.joda.time.Partial.<init>(Partial.java:43)
	at org.joda.time.Partial.<init>(Partial.java:38)
	at org.joda.time.format.TestISODateTimeFormat_Fields.testForFields_weekBased_YW(TestISODateTimeFormat_Fields.java:434)

testForFields_weekBased_WD(org.joda.time.format.TestISODateTimeFormat_Fields)  Time elapsed: 0.001 sec  <<< ERROR!
java.lang.IllegalArgumentException: Values array must not be null
	at org.joda.time.Partial.<init>(Partial.java:43)
	at org.joda.time.Partial.<init>(Partial.java:38)
	at org.joda.time.format.TestISODateTimeFormat_Fields.testForFields_weekBased_WD(TestISODateTimeFormat_Fields.java:462)

testForFields_weekBased_YD(org.joda.time.format.TestISODateTimeFormat_Fields)  Time elapsed: 0 sec  <<< ERROR!
java.lang.IllegalArgumentException: Values array must not be null
	at org.joda.time.Partial.<init>(Partial.java:43)
	at org.joda.time.Partial.<init>(Partial.java:38)
	at org.joda.time.format.TestISODateTimeFormat_Fields.testForFields_weekBased_YD(TestISODateTimeFormat_Fields.java:490)

testForFields_ordinalBased_YD(org.joda.time.format.TestISODateTimeFormat_Fields)  Time elapsed: 0.001 sec  <<< ERROR!
java.lang.IllegalArgumentException: Values array must not be null
	at org.joda.time.Partial.<init>(Partial.java:43)
	at org.joda.time.Partial.<init>(Partial.java:38)
	at org.joda.time.format.TestISODateTimeFormat_Fields.testForFields_ordinalBased_YD(TestISODateTimeFormat_Fields.java:522)

testForFields_ordinalBased_Y(org.joda.time.format.TestISODateTimeFormat_Fields)  Time elapsed: 0 sec  <<< ERROR!
java.lang.IllegalArgumentException: Values array must not be null
	at org.joda.time.Partial.<init>(Partial.java:43)
	at org.joda.time.Partial.<init>(Partial.java:38)
	at org.joda.time.format.TestISODateTimeFormat_Fields.testForFields_ordinalBased_Y(TestISODateTimeFormat_Fields.java:549)

testForFields_ordinalBased_D(org.joda.time.format.TestISODateTimeFormat_Fields)  Time elapsed: 0 sec  <<< ERROR!
java.lang.IllegalArgumentException: Values array must not be null
	at org.joda.time.Partial.<init>(Partial.java:43)
	at org.joda.time.Partial.<init>(Partial.java:38)
	at org.joda.time.format.TestISODateTimeFormat_Fields.testForFields_ordinalBased_D(TestISODateTimeFormat_Fields.java:576)

testForFields_time_HMSm(org.joda.time.format.TestISODateTimeFormat_Fields)  Time elapsed: 0.001 sec  <<< ERROR!
java.lang.IllegalArgumentException: Values array must not be null
	at org.joda.time.Partial.<init>(Partial.java:43)
	at org.joda.time.Partial.<init>(Partial.java:38)
	at org.joda.time.format.TestISODateTimeFormat_Fields.testForFields_time_HMSm(TestISODateTimeFormat_Fields.java:608)

testForFields_time_HMS(org.joda.time.format.TestISODateTimeFormat_Fields)  Time elapsed: 0 sec  <<< ERROR!
java.lang.IllegalArgumentException: Values array must not be null
	at org.joda.time.Partial.<init>(Partial.java:43)
	at org.joda.time.Partial.<init>(Partial.java:38)
	at org.joda.time.format.TestISODateTimeFormat_Fields.testForFields_time_HMS(TestISODateTimeFormat_Fields.java:637)

testForFields_time_HM(org.joda.time.format.TestISODateTimeFormat_Fields)  Time elapsed: 0.001 sec  <<< ERROR!
java.lang.IllegalArgumentException: Values array must not be null
	at org.joda.time.Partial.<init>(Partial.java:43)
	at org.joda.time.Partial.<init>(Partial.java:38)
	at org.joda.time.format.TestISODateTimeFormat_Fields.testForFields_time_HM(TestISODateTimeFormat_Fields.java:665)

testForFields_time_H(org.joda.time.format.TestISODateTimeFormat_Fields)  Time elapsed: 0 sec  <<< ERROR!
java.lang.IllegalArgumentException: Values array must not be null
	at org.joda.time.Partial.<init>(Partial.java:43)
	at org.joda.time.Partial.<init>(Partial.java:38)
	at org.joda.time.format.TestISODateTimeFormat_Fields.testForFields_time_H(TestISODateTimeFormat_Fields.java:692)

testForFields_time_MSm(org.joda.time.format.TestISODateTimeFormat_Fields)  Time elapsed: 0.001 sec  <<< ERROR!
java.lang.IllegalArgumentException: Values array must not be null
	at org.joda.time.Partial.<init>(Partial.java:43)
	at org.joda.time.Partial.<init>(Partial.java:38)
	at org.joda.time.format.TestISODateTimeFormat_Fields.testForFields_time_MSm(TestISODateTimeFormat_Fields.java:721)

testForFields_time_MS(org.joda.time.format.TestISODateTimeFormat_Fields)  Time elapsed: 0 sec  <<< ERROR!
java.lang.IllegalArgumentException: Values array must not be null
	at org.joda.time.Partial.<init>(Partial.java:43)
	at org.joda.time.Partial.<init>(Partial.java:38)
	at org.joda.time.format.TestISODateTimeFormat_Fields.testForFields_time_MS(TestISODateTimeFormat_Fields.java:749)

testForFields_time_M(org.joda.time.format.TestISODateTimeFormat_Fields)  Time elapsed: 0.001 sec  <<< ERROR!
java.lang.IllegalArgumentException: Values array must not be null
	at org.joda.time.Partial.<init>(Partial.java:43)
	at org.joda.time.Partial.<init>(Partial.java:38)
	at org.joda.time.format.TestISODateTimeFormat_Fields.testForFields_time_M(TestISODateTimeFormat_Fields.java:776)

testForFields_time_Sm(org.joda.time.format.TestISODateTimeFormat_Fields)  Time elapsed: 0.002 sec  <<< ERROR!
java.lang.IllegalArgumentException: Values array must not be null
	at org.joda.time.Partial.<init>(Partial.java:43)
	at org.joda.time.Partial.<init>(Partial.java:38)
	at org.joda.time.format.TestISODateTimeFormat_Fields.testForFields_time_Sm(TestISODateTimeFormat_Fields.java:804)

testForFields_time_S(org.joda.time.format.TestISODateTimeFormat_Fields)  Time elapsed: 0 sec  <<< ERROR!
java.lang.IllegalArgumentException: Values array must not be null
	at org.joda.time.Partial.<init>(Partial.java:43)
	at org.joda.time.Partial.<init>(Partial.java:38)
	at org.joda.time.format.TestISODateTimeFormat_Fields.testForFields_time_S(TestISODateTimeFormat_Fields.java:831)

testForFields_time_m(org.joda.time.format.TestISODateTimeFormat_Fields)  Time elapsed: 0 sec  <<< ERROR!
java.lang.IllegalArgumentException: Values array must not be null
	at org.joda.time.Partial.<init>(Partial.java:43)
	at org.joda.time.Partial.<init>(Partial.java:38)
	at org.joda.time.format.TestISODateTimeFormat_Fields.testForFields_time_m(TestISODateTimeFormat_Fields.java:858)

testForFields_time_Hm(org.joda.time.format.TestISODateTimeFormat_Fields)  Time elapsed: 0 sec  <<< ERROR!
java.lang.IllegalArgumentException: Values array must not be null
	at org.joda.time.Partial.<init>(Partial.java:43)
	at org.joda.time.Partial.<init>(Partial.java:38)
	at org.joda.time.format.TestISODateTimeFormat_Fields.testForFields_time_Hm(TestISODateTimeFormat_Fields.java:888)

testForFields_time_HS(org.joda.time.format.TestISODateTimeFormat_Fields)  Time elapsed: 0 sec  <<< ERROR!
java.lang.IllegalArgumentException: Values array must not be null
	at org.joda.time.Partial.<init>(Partial.java:43)
	at org.joda.time.Partial.<init>(Partial.java:38)
	at org.joda.time.format.TestISODateTimeFormat_Fields.testForFields_time_HS(TestISODateTimeFormat_Fields.java:918)

testForFields_time_Mm(org.joda.time.format.TestISODateTimeFormat_Fields)  Time elapsed: 0.001 sec  <<< ERROR!
java.lang.IllegalArgumentException: Values array must not be null
	at org.joda.time.Partial.<init>(Partial.java:43)
	at org.joda.time.Partial.<init>(Partial.java:38)
	at org.joda.time.format.TestISODateTimeFormat_Fields.testForFields_time_Mm(TestISODateTimeFormat_Fields.java:948)

testForFields_time_HSm(org.joda.time.format.TestISODateTimeFormat_Fields)  Time elapsed: 0 sec  <<< ERROR!
java.lang.IllegalArgumentException: Values array must not be null
	at org.joda.time.Partial.<init>(Partial.java:43)
	at org.joda.time.Partial.<init>(Partial.java:38)
	at org.joda.time.format.TestISODateTimeFormat_Fields.testForFields_time_HSm(TestISODateTimeFormat_Fields.java:979)

testForFields_time_HMm(org.joda.time.format.TestISODateTimeFormat_Fields)  Time elapsed: 0.001 sec  <<< ERROR!
java.lang.IllegalArgumentException: Values array must not be null
	at org.joda.time.Partial.<init>(Partial.java:43)
	at org.joda.time.Partial.<init>(Partial.java:38)
	at org.joda.time.format.TestISODateTimeFormat_Fields.testForFields_time_HMm(TestISODateTimeFormat_Fields.java:1010)

testForFields_datetime_YMDH(org.joda.time.format.TestISODateTimeFormat_Fields)  Time elapsed: 0 sec  <<< ERROR!
java.lang.IllegalArgumentException: Values array must not be null
	at org.joda.time.Partial.<init>(Partial.java:43)
	at org.joda.time.Partial.<init>(Partial.java:38)
	at org.joda.time.format.TestISODateTimeFormat_Fields.testForFields_datetime_YMDH(TestISODateTimeFormat_Fields.java:1044)

testForFields_datetime_DH(org.joda.time.format.TestISODateTimeFormat_Fields)  Time elapsed: 0.001 sec  <<< ERROR!
java.lang.IllegalArgumentException: Values array must not be null
	at org.joda.time.Partial.<init>(Partial.java:43)
	at org.joda.time.Partial.<init>(Partial.java:38)
	at org.joda.time.format.TestISODateTimeFormat_Fields.testForFields_datetime_DH(TestISODateTimeFormat_Fields.java:1072)

testForFields_datetime_YH(org.joda.time.format.TestISODateTimeFormat_Fields)  Time elapsed: 0 sec  <<< ERROR!
java.lang.IllegalArgumentException: Values array must not be null
	at org.joda.time.Partial.<init>(Partial.java:43)
	at org.joda.time.Partial.<init>(Partial.java:38)
	at org.joda.time.format.TestISODateTimeFormat_Fields.testForFields_datetime_YH(TestISODateTimeFormat_Fields.java:1100)

testForFields_datetime_DM(org.joda.time.format.TestISODateTimeFormat_Fields)  Time elapsed: 0.001 sec  <<< ERROR!
java.lang.IllegalArgumentException: Values array must not be null
	at org.joda.time.Partial.<init>(Partial.java:43)
	at org.joda.time.Partial.<init>(Partial.java:38)
	at org.joda.time.format.TestISODateTimeFormat_Fields.testForFields_datetime_DM(TestISODateTimeFormat_Fields.java:1130)


Results :

Failed tests: 
  org.joda.time.TestPartial_Constructors#testConstructorEx5_TypeArray_intArray AssertionFailedError
  org.joda.time.TestPartial_Constructors#testConstructorEx6_TypeArray_intArray AssertionFailedError
  org.joda.time.TestPartial_Constructors#testConstructorEx7_TypeArray_intArray_inOrder AssertionFailedError
  org.joda.time.TestPartial_Constructors#testConstructorEx8_TypeArray_intArray_duplicate AssertionFailedError
  org.joda.time.TestPartial_Constructors#testConstructorEx9_TypeArray_intArray AssertionFailedError
Tests in error: 
  org.joda.time.TestBaseSingleFieldPeriod#testFactory_between_RPartial IllegalArgumentException
  org.joda.time.TestDateTimeUtils#testIsContiguous_RP IllegalArgumentException V...
  org.joda.time.TestDateTimeUtils#testIsContiguous_RP_GJChronology IllegalArgumentException
  org.joda.time.TestLocalDateTime_Basics#testCompareTo IllegalArgumentException ...
  org.joda.time.TestLocalDateTime_Basics#testEqualsHashCode IllegalArgumentException
  org.joda.time.TestLocalDate_Basics#testCompareTo IllegalArgumentException Valu...
  org.joda.time.TestLocalTime_Basics#testCompareTo IllegalArgumentException Valu...
  org.joda.time.TestMonthDay_Basics#testCompareTo IllegalArgumentException Value...
  org.joda.time.TestPartial_Basics#testCompareTo IllegalArgumentException Values...
  org.joda.time.TestPartial_Basics#testEqualsHashCode IllegalArgumentException V...
  org.joda.time.TestPartial_Basics#testGet IllegalArgumentException Values array...
  org.joda.time.TestPartial_Basics#testGetField IllegalArgumentException Values ...
  org.joda.time.TestPartial_Basics#testGetFieldType IllegalArgumentException Val...
  org.joda.time.TestPartial_Basics#testGetFieldTypes IllegalArgumentException Va...
  org.joda.time.TestPartial_Basics#testGetFields IllegalArgumentException Values...
  org.joda.time.TestPartial_Basics#testGetFormatter1 IllegalArgumentException Va...
  org.joda.time.TestPartial_Basics#testGetFormatter2 IllegalArgumentException Va...
  org.joda.time.TestPartial_Basics#testGetFormatter3 IllegalArgumentException Va...
  org.joda.time.TestPartial_Basics#testGetValue IllegalArgumentException Values ...
  org.joda.time.TestPartial_Basics#testGetValues IllegalArgumentException Values...
  org.joda.time.TestPartial_Basics#testIsAfter_TOD IllegalArgumentException Valu...
  org.joda.time.TestPartial_Basics#testIsBefore_TOD IllegalArgumentException Val...
  org.joda.time.TestPartial_Basics#testIsEqual_TOD IllegalArgumentException Valu...
  org.joda.time.TestPartial_Basics#testIsSupported IllegalArgumentException Valu...
  org.joda.time.TestPartial_Basics#testMinus_RP IllegalArgumentException Values ...
  org.joda.time.TestPartial_Basics#testPlus_RP IllegalArgumentException Values a...
  org.joda.time.TestPartial_Basics#testProperty IllegalArgumentException Values ...
  org.joda.time.TestPartial_Basics#testSerialization IllegalArgumentException Va...
  org.joda.time.TestPartial_Basics#testSize IllegalArgumentException Values arra...
  org.joda.time.TestPartial_Basics#testToDateTime_RI IllegalArgumentException Va...
  org.joda.time.TestPartial_Basics#testToDateTime_nullRI IllegalArgumentException
  org.joda.time.TestPartial_Basics#testToString1 IllegalArgumentException Values...
  org.joda.time.TestPartial_Basics#testToString3 IllegalArgumentException Values...
  org.joda.time.TestPartial_Basics#testToString4 IllegalArgumentException Values...
  org.joda.time.TestPartial_Basics#testToString5 IllegalArgumentException Values...
  org.joda.time.TestPartial_Basics#testToString_DTFormatter IllegalArgumentException
  org.joda.time.TestPartial_Basics#testToString_String IllegalArgumentException ...
  org.joda.time.TestPartial_Basics#testToString_String_Locale IllegalArgumentException
  org.joda.time.TestPartial_Basics#testWith1 IllegalArgumentException Values arr...
  org.joda.time.TestPartial_Basics#testWith2 IllegalArgumentException Values arr...
  org.joda.time.TestPartial_Basics#testWith3 IllegalArgumentException Values arr...
  org.joda.time.TestPartial_Basics#testWith3a IllegalArgumentException Values ar...
  org.joda.time.TestPartial_Basics#testWith3b IllegalArgumentException Values ar...
  org.joda.time.TestPartial_Basics#testWith3c IllegalArgumentException Values ar...
  org.joda.time.TestPartial_Basics#testWith3d IllegalArgumentException Values ar...
  org.joda.time.TestPartial_Basics#testWith3e IllegalArgumentException Values ar...
  org.joda.time.TestPartial_Basics#testWith3f IllegalArgumentException Values ar...
  org.joda.time.TestPartial_Basics#testWith4 IllegalArgumentException Values arr...
  org.joda.time.TestPartial_Basics#testWithChronologyRetainFields_Chrono IllegalArgumentException
  org.joda.time.TestPartial_Basics#testWithChronologyRetainFields_nullChrono IllegalArgumentException
  org.joda.time.TestPartial_Basics#testWithChronologyRetainFields_sameChrono IllegalArgumentException
  org.joda.time.TestPartial_Basics#testWithField1 IllegalArgumentException Value...
  org.joda.time.TestPartial_Basics#testWithField2 IllegalArgumentException Value...
  org.joda.time.TestPartial_Basics#testWithField3 IllegalArgumentException Value...
  org.joda.time.TestPartial_Basics#testWithField4 IllegalArgumentException Value...
  org.joda.time.TestPartial_Basics#testWithFieldAddWrapped1 IllegalArgumentException
  org.joda.time.TestPartial_Basics#testWithFieldAddWrapped2 IllegalArgumentException
  org.joda.time.TestPartial_Basics#testWithFieldAddWrapped3 IllegalArgumentException
  org.joda.time.TestPartial_Basics#testWithFieldAddWrapped4 IllegalArgumentException
  org.joda.time.TestPartial_Basics#testWithFieldAddWrapped5 IllegalArgumentException
  org.joda.time.TestPartial_Basics#testWithFieldAddWrapped6 IllegalArgumentException
  org.joda.time.TestPartial_Basics#testWithFieldAddWrapped7 IllegalArgumentException
  org.joda.time.TestPartial_Basics#testWithFieldAddWrapped8 IllegalArgumentException
  org.joda.time.TestPartial_Basics#testWithFieldAdded1 IllegalArgumentException ...
  org.joda.time.TestPartial_Basics#testWithFieldAdded2 IllegalArgumentException ...
  org.joda.time.TestPartial_Basics#testWithFieldAdded3 IllegalArgumentException ...
  org.joda.time.TestPartial_Basics#testWithFieldAdded4 IllegalArgumentException ...
  org.joda.time.TestPartial_Basics#testWithFieldAdded5 IllegalArgumentException ...
  org.joda.time.TestPartial_Basics#testWithFieldAdded6 IllegalArgumentException ...
  org.joda.time.TestPartial_Basics#testWithFieldAdded7 IllegalArgumentException ...
  org.joda.time.TestPartial_Basics#testWithFieldAdded8 IllegalArgumentException ...
  org.joda.time.TestPartial_Basics#testWith_argHasNoRange IllegalArgumentException
  org.joda.time.TestPartial_Basics#testWith_baseAndArgHaveNoRange IllegalArgumentException
  org.joda.time.TestPartial_Basics#testWith_baseHasNoRange IllegalArgumentException
  org.joda.time.TestPartial_Basics#testWithout1 IllegalArgumentException Values ...
  org.joda.time.TestPartial_Basics#testWithout2 IllegalArgumentException Values ...
  org.joda.time.TestPartial_Basics#testWithout3 IllegalArgumentException Values ...
  org.joda.time.TestPartial_Basics#testWithout4 IllegalArgumentException Values ...
  org.joda.time.TestPartial_Constructors#testConstructor2_TypeArray_intArray IllegalArgumentException
  org.joda.time.TestPartial_Constructors#testConstructorEx3_TypeArray_intArray NullPointerException
  org.joda.time.TestPartial_Constructors#testConstructor_TypeArray_intArray IllegalArgumentException
  org.joda.time.TestPartial_Constructors#testConstructor_TypeArray_intArray_Chrono IllegalArgumentException
  org.joda.time.TestPartial_Constructors#testConstructor_TypeArray_intArray_year_weekyear IllegalArgumentException
  org.joda.time.TestPartial_Match#testIsMatch_Instant IllegalArgumentException V...
  org.joda.time.TestPartial_Match#testIsMatch_Partial IllegalArgumentException V...
  org.joda.time.TestPartial_Properties#testPropertyAddHour IllegalArgumentException
  org.joda.time.TestPartial_Properties#testPropertyAddMinute IllegalArgumentException
  org.joda.time.TestPartial_Properties#testPropertyAddWrapFieldHour IllegalArgumentException
  org.joda.time.TestPartial_Properties#testPropertyAddWrapFieldMinute IllegalArgumentException
  org.joda.time.TestPartial_Properties#testPropertyCompareToHour IllegalArgumentException
  org.joda.time.TestPartial_Properties#testPropertyCompareToMinute IllegalArgumentException
  org.joda.time.TestPartial_Properties#testPropertyGetHour IllegalArgumentException
  org.joda.time.TestPartial_Properties#testPropertyGetMaxMinValuesHour IllegalArgumentException
  org.joda.time.TestPartial_Properties#testPropertyGetMaxMinValuesMinute IllegalArgumentException
  org.joda.time.TestPartial_Properties#testPropertyGetMinute IllegalArgumentException
  org.joda.time.TestPartial_Properties#testPropertySetHour IllegalArgumentException
  org.joda.time.TestPartial_Properties#testPropertySetMinute IllegalArgumentException
  org.joda.time.TestPartial_Properties#testPropertySetTextHour IllegalArgumentException
  org.joda.time.TestPartial_Properties#testPropertySetTextMinute IllegalArgumentException
  org.joda.time.TestPartial_Properties#testPropertyWithMaximumValueHour IllegalArgumentException
  org.joda.time.TestPartial_Properties#testPropertyWithMinimumValueHour IllegalArgumentException
  org.joda.time.TestPeriod_Constructors#testConstructor_RP_RP7 IllegalArgumentException
  org.joda.time.TestPeriod_Constructors#testConstructor_RP_RP8 IllegalArgumentException
  org.joda.time.TestPeriod_Constructors#testConstructor_RP_RP_PeriodType7 IllegalArgumentException
  org.joda.time.TestPeriod_Constructors#testConstructor_RP_RP_PeriodType8 IllegalArgumentException
  org.joda.time.TestPeriod_Constructors#testFactoryFieldDifference1 IllegalArgumentException
  org.joda.time.TestPeriod_Constructors#testFactoryFieldDifference4 IllegalArgumentException
  org.joda.time.TestPeriod_Constructors#testFactoryFieldDifference5 IllegalArgumentException
  org.joda.time.TestTimeOfDay_Basics#testCompareTo IllegalArgumentException Valu...
  org.joda.time.TestYearMonthDay_Basics#testCompareTo IllegalArgumentException V...
  org.joda.time.TestYearMonth_Basics#testCompareTo IllegalArgumentException Valu...
  org.joda.time.chrono.TestISOChronology#testPartialDayOfYearAdd IllegalArgumentException
  org.joda.time.format.TestISODateTimeFormat#testFormat_date_partial IllegalArgumentException
  org.joda.time.format.TestISODateTimeFormat#testFormat_timeNoMillis_partial IllegalArgumentException
  org.joda.time.format.TestISODateTimeFormat#testFormat_time_partial IllegalArgumentException
  org.joda.time.format.TestISODateTimeFormat_Fields#testForFields_calBased_D IllegalArgumentException
  org.joda.time.format.TestISODateTimeFormat_Fields#testForFields_calBased_M IllegalArgumentException
  org.joda.time.format.TestISODateTimeFormat_Fields#testForFields_calBased_MD IllegalArgumentException
  org.joda.time.format.TestISODateTimeFormat_Fields#testForFields_calBased_Y IllegalArgumentException
  org.joda.time.format.TestISODateTimeFormat_Fields#testForFields_calBased_YD IllegalArgumentException
  org.joda.time.format.TestISODateTimeFormat_Fields#testForFields_calBased_YM IllegalArgumentException
  org.joda.time.format.TestISODateTimeFormat_Fields#testForFields_calBased_YMD IllegalArgumentException
  org.joda.time.format.TestISODateTimeFormat_Fields#testForFields_calBased_YMD_duplicates IllegalArgumentException
  org.joda.time.format.TestISODateTimeFormat_Fields#testForFields_calBased_YMD_unmodifiable IllegalArgumentException
  org.joda.time.format.TestISODateTimeFormat_Fields#testForFields_datetime_DH IllegalArgumentException
  org.joda.time.format.TestISODateTimeFormat_Fields#testForFields_datetime_DM IllegalArgumentException
  org.joda.time.format.TestISODateTimeFormat_Fields#testForFields_datetime_YH IllegalArgumentException
  org.joda.time.format.TestISODateTimeFormat_Fields#testForFields_datetime_YMDH IllegalArgumentException
  org.joda.time.format.TestISODateTimeFormat_Fields#testForFields_ordinalBased_D IllegalArgumentException
  org.joda.time.format.TestISODateTimeFormat_Fields#testForFields_ordinalBased_Y IllegalArgumentException
  org.joda.time.format.TestISODateTimeFormat_Fields#testForFields_ordinalBased_YD IllegalArgumentException
  org.joda.time.format.TestISODateTimeFormat_Fields#testForFields_time_H IllegalArgumentException
  org.joda.time.format.TestISODateTimeFormat_Fields#testForFields_time_HM IllegalArgumentException
  org.joda.time.format.TestISODateTimeFormat_Fields#testForFields_time_HMS IllegalArgumentException
  org.joda.time.format.TestISODateTimeFormat_Fields#testForFields_time_HMSm IllegalArgumentException
  org.joda.time.format.TestISODateTimeFormat_Fields#testForFields_time_HMm IllegalArgumentException
  org.joda.time.format.TestISODateTimeFormat_Fields#testForFields_time_HS IllegalArgumentException
  org.joda.time.format.TestISODateTimeFormat_Fields#testForFields_time_HSm IllegalArgumentException
  org.joda.time.format.TestISODateTimeFormat_Fields#testForFields_time_Hm IllegalArgumentException
  org.joda.time.format.TestISODateTimeFormat_Fields#testForFields_time_M IllegalArgumentException
  org.joda.time.format.TestISODateTimeFormat_Fields#testForFields_time_MS IllegalArgumentException
  org.joda.time.format.TestISODateTimeFormat_Fields#testForFields_time_MSm IllegalArgumentException
  org.joda.time.format.TestISODateTimeFormat_Fields#testForFields_time_Mm IllegalArgumentException
  org.joda.time.format.TestISODateTimeFormat_Fields#testForFields_time_S IllegalArgumentException
  org.joda.time.format.TestISODateTimeFormat_Fields#testForFields_time_Sm IllegalArgumentException
  org.joda.time.format.TestISODateTimeFormat_Fields#testForFields_time_m IllegalArgumentException
  org.joda.time.format.TestISODateTimeFormat_Fields#testForFields_weekBased_D IllegalArgumentException
  org.joda.time.format.TestISODateTimeFormat_Fields#testForFields_weekBased_W IllegalArgumentException
  org.joda.time.format.TestISODateTimeFormat_Fields#testForFields_weekBased_WD IllegalArgumentException
  org.joda.time.format.TestISODateTimeFormat_Fields#testForFields_weekBased_Y IllegalArgumentException
  org.joda.time.format.TestISODateTimeFormat_Fields#testForFields_weekBased_YD IllegalArgumentException
  org.joda.time.format.TestISODateTimeFormat_Fields#testForFields_weekBased_YW IllegalArgumentException
  org.joda.time.format.TestISODateTimeFormat_Fields#testForFields_weekBased_YWD IllegalArgumentException

Tests run: 4157, Failures: 5, Errors: 153, Skipped: 0

[INFO] ------------------------------------------------------------------------
[INFO] BUILD FAILURE
[INFO] ------------------------------------------------------------------------
[INFO] Total time: 15.532s
[INFO] Finished at: Wed Aug 05 18:20:12 BST 2015
[INFO] Final Memory: 9M/213M
[INFO] ------------------------------------------------------------------------
[ERROR] Failed to execute goal org.apache.maven.plugins:maven-surefire-plugin:2.18.1:test (default-test) on project joda-time: There are test failures.
[ERROR] 
[ERROR] Please refer to /home/perham/Study/LittleDarwin/Cases/joda-time-2.8.1/target/surefire-reports for the individual test results.
[ERROR] -> [Help 1]
[ERROR] 
[ERROR] To see the full stack trace of the errors, re-run Maven with the -e switch.
[ERROR] Re-run Maven using the -X switch to enable full debug logging.
[ERROR] 
[ERROR] For more information about the errors and possible solutions, please read the following articles:
[ERROR] [Help 1] http://cwiki.apache.org/confluence/display/MAVEN/MojoFailureException
