[INFO] Scanning for projects...
[INFO]                                                                         
[INFO] ------------------------------------------------------------------------
[INFO] Building Joda-Time 2.8.1
[INFO] ------------------------------------------------------------------------
[INFO] 
[INFO] --- maven-resources-plugin:2.7:resources (default-resources) @ joda-time ---
[INFO] Using 'UTF-8' encoding to copy filtered resources.
[INFO] Copying 2 resources to META-INF
[INFO] Copying 10 resources
[INFO] 
[INFO] --- maven-compiler-plugin:3.3:compile (default-compile) @ joda-time ---
[INFO] Changes detected - recompiling the module!
[INFO] Compiling 166 source files to /home/perham/Study/LittleDarwin/Cases/joda-time-2.8.1/target/classes
[INFO] 
[INFO] --- exec-maven-plugin:1.4.0:java (compile-tzdb) @ joda-time ---
Writing zoneinfo files
Writing ZoneInfoMap
[INFO] 
[INFO] --- maven-resources-plugin:2.7:testResources (default-testResources) @ joda-time ---
[INFO] Using 'UTF-8' encoding to copy filtered resources.
[INFO] Copying 34 resources
[INFO] 
[INFO] --- maven-compiler-plugin:3.3:testCompile (default-testCompile) @ joda-time ---
[INFO] Nothing to compile - all classes are up to date
[INFO] 
[INFO] --- maven-surefire-plugin:2.18.1:test (default-test) @ joda-time ---
[INFO] Surefire report directory: /home/perham/Study/LittleDarwin/Cases/joda-time-2.8.1/target/surefire-reports

-------------------------------------------------------
 T E S T S
-------------------------------------------------------
Running org.joda.time.TestAllPackages

TestBuddhistChronology.testCalendar

TestCopticChronology.testCalendar

TestEthiopicChronology.testCalendar

TestIslamicChronology.testCalendar

Testing Gregorian chronology over 1000 iterations
100% complete (i=1000)

Testing Julian chronology over 1000 iterations
100% complete (i=1000)
Writing zoneinfo files
Writing ZoneInfoMap
Tests run: 4157, Failures: 2, Errors: 7, Skipped: 0, Time elapsed: 5.197 sec <<< FAILURE! - in org.joda.time.TestAllPackages
testFactoryFieldDifference5(org.joda.time.TestPeriod_Constructors)  Time elapsed: 0.004 sec  <<< ERROR!
java.lang.IllegalArgumentException: Types array must be in order largest-smallest: dayOfMonth < dayOfWeek
	at org.joda.time.Partial.<init>(Partial.java:63)
	at org.joda.time.Partial.<init>(Partial.java:38)
	at org.joda.time.TestPeriod_Constructors.testFactoryFieldDifference5(TestPeriod_Constructors.java:1554)

testWith3b(org.joda.time.TestPartial_Basics)  Time elapsed: 0.001 sec  <<< ERROR!
java.lang.IllegalArgumentException: Types array must be in order largest-smallest: minuteOfDay < minuteOfHour
	at org.joda.time.Partial.<init>(Partial.java:63)
	at org.joda.time.Partial.with(Partial.java:126)
	at org.joda.time.TestPartial_Basics.testWith3b(TestPartial_Basics.java:387)

testGetFormatter3(org.joda.time.TestPartial_Basics)  Time elapsed: 0.001 sec  <<< ERROR!
java.lang.IllegalArgumentException: Types array must be in order largest-smallest: dayOfMonth < dayOfWeek
	at org.joda.time.Partial.<init>(Partial.java:63)
	at org.joda.time.Partial.with(Partial.java:126)
	at org.joda.time.TestPartial_Basics.testGetFormatter3(TestPartial_Basics.java:829)

testToString4(org.joda.time.TestPartial_Basics)  Time elapsed: 0.001 sec  <<< ERROR!
java.lang.IllegalArgumentException: Types array must be in order largest-smallest: dayOfMonth < dayOfWeek
	at org.joda.time.Partial.<init>(Partial.java:63)
	at org.joda.time.Partial.with(Partial.java:126)
	at org.joda.time.TestPartial_Basics.testToString4(TestPartial_Basics.java:862)

testConstructorEx7_TypeArray_intArray_inOrder(org.joda.time.TestPartial_Constructors)  Time elapsed: 0.001 sec  <<< ERROR!
java.lang.NullPointerException
	at org.joda.time.Partial.<init>(Partial.java:65)
	at org.joda.time.Partial.<init>(Partial.java:38)
	at org.joda.time.TestPartial_Constructors.testConstructorEx7_TypeArray_intArray_inOrder(TestPartial_Constructors.java:332)

testConstructorEx8_TypeArray_intArray_duplicate(org.joda.time.TestPartial_Constructors)  Time elapsed: 0.001 sec  <<< FAILURE!
junit.framework.AssertionFailedError: Types array must be in order largest-smallest: dayOfYear < dayOfMonth: must not/duplicate expected:<true> but was:<false>
	at junit.framework.Assert.fail(Assert.java:47)
	at junit.framework.Assert.failNotEquals(Assert.java:280)
	at junit.framework.Assert.assertEquals(Assert.java:64)
	at junit.framework.Assert.assertEquals(Assert.java:146)
	at org.joda.time.TestPartial_Constructors.assertMessageContains(TestPartial_Constructors.java:489)
	at org.joda.time.TestPartial_Constructors.testConstructorEx8_TypeArray_intArray_duplicate(TestPartial_Constructors.java:386)

testConstructorEx9_TypeArray_intArray(org.joda.time.TestPartial_Constructors)  Time elapsed: 0.001 sec  <<< FAILURE!
junit.framework.AssertionFailedError: Types array must be in order largest-smallest: dayOfMonth < dayOfWeek: Value 0 expected:<true> but was:<false>
	at junit.framework.Assert.fail(Assert.java:47)
	at junit.framework.Assert.failNotEquals(Assert.java:280)
	at junit.framework.Assert.assertEquals(Assert.java:64)
	at junit.framework.Assert.assertEquals(Assert.java:146)
	at org.joda.time.TestPartial_Constructors.assertMessageContains(TestPartial_Constructors.java:478)
	at org.joda.time.TestPartial_Constructors.testConstructorEx9_TypeArray_intArray(TestPartial_Constructors.java:410)

testIsContiguous_RP(org.joda.time.TestDateTimeUtils)  Time elapsed: 0.001 sec  <<< ERROR!
java.lang.IllegalArgumentException: Types array must be in order largest-smallest: dayOfMonth < dayOfWeek
	at org.joda.time.Partial.<init>(Partial.java:63)
	at org.joda.time.Partial.with(Partial.java:126)
	at org.joda.time.TestDateTimeUtils.testIsContiguous_RP(TestDateTimeUtils.java:440)

testIsContiguous_RP_GJChronology(org.joda.time.TestDateTimeUtils)  Time elapsed: 0.001 sec  <<< ERROR!
java.lang.IllegalArgumentException: Types array must be in order largest-smallest: dayOfMonth < dayOfWeek
	at org.joda.time.Partial.<init>(Partial.java:63)
	at org.joda.time.Partial.with(Partial.java:126)
	at org.joda.time.TestDateTimeUtils.testIsContiguous_RP_GJChronology(TestDateTimeUtils.java:464)


Results :

Failed tests: 
  org.joda.time.TestPartial_Constructors#testConstructorEx8_TypeArray_intArray_duplicate AssertionFailedError
  org.joda.time.TestPartial_Constructors#testConstructorEx9_TypeArray_intArray AssertionFailedError
Tests in error: 
  org.joda.time.TestDateTimeUtils#testIsContiguous_RP IllegalArgumentException T...
  org.joda.time.TestDateTimeUtils#testIsContiguous_RP_GJChronology IllegalArgumentException
  org.joda.time.TestPartial_Basics#testGetFormatter3 IllegalArgumentException Ty...
  org.joda.time.TestPartial_Basics#testToString4 IllegalArgumentException Types ...
  org.joda.time.TestPartial_Basics#testWith3b IllegalArgumentException Types arr...
  org.joda.time.TestPartial_Constructors#testConstructorEx7_TypeArray_intArray_inOrder NullPointerException
  org.joda.time.TestPeriod_Constructors#testFactoryFieldDifference5 IllegalArgumentException

Tests run: 4157, Failures: 2, Errors: 7, Skipped: 0

[INFO] ------------------------------------------------------------------------
[INFO] BUILD FAILURE
[INFO] ------------------------------------------------------------------------
[INFO] Total time: 14.944s
[INFO] Finished at: Wed Aug 05 18:16:43 BST 2015
[INFO] Final Memory: 9M/213M
[INFO] ------------------------------------------------------------------------
[ERROR] Failed to execute goal org.apache.maven.plugins:maven-surefire-plugin:2.18.1:test (default-test) on project joda-time: There are test failures.
[ERROR] 
[ERROR] Please refer to /home/perham/Study/LittleDarwin/Cases/joda-time-2.8.1/target/surefire-reports for the individual test results.
[ERROR] -> [Help 1]
[ERROR] 
[ERROR] To see the full stack trace of the errors, re-run Maven with the -e switch.
[ERROR] Re-run Maven using the -X switch to enable full debug logging.
[ERROR] 
[ERROR] For more information about the errors and possible solutions, please read the following articles:
[ERROR] [Help 1] http://cwiki.apache.org/confluence/display/MAVEN/MojoFailureException
