[INFO] Scanning for projects...
[INFO]                                                                         
[INFO] ------------------------------------------------------------------------
[INFO] Building Joda-Time 2.8.1
[INFO] ------------------------------------------------------------------------
[INFO] 
[INFO] --- maven-resources-plugin:2.7:resources (default-resources) @ joda-time ---
[INFO] Using 'UTF-8' encoding to copy filtered resources.
[INFO] Copying 2 resources to META-INF
[INFO] Copying 10 resources
[INFO] 
[INFO] --- maven-compiler-plugin:3.3:compile (default-compile) @ joda-time ---
[INFO] Changes detected - recompiling the module!
[INFO] Compiling 166 source files to /home/perham/Study/LittleDarwin/Cases/joda-time-2.8.1/target/classes
[INFO] 
[INFO] --- exec-maven-plugin:1.4.0:java (compile-tzdb) @ joda-time ---
Writing zoneinfo files
Writing ZoneInfoMap
[INFO] 
[INFO] --- maven-resources-plugin:2.7:testResources (default-testResources) @ joda-time ---
[INFO] Using 'UTF-8' encoding to copy filtered resources.
[INFO] Copying 34 resources
[INFO] 
[INFO] --- maven-compiler-plugin:3.3:testCompile (default-testCompile) @ joda-time ---
[INFO] Nothing to compile - all classes are up to date
[INFO] 
[INFO] --- maven-surefire-plugin:2.18.1:test (default-test) @ joda-time ---
[INFO] Surefire report directory: /home/perham/Study/LittleDarwin/Cases/joda-time-2.8.1/target/surefire-reports

-------------------------------------------------------
 T E S T S
-------------------------------------------------------
Running org.joda.time.TestAllPackages

TestBuddhistChronology.testCalendar

TestCopticChronology.testCalendar

TestEthiopicChronology.testCalendar

TestIslamicChronology.testCalendar

Testing Gregorian chronology over 1000 iterations
100% complete (i=1000)

Testing Julian chronology over 1000 iterations
100% complete (i=1000)
Writing zoneinfo files
Writing ZoneInfoMap
Tests run: 4157, Failures: 0, Errors: 44, Skipped: 0, Time elapsed: 5.348 sec <<< FAILURE! - in org.joda.time.TestAllPackages
testWithField1(org.joda.time.TestPartial_Basics)  Time elapsed: 0.005 sec  <<< ERROR!
java.lang.NullPointerException
	at org.joda.time.Partial.getFormatter(Partial.java:190)
	at org.joda.time.Partial.toString(Partial.java:192)
	at org.joda.time.TestPartial_Basics.check(TestPartial_Basics.java:927)
	at org.joda.time.TestPartial_Basics.testWithField1(TestPartial_Basics.java:521)

testWithField2(org.joda.time.TestPartial_Basics)  Time elapsed: 0.001 sec  <<< ERROR!
java.lang.NullPointerException
	at org.joda.time.Partial.getFormatter(Partial.java:190)
	at org.joda.time.Partial.toString(Partial.java:192)
	at org.joda.time.TestPartial_Basics.check(TestPartial_Basics.java:927)
	at org.joda.time.TestPartial_Basics.testWithField2(TestPartial_Basics.java:531)

testWithFieldAdded1(org.joda.time.TestPartial_Basics)  Time elapsed: 0.001 sec  <<< ERROR!
java.lang.NullPointerException
	at org.joda.time.Partial.getFormatter(Partial.java:190)
	at org.joda.time.Partial.toString(Partial.java:192)
	at org.joda.time.TestPartial_Basics.check(TestPartial_Basics.java:927)
	at org.joda.time.TestPartial_Basics.testWithFieldAdded1(TestPartial_Basics.java:555)

testWithFieldAdded2(org.joda.time.TestPartial_Basics)  Time elapsed: 0.001 sec  <<< ERROR!
java.lang.NullPointerException
	at org.joda.time.Partial.getFormatter(Partial.java:190)
	at org.joda.time.Partial.toString(Partial.java:192)
	at org.joda.time.TestPartial_Basics.check(TestPartial_Basics.java:927)
	at org.joda.time.TestPartial_Basics.testWithFieldAdded2(TestPartial_Basics.java:565)

testWithFieldAdded3(org.joda.time.TestPartial_Basics)  Time elapsed: 0.001 sec  <<< ERROR!
java.lang.NullPointerException
	at org.joda.time.Partial.getFormatter(Partial.java:190)
	at org.joda.time.Partial.toString(Partial.java:192)
	at org.joda.time.TestPartial_Basics.check(TestPartial_Basics.java:927)
	at org.joda.time.TestPartial_Basics.testWithFieldAdded3(TestPartial_Basics.java:574)

testPlus_RP(org.joda.time.TestPartial_Basics)  Time elapsed: 0.001 sec  <<< ERROR!
java.lang.NullPointerException
	at org.joda.time.Partial.getFormatter(Partial.java:190)
	at org.joda.time.Partial.toString(Partial.java:192)
	at org.joda.time.TestPartial_Basics.check(TestPartial_Basics.java:927)
	at org.joda.time.TestPartial_Basics.testPlus_RP(TestPartial_Basics.java:723)

testToString_String(org.joda.time.TestPartial_Basics)  Time elapsed: 0.001 sec  <<< ERROR!
java.lang.NullPointerException
	at org.joda.time.Partial.getFormatter(Partial.java:190)
	at org.joda.time.Partial.toString(Partial.java:192)
	at org.joda.time.Partial.toString(Partial.java:209)
	at org.joda.time.TestPartial_Basics.testToString_String(TestPartial_Basics.java:878)

testToString_String_Locale(org.joda.time.TestPartial_Basics)  Time elapsed: 0.001 sec  <<< ERROR!
java.lang.NullPointerException
	at org.joda.time.Partial.getFormatter(Partial.java:190)
	at org.joda.time.Partial.toString(Partial.java:192)
	at org.joda.time.Partial.toString(Partial.java:211)
	at org.joda.time.TestPartial_Basics.testToString_String_Locale(TestPartial_Basics.java:885)

testToString_DTFormatter(org.joda.time.TestPartial_Basics)  Time elapsed: 0.002 sec  <<< ERROR!
java.lang.NullPointerException
	at org.joda.time.Partial.getFormatter(Partial.java:190)
	at org.joda.time.Partial.toString(Partial.java:192)
	at org.joda.time.base.AbstractPartial.toString(AbstractPartial.java:410)
	at org.joda.time.TestPartial_Basics.testToString_DTFormatter(TestPartial_Basics.java:894)

testMinus_RP(org.joda.time.TestPartial_Basics)  Time elapsed: 0.001 sec  <<< ERROR!
java.lang.NullPointerException
	at org.joda.time.Partial.getFormatter(Partial.java:190)
	at org.joda.time.Partial.toString(Partial.java:192)
	at org.joda.time.TestPartial_Basics.check(TestPartial_Basics.java:927)
	at org.joda.time.TestPartial_Basics.testMinus_RP(TestPartial_Basics.java:734)

testToDateTime_RI(org.joda.time.TestPartial_Basics)  Time elapsed: 0 sec  <<< ERROR!
java.lang.NullPointerException
	at org.joda.time.Partial.getFormatter(Partial.java:190)
	at org.joda.time.Partial.toString(Partial.java:192)
	at org.joda.time.TestPartial_Basics.check(TestPartial_Basics.java:927)
	at org.joda.time.TestPartial_Basics.testToDateTime_RI(TestPartial_Basics.java:748)

testToDateTime_nullRI(org.joda.time.TestPartial_Basics)  Time elapsed: 0.001 sec  <<< ERROR!
java.lang.NullPointerException
	at org.joda.time.Partial.getFormatter(Partial.java:190)
	at org.joda.time.Partial.toString(Partial.java:192)
	at org.joda.time.TestPartial_Basics.check(TestPartial_Basics.java:927)
	at org.joda.time.TestPartial_Basics.testToDateTime_nullRI(TestPartial_Basics.java:758)

testWithout1(org.joda.time.TestPartial_Basics)  Time elapsed: 0.001 sec  <<< ERROR!
java.lang.NullPointerException
	at org.joda.time.Partial.getFormatter(Partial.java:190)
	at org.joda.time.Partial.toString(Partial.java:192)
	at org.joda.time.TestPartial_Basics.check(TestPartial_Basics.java:927)
	at org.joda.time.TestPartial_Basics.testWithout1(TestPartial_Basics.java:479)

testWithout2(org.joda.time.TestPartial_Basics)  Time elapsed: 0 sec  <<< ERROR!
java.lang.NullPointerException
	at org.joda.time.Partial.getFormatter(Partial.java:190)
	at org.joda.time.Partial.toString(Partial.java:192)
	at org.joda.time.TestPartial_Basics.check(TestPartial_Basics.java:927)
	at org.joda.time.TestPartial_Basics.testWithout2(TestPartial_Basics.java:486)

testWithout3(org.joda.time.TestPartial_Basics)  Time elapsed: 0.001 sec  <<< ERROR!
java.lang.NullPointerException
	at org.joda.time.Partial.getFormatter(Partial.java:190)
	at org.joda.time.Partial.toString(Partial.java:192)
	at org.joda.time.TestPartial_Basics.check(TestPartial_Basics.java:927)
	at org.joda.time.TestPartial_Basics.testWithout3(TestPartial_Basics.java:493)

testWithout4(org.joda.time.TestPartial_Basics)  Time elapsed: 0 sec  <<< ERROR!
java.lang.NullPointerException
	at org.joda.time.Partial.getFormatter(Partial.java:190)
	at org.joda.time.Partial.toString(Partial.java:192)
	at org.joda.time.TestPartial_Basics.check(TestPartial_Basics.java:927)
	at org.joda.time.TestPartial_Basics.testWithout4(TestPartial_Basics.java:503)

testWithFieldAddWrapped1(org.joda.time.TestPartial_Basics)  Time elapsed: 0 sec  <<< ERROR!
java.lang.NullPointerException
	at org.joda.time.Partial.getFormatter(Partial.java:190)
	at org.joda.time.Partial.toString(Partial.java:192)
	at org.joda.time.TestPartial_Basics.check(TestPartial_Basics.java:927)
	at org.joda.time.TestPartial_Basics.testWithFieldAddWrapped1(TestPartial_Basics.java:649)

testWithFieldAddWrapped2(org.joda.time.TestPartial_Basics)  Time elapsed: 0.001 sec  <<< ERROR!
java.lang.NullPointerException
	at org.joda.time.Partial.getFormatter(Partial.java:190)
	at org.joda.time.Partial.toString(Partial.java:192)
	at org.joda.time.TestPartial_Basics.check(TestPartial_Basics.java:927)
	at org.joda.time.TestPartial_Basics.testWithFieldAddWrapped2(TestPartial_Basics.java:659)

testWithFieldAddWrapped3(org.joda.time.TestPartial_Basics)  Time elapsed: 0 sec  <<< ERROR!
java.lang.NullPointerException
	at org.joda.time.Partial.getFormatter(Partial.java:190)
	at org.joda.time.Partial.toString(Partial.java:192)
	at org.joda.time.TestPartial_Basics.check(TestPartial_Basics.java:927)
	at org.joda.time.TestPartial_Basics.testWithFieldAddWrapped3(TestPartial_Basics.java:668)

testWithFieldAddWrapped5(org.joda.time.TestPartial_Basics)  Time elapsed: 0.001 sec  <<< ERROR!
java.lang.NullPointerException
	at org.joda.time.Partial.getFormatter(Partial.java:190)
	at org.joda.time.Partial.toString(Partial.java:192)
	at org.joda.time.TestPartial_Basics.check(TestPartial_Basics.java:927)
	at org.joda.time.TestPartial_Basics.testWithFieldAddWrapped5(TestPartial_Basics.java:683)

testWithFieldAddWrapped6(org.joda.time.TestPartial_Basics)  Time elapsed: 0 sec  <<< ERROR!
java.lang.NullPointerException
	at org.joda.time.Partial.getFormatter(Partial.java:190)
	at org.joda.time.Partial.toString(Partial.java:192)
	at org.joda.time.TestPartial_Basics.check(TestPartial_Basics.java:927)
	at org.joda.time.TestPartial_Basics.testWithFieldAddWrapped6(TestPartial_Basics.java:691)

testWithFieldAddWrapped7(org.joda.time.TestPartial_Basics)  Time elapsed: 0.001 sec  <<< ERROR!
java.lang.NullPointerException
	at org.joda.time.Partial.getFormatter(Partial.java:190)
	at org.joda.time.Partial.toString(Partial.java:192)
	at org.joda.time.TestPartial_Basics.check(TestPartial_Basics.java:927)
	at org.joda.time.TestPartial_Basics.testWithFieldAddWrapped7(TestPartial_Basics.java:698)

testWithFieldAddWrapped8(org.joda.time.TestPartial_Basics)  Time elapsed: 0 sec  <<< ERROR!
java.lang.NullPointerException
	at org.joda.time.Partial.getFormatter(Partial.java:190)
	at org.joda.time.Partial.toString(Partial.java:192)
	at org.joda.time.TestPartial_Basics.check(TestPartial_Basics.java:927)
	at org.joda.time.TestPartial_Basics.testWithFieldAddWrapped8(TestPartial_Basics.java:710)

testGetFormatter1(org.joda.time.TestPartial_Basics)  Time elapsed: 0.001 sec  <<< ERROR!
java.lang.NullPointerException
	at org.joda.time.Partial.getFormatter(Partial.java:190)
	at org.joda.time.TestPartial_Basics.testGetFormatter1(TestPartial_Basics.java:801)

testWith1(org.joda.time.TestPartial_Basics)  Time elapsed: 0 sec  <<< ERROR!
java.lang.NullPointerException
	at org.joda.time.Partial.getFormatter(Partial.java:190)
	at org.joda.time.Partial.toString(Partial.java:192)
	at org.joda.time.TestPartial_Basics.check(TestPartial_Basics.java:927)
	at org.joda.time.TestPartial_Basics.testWith1(TestPartial_Basics.java:347)

testWith2(org.joda.time.TestPartial_Basics)  Time elapsed: 0 sec  <<< ERROR!
java.lang.NullPointerException
	at org.joda.time.Partial.getFormatter(Partial.java:190)
	at org.joda.time.Partial.toString(Partial.java:192)
	at org.joda.time.TestPartial_Basics.check(TestPartial_Basics.java:927)
	at org.joda.time.TestPartial_Basics.testWith2(TestPartial_Basics.java:357)

testWith3(org.joda.time.TestPartial_Basics)  Time elapsed: 0 sec  <<< ERROR!
java.lang.NullPointerException
	at org.joda.time.Partial.getFormatter(Partial.java:190)
	at org.joda.time.Partial.toString(Partial.java:192)
	at org.joda.time.TestPartial_Basics.check(TestPartial_Basics.java:927)
	at org.joda.time.TestPartial_Basics.testWith3(TestPartial_Basics.java:366)

testWith3a(org.joda.time.TestPartial_Basics)  Time elapsed: 0 sec  <<< ERROR!
java.lang.NullPointerException
	at org.joda.time.Partial.getFormatter(Partial.java:190)
	at org.joda.time.Partial.toString(Partial.java:192)
	at org.joda.time.TestPartial_Basics.check(TestPartial_Basics.java:927)
	at org.joda.time.TestPartial_Basics.testWith3a(TestPartial_Basics.java:372)

testWith3b(org.joda.time.TestPartial_Basics)  Time elapsed: 0.001 sec  <<< ERROR!
java.lang.NullPointerException
	at org.joda.time.Partial.getFormatter(Partial.java:190)
	at org.joda.time.Partial.toString(Partial.java:192)
	at org.joda.time.TestPartial_Basics.check(TestPartial_Basics.java:927)
	at org.joda.time.TestPartial_Basics.testWith3b(TestPartial_Basics.java:388)

testWith3c(org.joda.time.TestPartial_Basics)  Time elapsed: 0 sec  <<< ERROR!
java.lang.NullPointerException
	at org.joda.time.Partial.getFormatter(Partial.java:190)
	at org.joda.time.Partial.toString(Partial.java:192)
	at org.joda.time.TestPartial_Basics.check(TestPartial_Basics.java:927)
	at org.joda.time.TestPartial_Basics.testWith3c(TestPartial_Basics.java:404)

testGetFormatter2(org.joda.time.TestPartial_Basics)  Time elapsed: 0 sec  <<< ERROR!
java.lang.NullPointerException
	at org.joda.time.Partial.getFormatter(Partial.java:190)
	at org.joda.time.TestPartial_Basics.testGetFormatter2(TestPartial_Basics.java:815)

testGetFormatter3(org.joda.time.TestPartial_Basics)  Time elapsed: 0 sec  <<< ERROR!
java.lang.NullPointerException
	at org.joda.time.Partial.getFormatter(Partial.java:190)
	at org.joda.time.TestPartial_Basics.testGetFormatter3(TestPartial_Basics.java:826)

testToString1(org.joda.time.TestPartial_Basics)  Time elapsed: 0.001 sec  <<< ERROR!
java.lang.NullPointerException
	at org.joda.time.Partial.getFormatter(Partial.java:190)
	at org.joda.time.Partial.toString(Partial.java:192)
	at org.joda.time.TestPartial_Basics.testToString1(TestPartial_Basics.java:836)

testToString2(org.joda.time.TestPartial_Basics)  Time elapsed: 0 sec  <<< ERROR!
java.lang.NullPointerException
	at org.joda.time.Partial.getFormatter(Partial.java:190)
	at org.joda.time.Partial.toString(Partial.java:192)
	at org.joda.time.TestPartial_Basics.testToString2(TestPartial_Basics.java:841)

testToString3(org.joda.time.TestPartial_Basics)  Time elapsed: 0.001 sec  <<< ERROR!
java.lang.NullPointerException
	at org.joda.time.Partial.getFormatter(Partial.java:190)
	at org.joda.time.Partial.toString(Partial.java:192)
	at org.joda.time.TestPartial_Basics.testToString3(TestPartial_Basics.java:846)

testToString4(org.joda.time.TestPartial_Basics)  Time elapsed: 0 sec  <<< ERROR!
java.lang.NullPointerException
	at org.joda.time.Partial.getFormatter(Partial.java:190)
	at org.joda.time.Partial.toString(Partial.java:192)
	at org.joda.time.TestPartial_Basics.testToString4(TestPartial_Basics.java:860)

testToString5(org.joda.time.TestPartial_Basics)  Time elapsed: 0 sec  <<< ERROR!
java.lang.NullPointerException
	at org.joda.time.Partial.getFormatter(Partial.java:190)
	at org.joda.time.Partial.toString(Partial.java:192)
	at org.joda.time.TestPartial_Basics.testToString5(TestPartial_Basics.java:868)

testWithField3(org.joda.time.TestPartial_Basics)  Time elapsed: 0 sec  <<< ERROR!
java.lang.NullPointerException
	at org.joda.time.Partial.getFormatter(Partial.java:190)
	at org.joda.time.Partial.toString(Partial.java:192)
	at org.joda.time.TestPartial_Basics.check(TestPartial_Basics.java:927)
	at org.joda.time.TestPartial_Basics.testWithField3(TestPartial_Basics.java:540)

testWithChronologyRetainFields_Chrono(org.joda.time.TestPartial_Basics)  Time elapsed: 0 sec  <<< ERROR!
java.lang.NullPointerException
	at org.joda.time.Partial.getFormatter(Partial.java:190)
	at org.joda.time.Partial.toString(Partial.java:192)
	at org.joda.time.TestPartial_Basics.check(TestPartial_Basics.java:927)
	at org.joda.time.TestPartial_Basics.testWithChronologyRetainFields_Chrono(TestPartial_Basics.java:322)

testWithChronologyRetainFields_nullChrono(org.joda.time.TestPartial_Basics)  Time elapsed: 0.001 sec  <<< ERROR!
java.lang.NullPointerException
	at org.joda.time.Partial.getFormatter(Partial.java:190)
	at org.joda.time.Partial.toString(Partial.java:192)
	at org.joda.time.TestPartial_Basics.check(TestPartial_Basics.java:927)
	at org.joda.time.TestPartial_Basics.testWithChronologyRetainFields_nullChrono(TestPartial_Basics.java:337)

testWithFieldAdded5(org.joda.time.TestPartial_Basics)  Time elapsed: 0.001 sec  <<< ERROR!
java.lang.NullPointerException
	at org.joda.time.Partial.getFormatter(Partial.java:190)
	at org.joda.time.Partial.toString(Partial.java:192)
	at org.joda.time.TestPartial_Basics.check(TestPartial_Basics.java:927)
	at org.joda.time.TestPartial_Basics.testWithFieldAdded5(TestPartial_Basics.java:589)

testWithFieldAdded6(org.joda.time.TestPartial_Basics)  Time elapsed: 0 sec  <<< ERROR!
java.lang.NullPointerException
	at org.joda.time.Partial.getFormatter(Partial.java:190)
	at org.joda.time.Partial.toString(Partial.java:192)
	at org.joda.time.TestPartial_Basics.check(TestPartial_Basics.java:927)
	at org.joda.time.TestPartial_Basics.testWithFieldAdded6(TestPartial_Basics.java:600)

testWithFieldAdded7(org.joda.time.TestPartial_Basics)  Time elapsed: 0 sec  <<< ERROR!
java.lang.NullPointerException
	at org.joda.time.Partial.getFormatter(Partial.java:190)
	at org.joda.time.Partial.toString(Partial.java:192)
	at org.joda.time.TestPartial_Basics.check(TestPartial_Basics.java:927)
	at org.joda.time.TestPartial_Basics.testWithFieldAdded7(TestPartial_Basics.java:611)

testWithFieldAdded8(org.joda.time.TestPartial_Basics)  Time elapsed: 0.001 sec  <<< ERROR!
java.lang.NullPointerException
	at org.joda.time.Partial.getFormatter(Partial.java:190)
	at org.joda.time.Partial.toString(Partial.java:192)
	at org.joda.time.TestPartial_Basics.check(TestPartial_Basics.java:927)
	at org.joda.time.TestPartial_Basics.testWithFieldAdded8(TestPartial_Basics.java:631)


Results :

Tests in error: 
  org.joda.time.TestPartial_Basics#testGetFormatter1 NullPointerException
  org.joda.time.TestPartial_Basics#testGetFormatter2 NullPointerException
  org.joda.time.TestPartial_Basics#testGetFormatter3 NullPointerException
  org.joda.time.TestPartial_Basics#testMinus_RP NullPointerException
  org.joda.time.TestPartial_Basics#testPlus_RP NullPointerException
  org.joda.time.TestPartial_Basics#testToDateTime_RI NullPointerException
  org.joda.time.TestPartial_Basics#testToDateTime_nullRI NullPointerException
  org.joda.time.TestPartial_Basics#testToString1 NullPointerException
  org.joda.time.TestPartial_Basics#testToString2 NullPointerException
  org.joda.time.TestPartial_Basics#testToString3 NullPointerException
  org.joda.time.TestPartial_Basics#testToString4 NullPointerException
  org.joda.time.TestPartial_Basics#testToString5 NullPointerException
  org.joda.time.TestPartial_Basics#testToString_DTFormatter NullPointerException
  org.joda.time.TestPartial_Basics#testToString_String NullPointerException
  org.joda.time.TestPartial_Basics#testToString_String_Locale NullPointerException
  org.joda.time.TestPartial_Basics#testWith1 NullPointerException
  org.joda.time.TestPartial_Basics#testWith2 NullPointerException
  org.joda.time.TestPartial_Basics#testWith3 NullPointerException
  org.joda.time.TestPartial_Basics#testWith3a NullPointerException
  org.joda.time.TestPartial_Basics#testWith3b NullPointerException
  org.joda.time.TestPartial_Basics#testWith3c NullPointerException
  org.joda.time.TestPartial_Basics#testWithChronologyRetainFields_Chrono NullPointerException
  org.joda.time.TestPartial_Basics#testWithChronologyRetainFields_nullChrono NullPointerException
  org.joda.time.TestPartial_Basics#testWithField1 NullPointerException
  org.joda.time.TestPartial_Basics#testWithField2 NullPointerException
  org.joda.time.TestPartial_Basics#testWithField3 NullPointerException
  org.joda.time.TestPartial_Basics#testWithFieldAddWrapped1 NullPointerException
  org.joda.time.TestPartial_Basics#testWithFieldAddWrapped2 NullPointerException
  org.joda.time.TestPartial_Basics#testWithFieldAddWrapped3 NullPointerException
  org.joda.time.TestPartial_Basics#testWithFieldAddWrapped5 NullPointerException
  org.joda.time.TestPartial_Basics#testWithFieldAddWrapped6 NullPointerException
  org.joda.time.TestPartial_Basics#testWithFieldAddWrapped7 NullPointerException
  org.joda.time.TestPartial_Basics#testWithFieldAddWrapped8 NullPointerException
  org.joda.time.TestPartial_Basics#testWithFieldAdded1 NullPointerException
  org.joda.time.TestPartial_Basics#testWithFieldAdded2 NullPointerException
  org.joda.time.TestPartial_Basics#testWithFieldAdded3 NullPointerException
  org.joda.time.TestPartial_Basics#testWithFieldAdded5 NullPointerException
  org.joda.time.TestPartial_Basics#testWithFieldAdded6 NullPointerException
  org.joda.time.TestPartial_Basics#testWithFieldAdded7 NullPointerException
  org.joda.time.TestPartial_Basics#testWithFieldAdded8 NullPointerException
  org.joda.time.TestPartial_Basics#testWithout1 NullPointerException
  org.joda.time.TestPartial_Basics#testWithout2 NullPointerException
  org.joda.time.TestPartial_Basics#testWithout3 NullPointerException
  org.joda.time.TestPartial_Basics#testWithout4 NullPointerException

Tests run: 4157, Failures: 0, Errors: 44, Skipped: 0

[INFO] ------------------------------------------------------------------------
[INFO] BUILD FAILURE
[INFO] ------------------------------------------------------------------------
[INFO] Total time: 16.002s
[INFO] Finished at: Wed Aug 05 18:08:20 BST 2015
[INFO] Final Memory: 9M/213M
[INFO] ------------------------------------------------------------------------
[ERROR] Failed to execute goal org.apache.maven.plugins:maven-surefire-plugin:2.18.1:test (default-test) on project joda-time: There are test failures.
[ERROR] 
[ERROR] Please refer to /home/perham/Study/LittleDarwin/Cases/joda-time-2.8.1/target/surefire-reports for the individual test results.
[ERROR] -> [Help 1]
[ERROR] 
[ERROR] To see the full stack trace of the errors, re-run Maven with the -e switch.
[ERROR] Re-run Maven using the -X switch to enable full debug logging.
[ERROR] 
[ERROR] For more information about the errors and possible solutions, please read the following articles:
[ERROR] [Help 1] http://cwiki.apache.org/confluence/display/MAVEN/MojoFailureException
