[INFO] Scanning for projects...
[INFO]                                                                         
[INFO] ------------------------------------------------------------------------
[INFO] Building Joda-Time 2.8.1
[INFO] ------------------------------------------------------------------------
[INFO] 
[INFO] --- maven-resources-plugin:2.7:resources (default-resources) @ joda-time ---
[INFO] Using 'UTF-8' encoding to copy filtered resources.
[INFO] Copying 2 resources to META-INF
[INFO] Copying 10 resources
[INFO] 
[INFO] --- maven-compiler-plugin:3.3:compile (default-compile) @ joda-time ---
[INFO] Changes detected - recompiling the module!
[INFO] Compiling 166 source files to /home/perham/Study/LittleDarwin/Cases/joda-time-2.8.1/target/classes
[INFO] 
[INFO] --- exec-maven-plugin:1.4.0:java (compile-tzdb) @ joda-time ---
Writing zoneinfo files
Writing ZoneInfoMap
[INFO] 
[INFO] --- maven-resources-plugin:2.7:testResources (default-testResources) @ joda-time ---
[INFO] Using 'UTF-8' encoding to copy filtered resources.
[INFO] Copying 34 resources
[INFO] 
[INFO] --- maven-compiler-plugin:3.3:testCompile (default-testCompile) @ joda-time ---
[INFO] Nothing to compile - all classes are up to date
[INFO] 
[INFO] --- maven-surefire-plugin:2.18.1:test (default-test) @ joda-time ---
[INFO] Surefire report directory: /home/perham/Study/LittleDarwin/Cases/joda-time-2.8.1/target/surefire-reports

-------------------------------------------------------
 T E S T S
-------------------------------------------------------
Running org.joda.time.TestAllPackages

TestBuddhistChronology.testCalendar

TestCopticChronology.testCalendar

TestEthiopicChronology.testCalendar

TestIslamicChronology.testCalendar

Testing Gregorian chronology over 1000 iterations
100% complete (i=1000)

Testing Julian chronology over 1000 iterations
100% complete (i=1000)
Writing zoneinfo files
Writing ZoneInfoMap
Tests run: 4157, Failures: 2, Errors: 8, Skipped: 0, Time elapsed: 5.235 sec <<< FAILURE! - in org.joda.time.TestAllPackages
testEqualsHashCode(org.joda.time.TestMutableDateTime_Basics)  Time elapsed: 0.003 sec  <<< ERROR!
java.lang.IllegalArgumentException: Illegal rounding mode: 1
	at org.joda.time.MutableDateTime.setRounding(MutableDateTime.java:52)
	at org.joda.time.MutableDateTime.setRounding(MutableDateTime.java:51)
	at org.joda.time.TestMutableDateTime_Basics.testEqualsHashCode(TestMutableDateTime_Basics.java:236)

testRounding1(org.joda.time.TestMutableDateTime_Basics)  Time elapsed: 0 sec  <<< ERROR!
java.lang.IllegalArgumentException: Illegal rounding mode: 1
	at org.joda.time.MutableDateTime.setRounding(MutableDateTime.java:52)
	at org.joda.time.MutableDateTime.setRounding(MutableDateTime.java:51)
	at org.joda.time.TestMutableDateTime_Basics.testRounding1(TestMutableDateTime_Basics.java:630)

testRounding2(org.joda.time.TestMutableDateTime_Basics)  Time elapsed: 0.001 sec  <<< ERROR!
java.lang.IllegalArgumentException: Illegal rounding mode: 2
	at org.joda.time.MutableDateTime.setRounding(MutableDateTime.java:52)
	at org.joda.time.TestMutableDateTime_Basics.testRounding2(TestMutableDateTime_Basics.java:638)

testRounding3(org.joda.time.TestMutableDateTime_Basics)  Time elapsed: 0.001 sec  <<< ERROR!
java.lang.IllegalArgumentException: Illegal rounding mode: 4
	at org.joda.time.MutableDateTime.setRounding(MutableDateTime.java:52)
	at org.joda.time.TestMutableDateTime_Basics.testRounding3(TestMutableDateTime_Basics.java:646)

testRounding4(org.joda.time.TestMutableDateTime_Basics)  Time elapsed: 0.001 sec  <<< ERROR!
java.lang.IllegalArgumentException: Illegal rounding mode: 3
	at org.joda.time.MutableDateTime.setRounding(MutableDateTime.java:52)
	at org.joda.time.TestMutableDateTime_Basics.testRounding4(TestMutableDateTime_Basics.java:658)

testRounding5(org.joda.time.TestMutableDateTime_Basics)  Time elapsed: 0.001 sec  <<< ERROR!
java.lang.IllegalArgumentException: Illegal rounding mode: 5
	at org.joda.time.MutableDateTime.setRounding(MutableDateTime.java:52)
	at org.joda.time.TestMutableDateTime_Basics.testRounding5(TestMutableDateTime_Basics.java:670)

testRounding6(org.joda.time.TestMutableDateTime_Basics)  Time elapsed: 0.001 sec  <<< ERROR!
java.lang.IllegalArgumentException: Illegal rounding mode: 0
	at org.joda.time.MutableDateTime.setRounding(MutableDateTime.java:52)
	at org.joda.time.TestMutableDateTime_Basics.testRounding6(TestMutableDateTime_Basics.java:686)

testRounding7(org.joda.time.TestMutableDateTime_Basics)  Time elapsed: 0.001 sec  <<< FAILURE!
junit.framework.AssertionFailedError
	at junit.framework.Assert.fail(Assert.java:47)
	at junit.framework.Assert.fail(Assert.java:53)
	at org.joda.time.TestMutableDateTime_Basics.testRounding7(TestMutableDateTime_Basics.java:696)

testRounding8(org.joda.time.TestMutableDateTime_Basics)  Time elapsed: 0.001 sec  <<< ERROR!
java.lang.IllegalArgumentException: Illegal rounding mode: 2
	at org.joda.time.MutableDateTime.setRounding(MutableDateTime.java:52)
	at org.joda.time.TestMutableDateTime_Basics.testRounding8(TestMutableDateTime_Basics.java:705)

testMillis(org.joda.time.TestDateTimeComparator)  Time elapsed: 0 sec  <<< FAILURE!
junit.framework.AssertionFailedError: MillisM1 expected:<-1> but was:<1>
	at junit.framework.Assert.fail(Assert.java:47)
	at junit.framework.Assert.failNotEquals(Assert.java:280)
	at junit.framework.Assert.assertEquals(Assert.java:64)
	at junit.framework.Assert.assertEquals(Assert.java:198)
	at org.joda.time.TestDateTimeComparator.testMillis(TestDateTimeComparator.java:426)


Results :

Failed tests: 
  org.joda.time.TestDateTimeComparator#testMillis AssertionFailedError MillisM1 ...
  org.joda.time.TestMutableDateTime_Basics#testRounding7 AssertionFailedError
Tests in error: 
  org.joda.time.TestMutableDateTime_Basics#testEqualsHashCode IllegalArgumentException
  org.joda.time.TestMutableDateTime_Basics#testRounding1 IllegalArgumentException
  org.joda.time.TestMutableDateTime_Basics#testRounding2 IllegalArgumentException
  org.joda.time.TestMutableDateTime_Basics#testRounding3 IllegalArgumentException
  org.joda.time.TestMutableDateTime_Basics#testRounding4 IllegalArgumentException
  org.joda.time.TestMutableDateTime_Basics#testRounding5 IllegalArgumentException
  org.joda.time.TestMutableDateTime_Basics#testRounding6 IllegalArgumentException
  org.joda.time.TestMutableDateTime_Basics#testRounding8 IllegalArgumentException

Tests run: 4157, Failures: 2, Errors: 8, Skipped: 0

[INFO] ------------------------------------------------------------------------
[INFO] BUILD FAILURE
[INFO] ------------------------------------------------------------------------
[INFO] Total time: 15.269s
[INFO] Finished at: Wed Aug 05 17:50:07 BST 2015
[INFO] Final Memory: 9M/214M
[INFO] ------------------------------------------------------------------------
[ERROR] Failed to execute goal org.apache.maven.plugins:maven-surefire-plugin:2.18.1:test (default-test) on project joda-time: There are test failures.
[ERROR] 
[ERROR] Please refer to /home/perham/Study/LittleDarwin/Cases/joda-time-2.8.1/target/surefire-reports for the individual test results.
[ERROR] -> [Help 1]
[ERROR] 
[ERROR] To see the full stack trace of the errors, re-run Maven with the -e switch.
[ERROR] Re-run Maven using the -X switch to enable full debug logging.
[ERROR] 
[ERROR] For more information about the errors and possible solutions, please read the following articles:
[ERROR] [Help 1] http://cwiki.apache.org/confluence/display/MAVEN/MojoFailureException
