[INFO] Scanning for projects...
[INFO]                                                                         
[INFO] ------------------------------------------------------------------------
[INFO] Building Joda-Time 2.8.1
[INFO] ------------------------------------------------------------------------
[INFO] 
[INFO] --- maven-resources-plugin:2.7:resources (default-resources) @ joda-time ---
[INFO] Using 'UTF-8' encoding to copy filtered resources.
[INFO] Copying 2 resources to META-INF
[INFO] Copying 10 resources
[INFO] 
[INFO] --- maven-compiler-plugin:3.3:compile (default-compile) @ joda-time ---
[INFO] Changes detected - recompiling the module!
[INFO] Compiling 166 source files to /home/perham/Study/LittleDarwin/Cases/joda-time-2.8.1/target/classes
[INFO] 
[INFO] --- exec-maven-plugin:1.4.0:java (compile-tzdb) @ joda-time ---
Writing zoneinfo files
Writing ZoneInfoMap
[INFO] 
[INFO] --- maven-resources-plugin:2.7:testResources (default-testResources) @ joda-time ---
[INFO] Using 'UTF-8' encoding to copy filtered resources.
[INFO] Copying 34 resources
[INFO] 
[INFO] --- maven-compiler-plugin:3.3:testCompile (default-testCompile) @ joda-time ---
[INFO] Nothing to compile - all classes are up to date
[INFO] 
[INFO] --- maven-surefire-plugin:2.18.1:test (default-test) @ joda-time ---
[INFO] Surefire report directory: /home/perham/Study/LittleDarwin/Cases/joda-time-2.8.1/target/surefire-reports

-------------------------------------------------------
 T E S T S
-------------------------------------------------------
Running org.joda.time.TestAllPackages

TestBuddhistChronology.testCalendar

TestCopticChronology.testCalendar

TestEthiopicChronology.testCalendar

TestIslamicChronology.testCalendar

Testing Gregorian chronology over 1000 iterations
100% complete (i=1000)

Testing Julian chronology over 1000 iterations
100% complete (i=1000)
Writing zoneinfo files
Writing ZoneInfoMap
Tests run: 4157, Failures: 6, Errors: 9, Skipped: 0, Time elapsed: 5.148 sec <<< FAILURE! - in org.joda.time.TestAllPackages
testConstructor_ObjectLocalTime(org.joda.time.TestLocalTime_Constructors)  Time elapsed: 0.004 sec  <<< ERROR!
java.lang.IllegalArgumentException: Field 'hourOfDay' is not supported
	at org.joda.time.LocalTime.get(LocalTime.java:101)
	at org.joda.time.convert.ReadablePartialConverter.getPartialValues(ReadablePartialConverter.java:91)
	at org.joda.time.convert.AbstractConverter.getPartialValues(AbstractConverter.java:123)
	at org.joda.time.LocalTime.<init>(LocalTime.java:76)
	at org.joda.time.LocalTime.<init>(LocalTime.java:65)
	at org.joda.time.TestLocalTime_Constructors.testConstructor_ObjectLocalTime(TestLocalTime_Constructors.java:462)

testToString(org.joda.time.TestLocalTime_Basics)  Time elapsed: 0.002 sec  <<< FAILURE!
junit.framework.ComparisonFailure: expected:<[10:20:30].040> but was:<[��:��:��].040>
	at junit.framework.Assert.assertEquals(Assert.java:81)
	at junit.framework.Assert.assertEquals(Assert.java:87)
	at org.joda.time.TestLocalTime_Basics.testToString(TestLocalTime_Basics.java:786)

testIsSupported_DateTimeFieldType(org.joda.time.TestLocalTime_Basics)  Time elapsed: 0.001 sec  <<< FAILURE!
junit.framework.AssertionFailedError: expected:<true> but was:<false>
	at junit.framework.Assert.fail(Assert.java:47)
	at junit.framework.Assert.failNotEquals(Assert.java:280)
	at junit.framework.Assert.assertEquals(Assert.java:64)
	at junit.framework.Assert.assertEquals(Assert.java:146)
	at junit.framework.Assert.assertEquals(Assert.java:152)
	at org.joda.time.TestLocalTime_Basics.testIsSupported_DateTimeFieldType(TestLocalTime_Basics.java:211)

testToString_String(org.joda.time.TestLocalTime_Basics)  Time elapsed: 0.002 sec  <<< FAILURE!
junit.framework.ComparisonFailure: expected:<���� [10]> but was:<���� [��]>
	at junit.framework.Assert.assertEquals(Assert.java:81)
	at junit.framework.Assert.assertEquals(Assert.java:87)
	at org.joda.time.TestLocalTime_Basics.testToString_String(TestLocalTime_Basics.java:792)

testToString_String_Locale(org.joda.time.TestLocalTime_Basics)  Time elapsed: 0.001 sec  <<< FAILURE!
junit.framework.ComparisonFailure: expected:<[10 20]> but was:<[� �]>
	at junit.framework.Assert.assertEquals(Assert.java:81)
	at junit.framework.Assert.assertEquals(Assert.java:87)
	at org.joda.time.TestLocalTime_Basics.testToString_String_Locale(TestLocalTime_Basics.java:799)

testToString_DTFormatter(org.joda.time.TestLocalTime_Basics)  Time elapsed: 0.001 sec  <<< FAILURE!
junit.framework.ComparisonFailure: expected:<���� [10]> but was:<���� [��]>
	at junit.framework.Assert.assertEquals(Assert.java:81)
	at junit.framework.Assert.assertEquals(Assert.java:87)
	at org.joda.time.TestLocalTime_Basics.testToString_DTFormatter(TestLocalTime_Basics.java:808)

testProperty(org.joda.time.TestLocalTime_Basics)  Time elapsed: 0 sec  <<< ERROR!
java.lang.IllegalArgumentException: Field 'hourOfDay' is not supported
	at org.joda.time.LocalTime.property(LocalTime.java:163)
	at org.joda.time.TestLocalTime_Basics.testProperty(TestLocalTime_Basics.java:738)

testGet_DateTimeFieldType(org.joda.time.TestLocalTime_Basics)  Time elapsed: 0 sec  <<< ERROR!
java.lang.IllegalArgumentException: Field 'hourOfDay' is not supported
	at org.joda.time.LocalTime.get(LocalTime.java:101)
	at org.joda.time.TestLocalTime_Basics.testGet_DateTimeFieldType(TestLocalTime_Basics.java:98)

testWithField_DateTimeFieldType_int_1(org.joda.time.TestLocalTime_Basics)  Time elapsed: 0.001 sec  <<< ERROR!
java.lang.IllegalArgumentException: Field 'hourOfDay' is not supported
	at org.joda.time.LocalTime.withField(LocalTime.java:125)
	at org.joda.time.TestLocalTime_Basics.testWithField_DateTimeFieldType_int_1(TestLocalTime_Basics.java:426)

testWithField_DateTimeFieldType_int_4(org.joda.time.TestLocalTime_Basics)  Time elapsed: 0.001 sec  <<< ERROR!
java.lang.IllegalArgumentException: Field 'hourOfDay' is not supported
	at org.joda.time.LocalTime.withField(LocalTime.java:125)
	at org.joda.time.TestLocalTime_Basics.testWithField_DateTimeFieldType_int_4(TestLocalTime_Basics.java:450)

testPropertyCompareToHour(org.joda.time.TestLocalTime_Properties)  Time elapsed: 0.001 sec  <<< ERROR!
java.lang.IllegalArgumentException: Field 'hourOfDay' is not supported
	at org.joda.time.LocalTime.get(LocalTime.java:101)
	at org.joda.time.field.AbstractReadableInstantFieldProperty.compareTo(AbstractReadableInstantFieldProperty.java:424)
	at org.joda.time.TestLocalTime_Properties.testPropertyCompareToHour(TestLocalTime_Properties.java:246)

testPropertyCompareToMinute(org.joda.time.TestLocalTime_Properties)  Time elapsed: 0.001 sec  <<< ERROR!
java.lang.IllegalArgumentException: Field 'minuteOfHour' is not supported
	at org.joda.time.LocalTime.get(LocalTime.java:101)
	at org.joda.time.field.AbstractReadableInstantFieldProperty.compareTo(AbstractReadableInstantFieldProperty.java:424)
	at org.joda.time.TestLocalTime_Properties.testPropertyCompareToMinute(TestLocalTime_Properties.java:423)

testPropertyCompareToSecond(org.joda.time.TestLocalTime_Properties)  Time elapsed: 0.001 sec  <<< ERROR!
java.lang.IllegalArgumentException: Field 'secondOfMinute' is not supported
	at org.joda.time.LocalTime.get(LocalTime.java:101)
	at org.joda.time.field.AbstractReadableInstantFieldProperty.compareTo(AbstractReadableInstantFieldProperty.java:424)
	at org.joda.time.TestLocalTime_Properties.testPropertyCompareToSecond(TestLocalTime_Properties.java:594)

testPropertyCompareToMilli(org.joda.time.TestLocalTime_Properties)  Time elapsed: 0.001 sec  <<< ERROR!
java.lang.IllegalArgumentException: Field 'millisOfSecond' is not supported
	at org.joda.time.LocalTime.get(LocalTime.java:101)
	at org.joda.time.field.AbstractReadableInstantFieldProperty.compareTo(AbstractReadableInstantFieldProperty.java:424)
	at org.joda.time.TestLocalTime_Properties.testPropertyCompareToMilli(TestLocalTime_Properties.java:759)

testLocalTime(org.joda.time.TestStringConvert)  Time elapsed: 0.001 sec  <<< FAILURE!
junit.framework.ComparisonFailure: expected:<[02:30:50].678> but was:<[��:��:��].678>
	at junit.framework.Assert.assertEquals(Assert.java:81)
	at junit.framework.Assert.assertEquals(Assert.java:87)
	at org.joda.time.TestStringConvert.testLocalTime(TestStringConvert.java:91)


Results :

Failed tests: 
  org.joda.time.TestLocalTime_Basics#testIsSupported_DateTimeFieldType AssertionFailedError
  org.joda.time.TestLocalTime_Basics#testToString ComparisonFailure expected:<[1...
  org.joda.time.TestLocalTime_Basics#testToString_DTFormatter ComparisonFailure ...
  org.joda.time.TestLocalTime_Basics#testToString_String ComparisonFailure expec...
  org.joda.time.TestLocalTime_Basics#testToString_String_Locale ComparisonFailure
  org.joda.time.TestStringConvert#testLocalTime ComparisonFailure expected:<[02:...
Tests in error: 
  org.joda.time.TestLocalTime_Basics#testGet_DateTimeFieldType IllegalArgumentException
  org.joda.time.TestLocalTime_Basics#testProperty IllegalArgumentException Field...
  org.joda.time.TestLocalTime_Basics#testWithField_DateTimeFieldType_int_1 IllegalArgumentException
  org.joda.time.TestLocalTime_Basics#testWithField_DateTimeFieldType_int_4 IllegalArgumentException
  org.joda.time.TestLocalTime_Constructors#testConstructor_ObjectLocalTime IllegalArgumentException
  org.joda.time.TestLocalTime_Properties#testPropertyCompareToHour IllegalArgumentException
  org.joda.time.TestLocalTime_Properties#testPropertyCompareToMilli IllegalArgumentException
  org.joda.time.TestLocalTime_Properties#testPropertyCompareToMinute IllegalArgumentException
  org.joda.time.TestLocalTime_Properties#testPropertyCompareToSecond IllegalArgumentException

Tests run: 4157, Failures: 6, Errors: 9, Skipped: 0

[INFO] ------------------------------------------------------------------------
[INFO] BUILD FAILURE
[INFO] ------------------------------------------------------------------------
[INFO] Total time: 15.243s
[INFO] Finished at: Wed Aug 05 17:28:08 BST 2015
[INFO] Final Memory: 8M/152M
[INFO] ------------------------------------------------------------------------
[ERROR] Failed to execute goal org.apache.maven.plugins:maven-surefire-plugin:2.18.1:test (default-test) on project joda-time: There are test failures.
[ERROR] 
[ERROR] Please refer to /home/perham/Study/LittleDarwin/Cases/joda-time-2.8.1/target/surefire-reports for the individual test results.
[ERROR] -> [Help 1]
[ERROR] 
[ERROR] To see the full stack trace of the errors, re-run Maven with the -e switch.
[ERROR] Re-run Maven using the -X switch to enable full debug logging.
[ERROR] 
[ERROR] For more information about the errors and possible solutions, please read the following articles:
[ERROR] [Help 1] http://cwiki.apache.org/confluence/display/MAVEN/MojoFailureException
