[INFO] Scanning for projects...
[INFO]                                                                         
[INFO] ------------------------------------------------------------------------
[INFO] Building Joda-Time 2.8.1
[INFO] ------------------------------------------------------------------------
[INFO] 
[INFO] --- maven-resources-plugin:2.7:resources (default-resources) @ joda-time ---
[INFO] Using 'UTF-8' encoding to copy filtered resources.
[INFO] Copying 2 resources to META-INF
[INFO] Copying 10 resources
[INFO] 
[INFO] --- maven-compiler-plugin:3.3:compile (default-compile) @ joda-time ---
[INFO] Changes detected - recompiling the module!
[INFO] Compiling 166 source files to /home/perham/Study/LittleDarwin/Cases/joda-time-2.8.1/target/classes
[INFO] 
[INFO] --- exec-maven-plugin:1.4.0:java (compile-tzdb) @ joda-time ---
Writing zoneinfo files
Writing ZoneInfoMap
[INFO] 
[INFO] --- maven-resources-plugin:2.7:testResources (default-testResources) @ joda-time ---
[INFO] Using 'UTF-8' encoding to copy filtered resources.
[INFO] Copying 34 resources
[INFO] 
[INFO] --- maven-compiler-plugin:3.3:testCompile (default-testCompile) @ joda-time ---
[INFO] Nothing to compile - all classes are up to date
[INFO] 
[INFO] --- maven-surefire-plugin:2.18.1:test (default-test) @ joda-time ---
[INFO] Surefire report directory: /home/perham/Study/LittleDarwin/Cases/joda-time-2.8.1/target/surefire-reports

-------------------------------------------------------
 T E S T S
-------------------------------------------------------
Running org.joda.time.TestAllPackages

TestBuddhistChronology.testCalendar

TestCopticChronology.testCalendar

TestEthiopicChronology.testCalendar

TestIslamicChronology.testCalendar

Testing Gregorian chronology over 1000 iterations
100% complete (i=1000)

Testing Julian chronology over 1000 iterations
100% complete (i=1000)
Writing zoneinfo files
Writing ZoneInfoMap
Tests run: 4157, Failures: 44, Errors: 0, Skipped: 0, Time elapsed: 5.193 sec <<< FAILURE! - in org.joda.time.TestAllPackages
testPlus_RP(org.joda.time.TestLocalTime_Basics)  Time elapsed: 0.004 sec  <<< FAILURE!
junit.framework.AssertionFailedError: expected:<15:26:37.048> but was:<10:20:30.040>
	at junit.framework.Assert.fail(Assert.java:47)
	at junit.framework.Assert.failNotEquals(Assert.java:280)
	at junit.framework.Assert.assertEquals(Assert.java:64)
	at junit.framework.Assert.assertEquals(Assert.java:71)
	at org.joda.time.TestLocalTime_Basics.testPlus_RP(TestLocalTime_Basics.java:542)

testWithers(org.joda.time.TestLocalTime_Basics)  Time elapsed: 0 sec  <<< FAILURE!
junit.framework.AssertionFailedError: expected:<6> but was:<10>
	at junit.framework.Assert.fail(Assert.java:47)
	at junit.framework.Assert.failNotEquals(Assert.java:280)
	at junit.framework.Assert.assertEquals(Assert.java:64)
	at junit.framework.Assert.assertEquals(Assert.java:198)
	at junit.framework.Assert.assertEquals(Assert.java:204)
	at org.joda.time.TestLocalTime_Basics.check(TestLocalTime_Basics.java:814)
	at org.joda.time.TestLocalTime_Basics.testWithers(TestLocalTime_Basics.java:652)

testPlusHours_int(org.joda.time.TestLocalTime_Basics)  Time elapsed: 0.001 sec  <<< FAILURE!
junit.framework.AssertionFailedError: expected:<02:02:03.004> but was:<01:02:03.004>
	at junit.framework.Assert.fail(Assert.java:47)
	at junit.framework.Assert.failNotEquals(Assert.java:280)
	at junit.framework.Assert.assertEquals(Assert.java:64)
	at junit.framework.Assert.assertEquals(Assert.java:71)
	at org.joda.time.TestLocalTime_Basics.testPlusHours_int(TestLocalTime_Basics.java:552)

testPlusMinutes_int(org.joda.time.TestLocalTime_Basics)  Time elapsed: 0.001 sec  <<< FAILURE!
junit.framework.AssertionFailedError: expected:<01:03:03.004> but was:<01:02:03.004>
	at junit.framework.Assert.fail(Assert.java:47)
	at junit.framework.Assert.failNotEquals(Assert.java:280)
	at junit.framework.Assert.assertEquals(Assert.java:64)
	at junit.framework.Assert.assertEquals(Assert.java:71)
	at org.joda.time.TestLocalTime_Basics.testPlusMinutes_int(TestLocalTime_Basics.java:562)

testPlusSeconds_int(org.joda.time.TestLocalTime_Basics)  Time elapsed: 0 sec  <<< FAILURE!
junit.framework.AssertionFailedError: expected:<01:02:04.004> but was:<01:02:03.004>
	at junit.framework.Assert.fail(Assert.java:47)
	at junit.framework.Assert.failNotEquals(Assert.java:280)
	at junit.framework.Assert.assertEquals(Assert.java:64)
	at junit.framework.Assert.assertEquals(Assert.java:71)
	at org.joda.time.TestLocalTime_Basics.testPlusSeconds_int(TestLocalTime_Basics.java:572)

testPlusMillis_int(org.joda.time.TestLocalTime_Basics)  Time elapsed: 0 sec  <<< FAILURE!
junit.framework.AssertionFailedError: expected:<01:02:03.005> but was:<01:02:03.004>
	at junit.framework.Assert.fail(Assert.java:47)
	at junit.framework.Assert.failNotEquals(Assert.java:280)
	at junit.framework.Assert.assertEquals(Assert.java:64)
	at junit.framework.Assert.assertEquals(Assert.java:71)
	at org.joda.time.TestLocalTime_Basics.testPlusMillis_int(TestLocalTime_Basics.java:582)

testMinus_RP(org.joda.time.TestLocalTime_Basics)  Time elapsed: 0.001 sec  <<< FAILURE!
junit.framework.AssertionFailedError: expected:<09:19:29.039> but was:<10:20:30.040>
	at junit.framework.Assert.fail(Assert.java:47)
	at junit.framework.Assert.failNotEquals(Assert.java:280)
	at junit.framework.Assert.assertEquals(Assert.java:64)
	at junit.framework.Assert.assertEquals(Assert.java:71)
	at org.joda.time.TestLocalTime_Basics.testMinus_RP(TestLocalTime_Basics.java:593)

testMinusHours_int(org.joda.time.TestLocalTime_Basics)  Time elapsed: 0 sec  <<< FAILURE!
junit.framework.AssertionFailedError: expected:<00:02:03.004> but was:<01:02:03.004>
	at junit.framework.Assert.fail(Assert.java:47)
	at junit.framework.Assert.failNotEquals(Assert.java:280)
	at junit.framework.Assert.assertEquals(Assert.java:64)
	at junit.framework.Assert.assertEquals(Assert.java:71)
	at org.joda.time.TestLocalTime_Basics.testMinusHours_int(TestLocalTime_Basics.java:603)

testMinusMinutes_int(org.joda.time.TestLocalTime_Basics)  Time elapsed: 0.001 sec  <<< FAILURE!
junit.framework.AssertionFailedError: expected:<01:01:03.004> but was:<01:02:03.004>
	at junit.framework.Assert.fail(Assert.java:47)
	at junit.framework.Assert.failNotEquals(Assert.java:280)
	at junit.framework.Assert.assertEquals(Assert.java:64)
	at junit.framework.Assert.assertEquals(Assert.java:71)
	at org.joda.time.TestLocalTime_Basics.testMinusMinutes_int(TestLocalTime_Basics.java:613)

testMinusSeconds_int(org.joda.time.TestLocalTime_Basics)  Time elapsed: 0 sec  <<< FAILURE!
junit.framework.AssertionFailedError: expected:<01:02:02.004> but was:<01:02:03.004>
	at junit.framework.Assert.fail(Assert.java:47)
	at junit.framework.Assert.failNotEquals(Assert.java:280)
	at junit.framework.Assert.assertEquals(Assert.java:64)
	at junit.framework.Assert.assertEquals(Assert.java:71)
	at org.joda.time.TestLocalTime_Basics.testMinusSeconds_int(TestLocalTime_Basics.java:623)

testMinusMillis_int(org.joda.time.TestLocalTime_Basics)  Time elapsed: 0.001 sec  <<< FAILURE!
junit.framework.AssertionFailedError: expected:<01:02:03.003> but was:<01:02:03.004>
	at junit.framework.Assert.fail(Assert.java:47)
	at junit.framework.Assert.failNotEquals(Assert.java:280)
	at junit.framework.Assert.assertEquals(Assert.java:64)
	at junit.framework.Assert.assertEquals(Assert.java:71)
	at org.joda.time.TestLocalTime_Basics.testMinusMillis_int(TestLocalTime_Basics.java:633)

testWithFieldAdded_DurationFieldType_int_7(org.joda.time.TestLocalTime_Basics)  Time elapsed: 0.001 sec  <<< FAILURE!
junit.framework.AssertionFailedError: expected:<00:00:00.000> but was:<23:59:59.999>
	at junit.framework.Assert.fail(Assert.java:47)
	at junit.framework.Assert.failNotEquals(Assert.java:280)
	at junit.framework.Assert.assertEquals(Assert.java:64)
	at junit.framework.Assert.assertEquals(Assert.java:71)
	at org.joda.time.TestLocalTime_Basics.testWithFieldAdded_DurationFieldType_int_7(TestLocalTime_Basics.java:504)

testWithFieldAdded_DurationFieldType_int_8(org.joda.time.TestLocalTime_Basics)  Time elapsed: 0 sec  <<< FAILURE!
junit.framework.AssertionFailedError: expected:<23:59:59.999> but was:<00:00:00.000>
	at junit.framework.Assert.fail(Assert.java:47)
	at junit.framework.Assert.failNotEquals(Assert.java:280)
	at junit.framework.Assert.assertEquals(Assert.java:64)
	at junit.framework.Assert.assertEquals(Assert.java:71)
	at org.joda.time.TestLocalTime_Basics.testWithFieldAdded_DurationFieldType_int_8(TestLocalTime_Basics.java:522)

testWithField_DateTimeFieldType_int_1(org.joda.time.TestLocalTime_Basics)  Time elapsed: 0 sec  <<< FAILURE!
junit.framework.AssertionFailedError: expected:<15:20:30.040> but was:<10:20:30.040>
	at junit.framework.Assert.fail(Assert.java:47)
	at junit.framework.Assert.failNotEquals(Assert.java:280)
	at junit.framework.Assert.assertEquals(Assert.java:64)
	at junit.framework.Assert.assertEquals(Assert.java:71)
	at org.joda.time.TestLocalTime_Basics.testWithField_DateTimeFieldType_int_1(TestLocalTime_Basics.java:429)

testWithFieldAdded_DurationFieldType_int_1(org.joda.time.TestLocalTime_Basics)  Time elapsed: 0 sec  <<< FAILURE!
junit.framework.AssertionFailedError: expected:<16:20:30.040> but was:<10:20:30.040>
	at junit.framework.Assert.fail(Assert.java:47)
	at junit.framework.Assert.failNotEquals(Assert.java:280)
	at junit.framework.Assert.assertEquals(Assert.java:64)
	at junit.framework.Assert.assertEquals(Assert.java:71)
	at org.joda.time.TestLocalTime_Basics.testWithFieldAdded_DurationFieldType_int_1(TestLocalTime_Basics.java:460)

testWithFieldAdded_DurationFieldType_int_6(org.joda.time.TestLocalTime_Basics)  Time elapsed: 0.001 sec  <<< FAILURE!
junit.framework.AssertionFailedError: expected:<02:20:30.040> but was:<10:20:30.040>
	at junit.framework.Assert.fail(Assert.java:47)
	at junit.framework.Assert.failNotEquals(Assert.java:280)
	at junit.framework.Assert.assertEquals(Assert.java:64)
	at junit.framework.Assert.assertEquals(Assert.java:71)
	at org.joda.time.TestLocalTime_Basics.testWithFieldAdded_DurationFieldType_int_6(TestLocalTime_Basics.java:498)

testWithField_DateTimeFieldType_int_4(org.joda.time.TestLocalTime_Basics)  Time elapsed: 0.001 sec  <<< FAILURE!
junit.framework.AssertionFailedError: expected same:<10:20:30.040> was not:<10:20:30.040>
	at junit.framework.Assert.fail(Assert.java:47)
	at junit.framework.Assert.failNotSame(Assert.java:276)
	at junit.framework.Assert.assertSame(Assert.java:239)
	at junit.framework.Assert.assertSame(Assert.java:246)
	at org.joda.time.TestLocalTime_Basics.testWithField_DateTimeFieldType_int_4(TestLocalTime_Basics.java:451)

testPropertyPlusHour(org.joda.time.TestLocalTime_Properties)  Time elapsed: 0 sec  <<< FAILURE!
junit.framework.AssertionFailedError: expected:<19> but was:<10>
	at junit.framework.Assert.fail(Assert.java:47)
	at junit.framework.Assert.failNotEquals(Assert.java:280)
	at junit.framework.Assert.assertEquals(Assert.java:64)
	at junit.framework.Assert.assertEquals(Assert.java:198)
	at junit.framework.Assert.assertEquals(Assert.java:204)
	at org.joda.time.TestLocalTime_Properties.check(TestLocalTime_Properties.java:780)
	at org.joda.time.TestLocalTime_Properties.testPropertyPlusHour(TestLocalTime_Properties.java:144)

testPropertyPlusNoWrapHour(org.joda.time.TestLocalTime_Properties)  Time elapsed: 0.001 sec  <<< FAILURE!
junit.framework.AssertionFailedError: expected:<19> but was:<10>
	at junit.framework.Assert.fail(Assert.java:47)
	at junit.framework.Assert.failNotEquals(Assert.java:280)
	at junit.framework.Assert.assertEquals(Assert.java:64)
	at junit.framework.Assert.assertEquals(Assert.java:198)
	at junit.framework.Assert.assertEquals(Assert.java:204)
	at org.joda.time.TestLocalTime_Properties.check(TestLocalTime_Properties.java:780)
	at org.joda.time.TestLocalTime_Properties.testPropertyPlusNoWrapHour(TestLocalTime_Properties.java:166)

testPropertyPlusWrapFieldHour(org.joda.time.TestLocalTime_Properties)  Time elapsed: 0 sec  <<< FAILURE!
junit.framework.AssertionFailedError: expected:<19> but was:<10>
	at junit.framework.Assert.fail(Assert.java:47)
	at junit.framework.Assert.failNotEquals(Assert.java:280)
	at junit.framework.Assert.assertEquals(Assert.java:64)
	at junit.framework.Assert.assertEquals(Assert.java:198)
	at junit.framework.Assert.assertEquals(Assert.java:204)
	at org.joda.time.TestLocalTime_Properties.check(TestLocalTime_Properties.java:780)
	at org.joda.time.TestLocalTime_Properties.testPropertyPlusWrapFieldHour(TestLocalTime_Properties.java:194)

testPropertyPlusMinute(org.joda.time.TestLocalTime_Properties)  Time elapsed: 0.001 sec  <<< FAILURE!
junit.framework.AssertionFailedError: expected:<29> but was:<20>
	at junit.framework.Assert.fail(Assert.java:47)
	at junit.framework.Assert.failNotEquals(Assert.java:280)
	at junit.framework.Assert.assertEquals(Assert.java:64)
	at junit.framework.Assert.assertEquals(Assert.java:198)
	at junit.framework.Assert.assertEquals(Assert.java:204)
	at org.joda.time.TestLocalTime_Properties.check(TestLocalTime_Properties.java:781)
	at org.joda.time.TestLocalTime_Properties.testPropertyPlusMinute(TestLocalTime_Properties.java:302)

testPropertyPlusNoWrapMinute(org.joda.time.TestLocalTime_Properties)  Time elapsed: 0 sec  <<< FAILURE!
junit.framework.AssertionFailedError: expected:<29> but was:<20>
	at junit.framework.Assert.fail(Assert.java:47)
	at junit.framework.Assert.failNotEquals(Assert.java:280)
	at junit.framework.Assert.assertEquals(Assert.java:64)
	at junit.framework.Assert.assertEquals(Assert.java:198)
	at junit.framework.Assert.assertEquals(Assert.java:204)
	at org.joda.time.TestLocalTime_Properties.check(TestLocalTime_Properties.java:781)
	at org.joda.time.TestLocalTime_Properties.testPropertyPlusNoWrapMinute(TestLocalTime_Properties.java:342)

testPropertyPlusWrapFieldMinute(org.joda.time.TestLocalTime_Properties)  Time elapsed: 0.001 sec  <<< FAILURE!
junit.framework.AssertionFailedError: expected:<29> but was:<20>
	at junit.framework.Assert.fail(Assert.java:47)
	at junit.framework.Assert.failNotEquals(Assert.java:280)
	at junit.framework.Assert.assertEquals(Assert.java:64)
	at junit.framework.Assert.assertEquals(Assert.java:198)
	at junit.framework.Assert.assertEquals(Assert.java:204)
	at org.joda.time.TestLocalTime_Properties.check(TestLocalTime_Properties.java:781)
	at org.joda.time.TestLocalTime_Properties.testPropertyPlusWrapFieldMinute(TestLocalTime_Properties.java:388)

testPropertyPlusSecond(org.joda.time.TestLocalTime_Properties)  Time elapsed: 0 sec  <<< FAILURE!
junit.framework.AssertionFailedError: expected:<39> but was:<30>
	at junit.framework.Assert.fail(Assert.java:47)
	at junit.framework.Assert.failNotEquals(Assert.java:280)
	at junit.framework.Assert.assertEquals(Assert.java:64)
	at junit.framework.Assert.assertEquals(Assert.java:198)
	at junit.framework.Assert.assertEquals(Assert.java:204)
	at org.joda.time.TestLocalTime_Properties.check(TestLocalTime_Properties.java:782)
	at org.joda.time.TestLocalTime_Properties.testPropertyPlusSecond(TestLocalTime_Properties.java:479)

testPropertyPlusNoWrapSecond(org.joda.time.TestLocalTime_Properties)  Time elapsed: 0.001 sec  <<< FAILURE!
junit.framework.AssertionFailedError: expected:<39> but was:<30>
	at junit.framework.Assert.fail(Assert.java:47)
	at junit.framework.Assert.failNotEquals(Assert.java:280)
	at junit.framework.Assert.assertEquals(Assert.java:64)
	at junit.framework.Assert.assertEquals(Assert.java:198)
	at junit.framework.Assert.assertEquals(Assert.java:204)
	at org.joda.time.TestLocalTime_Properties.check(TestLocalTime_Properties.java:782)
	at org.joda.time.TestLocalTime_Properties.testPropertyPlusNoWrapSecond(TestLocalTime_Properties.java:516)

testPropertyPlusWrapFieldSecond(org.joda.time.TestLocalTime_Properties)  Time elapsed: 0.003 sec  <<< FAILURE!
junit.framework.AssertionFailedError: expected:<39> but was:<30>
	at junit.framework.Assert.fail(Assert.java:47)
	at junit.framework.Assert.failNotEquals(Assert.java:280)
	at junit.framework.Assert.assertEquals(Assert.java:64)
	at junit.framework.Assert.assertEquals(Assert.java:198)
	at junit.framework.Assert.assertEquals(Assert.java:204)
	at org.joda.time.TestLocalTime_Properties.check(TestLocalTime_Properties.java:782)
	at org.joda.time.TestLocalTime_Properties.testPropertyPlusWrapFieldSecond(TestLocalTime_Properties.java:559)

testPropertyPlusMilli(org.joda.time.TestLocalTime_Properties)  Time elapsed: 0 sec  <<< FAILURE!
junit.framework.AssertionFailedError: expected:<49> but was:<40>
	at junit.framework.Assert.fail(Assert.java:47)
	at junit.framework.Assert.failNotEquals(Assert.java:280)
	at junit.framework.Assert.assertEquals(Assert.java:64)
	at junit.framework.Assert.assertEquals(Assert.java:198)
	at junit.framework.Assert.assertEquals(Assert.java:204)
	at org.joda.time.TestLocalTime_Properties.check(TestLocalTime_Properties.java:783)
	at org.joda.time.TestLocalTime_Properties.testPropertyPlusMilli(TestLocalTime_Properties.java:650)

testPropertyPlusNoWrapMilli(org.joda.time.TestLocalTime_Properties)  Time elapsed: 0 sec  <<< FAILURE!
junit.framework.AssertionFailedError: expected:<49> but was:<40>
	at junit.framework.Assert.fail(Assert.java:47)
	at junit.framework.Assert.failNotEquals(Assert.java:280)
	at junit.framework.Assert.assertEquals(Assert.java:64)
	at junit.framework.Assert.assertEquals(Assert.java:198)
	at junit.framework.Assert.assertEquals(Assert.java:204)
	at org.joda.time.TestLocalTime_Properties.check(TestLocalTime_Properties.java:783)
	at org.joda.time.TestLocalTime_Properties.testPropertyPlusNoWrapMilli(TestLocalTime_Properties.java:684)

testPropertyPlusWrapFieldMilli(org.joda.time.TestLocalTime_Properties)  Time elapsed: 0 sec  <<< FAILURE!
junit.framework.AssertionFailedError: expected:<49> but was:<40>
	at junit.framework.Assert.fail(Assert.java:47)
	at junit.framework.Assert.failNotEquals(Assert.java:280)
	at junit.framework.Assert.assertEquals(Assert.java:64)
	at junit.framework.Assert.assertEquals(Assert.java:198)
	at junit.framework.Assert.assertEquals(Assert.java:204)
	at org.joda.time.TestLocalTime_Properties.check(TestLocalTime_Properties.java:783)
	at org.joda.time.TestLocalTime_Properties.testPropertyPlusWrapFieldMilli(TestLocalTime_Properties.java:724)

testPropertyRoundHour(org.joda.time.TestLocalTime_Properties)  Time elapsed: 0 sec  <<< FAILURE!
junit.framework.AssertionFailedError: expected:<11> but was:<10>
	at junit.framework.Assert.fail(Assert.java:47)
	at junit.framework.Assert.failNotEquals(Assert.java:280)
	at junit.framework.Assert.assertEquals(Assert.java:64)
	at junit.framework.Assert.assertEquals(Assert.java:198)
	at junit.framework.Assert.assertEquals(Assert.java:204)
	at org.joda.time.TestLocalTime_Properties.check(TestLocalTime_Properties.java:780)
	at org.joda.time.TestLocalTime_Properties.testPropertyRoundHour(TestLocalTime_Properties.java:98)

testPropertyWithMaxMinValueHour(org.joda.time.TestLocalTime_Properties)  Time elapsed: 0.001 sec  <<< FAILURE!
junit.framework.AssertionFailedError: expected:<23> but was:<10>
	at junit.framework.Assert.fail(Assert.java:47)
	at junit.framework.Assert.failNotEquals(Assert.java:280)
	at junit.framework.Assert.assertEquals(Assert.java:64)
	at junit.framework.Assert.assertEquals(Assert.java:198)
	at junit.framework.Assert.assertEquals(Assert.java:204)
	at org.joda.time.TestLocalTime_Properties.check(TestLocalTime_Properties.java:780)
	at org.joda.time.TestLocalTime_Properties.testPropertyWithMaxMinValueHour(TestLocalTime_Properties.java:136)

testPropertySetHour(org.joda.time.TestLocalTime_Properties)  Time elapsed: 0 sec  <<< FAILURE!
junit.framework.AssertionFailedError: expected:<12> but was:<10>
	at junit.framework.Assert.fail(Assert.java:47)
	at junit.framework.Assert.failNotEquals(Assert.java:280)
	at junit.framework.Assert.assertEquals(Assert.java:64)
	at junit.framework.Assert.assertEquals(Assert.java:198)
	at junit.framework.Assert.assertEquals(Assert.java:204)
	at org.joda.time.TestLocalTime_Properties.check(TestLocalTime_Properties.java:780)
	at org.joda.time.TestLocalTime_Properties.testPropertySetHour(TestLocalTime_Properties.java:210)

testPropertySetTextHour(org.joda.time.TestLocalTime_Properties)  Time elapsed: 0 sec  <<< FAILURE!
junit.framework.AssertionFailedError: expected:<12> but was:<10>
	at junit.framework.Assert.fail(Assert.java:47)
	at junit.framework.Assert.failNotEquals(Assert.java:280)
	at junit.framework.Assert.assertEquals(Assert.java:64)
	at junit.framework.Assert.assertEquals(Assert.java:198)
	at junit.framework.Assert.assertEquals(Assert.java:204)
	at org.joda.time.TestLocalTime_Properties.check(TestLocalTime_Properties.java:780)
	at org.joda.time.TestLocalTime_Properties.testPropertySetTextHour(TestLocalTime_Properties.java:226)

testPropertyWithMaximumValueHour(org.joda.time.TestLocalTime_Properties)  Time elapsed: 0.001 sec  <<< FAILURE!
junit.framework.AssertionFailedError: expected:<23> but was:<10>
	at junit.framework.Assert.fail(Assert.java:47)
	at junit.framework.Assert.failNotEquals(Assert.java:280)
	at junit.framework.Assert.assertEquals(Assert.java:64)
	at junit.framework.Assert.assertEquals(Assert.java:198)
	at junit.framework.Assert.assertEquals(Assert.java:204)
	at org.joda.time.TestLocalTime_Properties.check(TestLocalTime_Properties.java:780)
	at org.joda.time.TestLocalTime_Properties.testPropertyWithMaximumValueHour(TestLocalTime_Properties.java:233)

testPropertyWithMinimumValueHour(org.joda.time.TestLocalTime_Properties)  Time elapsed: 0 sec  <<< FAILURE!
junit.framework.AssertionFailedError: expected:<0> but was:<10>
	at junit.framework.Assert.fail(Assert.java:47)
	at junit.framework.Assert.failNotEquals(Assert.java:280)
	at junit.framework.Assert.assertEquals(Assert.java:64)
	at junit.framework.Assert.assertEquals(Assert.java:198)
	at junit.framework.Assert.assertEquals(Assert.java:204)
	at org.joda.time.TestLocalTime_Properties.check(TestLocalTime_Properties.java:780)
	at org.joda.time.TestLocalTime_Properties.testPropertyWithMinimumValueHour(TestLocalTime_Properties.java:240)

testPropertyWithMaxMinValueMinute(org.joda.time.TestLocalTime_Properties)  Time elapsed: 0.001 sec  <<< FAILURE!
junit.framework.AssertionFailedError: expected:<59> but was:<20>
	at junit.framework.Assert.fail(Assert.java:47)
	at junit.framework.Assert.failNotEquals(Assert.java:280)
	at junit.framework.Assert.assertEquals(Assert.java:64)
	at junit.framework.Assert.assertEquals(Assert.java:198)
	at junit.framework.Assert.assertEquals(Assert.java:204)
	at org.joda.time.TestLocalTime_Properties.check(TestLocalTime_Properties.java:781)
	at org.joda.time.TestLocalTime_Properties.testPropertyWithMaxMinValueMinute(TestLocalTime_Properties.java:294)

testPropertySetMinute(org.joda.time.TestLocalTime_Properties)  Time elapsed: 0 sec  <<< FAILURE!
junit.framework.AssertionFailedError: expected:<12> but was:<20>
	at junit.framework.Assert.fail(Assert.java:47)
	at junit.framework.Assert.failNotEquals(Assert.java:280)
	at junit.framework.Assert.assertEquals(Assert.java:64)
	at junit.framework.Assert.assertEquals(Assert.java:198)
	at junit.framework.Assert.assertEquals(Assert.java:204)
	at org.joda.time.TestLocalTime_Properties.check(TestLocalTime_Properties.java:781)
	at org.joda.time.TestLocalTime_Properties.testPropertySetMinute(TestLocalTime_Properties.java:401)

testPropertySetTextMinute(org.joda.time.TestLocalTime_Properties)  Time elapsed: 0.001 sec  <<< FAILURE!
junit.framework.AssertionFailedError: expected:<12> but was:<20>
	at junit.framework.Assert.fail(Assert.java:47)
	at junit.framework.Assert.failNotEquals(Assert.java:280)
	at junit.framework.Assert.assertEquals(Assert.java:64)
	at junit.framework.Assert.assertEquals(Assert.java:198)
	at junit.framework.Assert.assertEquals(Assert.java:204)
	at org.joda.time.TestLocalTime_Properties.check(TestLocalTime_Properties.java:781)
	at org.joda.time.TestLocalTime_Properties.testPropertySetTextMinute(TestLocalTime_Properties.java:417)

testPropertyWithMaxMinValueSecond(org.joda.time.TestLocalTime_Properties)  Time elapsed: 0 sec  <<< FAILURE!
junit.framework.AssertionFailedError: expected:<59> but was:<30>
	at junit.framework.Assert.fail(Assert.java:47)
	at junit.framework.Assert.failNotEquals(Assert.java:280)
	at junit.framework.Assert.assertEquals(Assert.java:64)
	at junit.framework.Assert.assertEquals(Assert.java:198)
	at junit.framework.Assert.assertEquals(Assert.java:204)
	at org.joda.time.TestLocalTime_Properties.check(TestLocalTime_Properties.java:782)
	at org.joda.time.TestLocalTime_Properties.testPropertyWithMaxMinValueSecond(TestLocalTime_Properties.java:471)

testPropertySetSecond(org.joda.time.TestLocalTime_Properties)  Time elapsed: 0.001 sec  <<< FAILURE!
junit.framework.AssertionFailedError: expected:<12> but was:<30>
	at junit.framework.Assert.fail(Assert.java:47)
	at junit.framework.Assert.failNotEquals(Assert.java:280)
	at junit.framework.Assert.assertEquals(Assert.java:64)
	at junit.framework.Assert.assertEquals(Assert.java:198)
	at junit.framework.Assert.assertEquals(Assert.java:204)
	at org.joda.time.TestLocalTime_Properties.check(TestLocalTime_Properties.java:782)
	at org.joda.time.TestLocalTime_Properties.testPropertySetSecond(TestLocalTime_Properties.java:572)

testPropertySetTextSecond(org.joda.time.TestLocalTime_Properties)  Time elapsed: 0 sec  <<< FAILURE!
junit.framework.AssertionFailedError: expected:<12> but was:<30>
	at junit.framework.Assert.fail(Assert.java:47)
	at junit.framework.Assert.failNotEquals(Assert.java:280)
	at junit.framework.Assert.assertEquals(Assert.java:64)
	at junit.framework.Assert.assertEquals(Assert.java:198)
	at junit.framework.Assert.assertEquals(Assert.java:204)
	at org.joda.time.TestLocalTime_Properties.check(TestLocalTime_Properties.java:782)
	at org.joda.time.TestLocalTime_Properties.testPropertySetTextSecond(TestLocalTime_Properties.java:588)

testPropertyWithMaxMinValueMilli(org.joda.time.TestLocalTime_Properties)  Time elapsed: 0 sec  <<< FAILURE!
junit.framework.AssertionFailedError: expected:<999> but was:<40>
	at junit.framework.Assert.fail(Assert.java:47)
	at junit.framework.Assert.failNotEquals(Assert.java:280)
	at junit.framework.Assert.assertEquals(Assert.java:64)
	at junit.framework.Assert.assertEquals(Assert.java:198)
	at junit.framework.Assert.assertEquals(Assert.java:204)
	at org.joda.time.TestLocalTime_Properties.check(TestLocalTime_Properties.java:783)
	at org.joda.time.TestLocalTime_Properties.testPropertyWithMaxMinValueMilli(TestLocalTime_Properties.java:642)

testPropertySetMilli(org.joda.time.TestLocalTime_Properties)  Time elapsed: 0 sec  <<< FAILURE!
junit.framework.AssertionFailedError: expected:<12> but was:<40>
	at junit.framework.Assert.fail(Assert.java:47)
	at junit.framework.Assert.failNotEquals(Assert.java:280)
	at junit.framework.Assert.assertEquals(Assert.java:64)
	at junit.framework.Assert.assertEquals(Assert.java:198)
	at junit.framework.Assert.assertEquals(Assert.java:204)
	at org.joda.time.TestLocalTime_Properties.check(TestLocalTime_Properties.java:783)
	at org.joda.time.TestLocalTime_Properties.testPropertySetMilli(TestLocalTime_Properties.java:737)

testPropertySetTextMilli(org.joda.time.TestLocalTime_Properties)  Time elapsed: 0.001 sec  <<< FAILURE!
junit.framework.AssertionFailedError: expected:<12> but was:<40>
	at junit.framework.Assert.fail(Assert.java:47)
	at junit.framework.Assert.failNotEquals(Assert.java:280)
	at junit.framework.Assert.assertEquals(Assert.java:64)
	at junit.framework.Assert.assertEquals(Assert.java:198)
	at junit.framework.Assert.assertEquals(Assert.java:204)
	at org.joda.time.TestLocalTime_Properties.check(TestLocalTime_Properties.java:783)
	at org.joda.time.TestLocalTime_Properties.testPropertySetTextMilli(TestLocalTime_Properties.java:753)


Results :

Failed tests: 
  org.joda.time.TestLocalTime_Basics#testMinusHours_int AssertionFailedError exp...
  org.joda.time.TestLocalTime_Basics#testMinusMillis_int AssertionFailedError ex...
  org.joda.time.TestLocalTime_Basics#testMinusMinutes_int AssertionFailedError e...
  org.joda.time.TestLocalTime_Basics#testMinusSeconds_int AssertionFailedError e...
  org.joda.time.TestLocalTime_Basics#testMinus_RP AssertionFailedError expected:...
  org.joda.time.TestLocalTime_Basics#testPlusHours_int AssertionFailedError expe...
  org.joda.time.TestLocalTime_Basics#testPlusMillis_int AssertionFailedError exp...
  org.joda.time.TestLocalTime_Basics#testPlusMinutes_int AssertionFailedError ex...
  org.joda.time.TestLocalTime_Basics#testPlusSeconds_int AssertionFailedError ex...
  org.joda.time.TestLocalTime_Basics#testPlus_RP AssertionFailedError expected:<...
  org.joda.time.TestLocalTime_Basics#testWithFieldAdded_DurationFieldType_int_1 AssertionFailedError
  org.joda.time.TestLocalTime_Basics#testWithFieldAdded_DurationFieldType_int_6 AssertionFailedError
  org.joda.time.TestLocalTime_Basics#testWithFieldAdded_DurationFieldType_int_7 AssertionFailedError
  org.joda.time.TestLocalTime_Basics#testWithFieldAdded_DurationFieldType_int_8 AssertionFailedError
  org.joda.time.TestLocalTime_Basics#testWithField_DateTimeFieldType_int_1 AssertionFailedError
  org.joda.time.TestLocalTime_Basics#testWithField_DateTimeFieldType_int_4 AssertionFailedError
  org.joda.time.TestLocalTime_Basics#testWithers AssertionFailedError expected:<...
  org.joda.time.TestLocalTime_Properties#testPropertyPlusHour AssertionFailedError
  org.joda.time.TestLocalTime_Properties#testPropertyPlusMilli AssertionFailedError
  org.joda.time.TestLocalTime_Properties#testPropertyPlusMinute AssertionFailedError
  org.joda.time.TestLocalTime_Properties#testPropertyPlusNoWrapHour AssertionFailedError
  org.joda.time.TestLocalTime_Properties#testPropertyPlusNoWrapMilli AssertionFailedError
  org.joda.time.TestLocalTime_Properties#testPropertyPlusNoWrapMinute AssertionFailedError
  org.joda.time.TestLocalTime_Properties#testPropertyPlusNoWrapSecond AssertionFailedError
  org.joda.time.TestLocalTime_Properties#testPropertyPlusSecond AssertionFailedError
  org.joda.time.TestLocalTime_Properties#testPropertyPlusWrapFieldHour AssertionFailedError
  org.joda.time.TestLocalTime_Properties#testPropertyPlusWrapFieldMilli AssertionFailedError
  org.joda.time.TestLocalTime_Properties#testPropertyPlusWrapFieldMinute AssertionFailedError
  org.joda.time.TestLocalTime_Properties#testPropertyPlusWrapFieldSecond AssertionFailedError
  org.joda.time.TestLocalTime_Properties#testPropertyRoundHour AssertionFailedError
  org.joda.time.TestLocalTime_Properties#testPropertySetHour AssertionFailedError
  org.joda.time.TestLocalTime_Properties#testPropertySetMilli AssertionFailedError
  org.joda.time.TestLocalTime_Properties#testPropertySetMinute AssertionFailedError
  org.joda.time.TestLocalTime_Properties#testPropertySetSecond AssertionFailedError
  org.joda.time.TestLocalTime_Properties#testPropertySetTextHour AssertionFailedError
  org.joda.time.TestLocalTime_Properties#testPropertySetTextMilli AssertionFailedError
  org.joda.time.TestLocalTime_Properties#testPropertySetTextMinute AssertionFailedError
  org.joda.time.TestLocalTime_Properties#testPropertySetTextSecond AssertionFailedError
  org.joda.time.TestLocalTime_Properties#testPropertyWithMaxMinValueHour AssertionFailedError
  org.joda.time.TestLocalTime_Properties#testPropertyWithMaxMinValueMilli AssertionFailedError
  org.joda.time.TestLocalTime_Properties#testPropertyWithMaxMinValueMinute AssertionFailedError
  org.joda.time.TestLocalTime_Properties#testPropertyWithMaxMinValueSecond AssertionFailedError
  org.joda.time.TestLocalTime_Properties#testPropertyWithMaximumValueHour AssertionFailedError
  org.joda.time.TestLocalTime_Properties#testPropertyWithMinimumValueHour AssertionFailedError

Tests run: 4157, Failures: 44, Errors: 0, Skipped: 0

[INFO] ------------------------------------------------------------------------
[INFO] BUILD FAILURE
[INFO] ------------------------------------------------------------------------
[INFO] Total time: 14.989s
[INFO] Finished at: Wed Aug 05 17:22:02 BST 2015
[INFO] Final Memory: 9M/214M
[INFO] ------------------------------------------------------------------------
[ERROR] Failed to execute goal org.apache.maven.plugins:maven-surefire-plugin:2.18.1:test (default-test) on project joda-time: There are test failures.
[ERROR] 
[ERROR] Please refer to /home/perham/Study/LittleDarwin/Cases/joda-time-2.8.1/target/surefire-reports for the individual test results.
[ERROR] -> [Help 1]
[ERROR] 
[ERROR] To see the full stack trace of the errors, re-run Maven with the -e switch.
[ERROR] Re-run Maven using the -X switch to enable full debug logging.
[ERROR] 
[ERROR] For more information about the errors and possible solutions, please read the following articles:
[ERROR] [Help 1] http://cwiki.apache.org/confluence/display/MAVEN/MojoFailureException
