[INFO] Scanning for projects...
[INFO]                                                                         
[INFO] ------------------------------------------------------------------------
[INFO] Building Joda-Time 2.8.1
[INFO] ------------------------------------------------------------------------
[INFO] 
[INFO] --- maven-resources-plugin:2.7:resources (default-resources) @ joda-time ---
[INFO] Using 'UTF-8' encoding to copy filtered resources.
[INFO] Copying 2 resources to META-INF
[INFO] Copying 10 resources
[INFO] 
[INFO] --- maven-compiler-plugin:3.3:compile (default-compile) @ joda-time ---
[INFO] Changes detected - recompiling the module!
[INFO] Compiling 166 source files to /home/perham/Study/LittleDarwin/Cases/joda-time-2.8.1/target/classes
[INFO] 
[INFO] --- exec-maven-plugin:1.4.0:java (compile-tzdb) @ joda-time ---
Writing zoneinfo files
Writing ZoneInfoMap
[INFO] 
[INFO] --- maven-resources-plugin:2.7:testResources (default-testResources) @ joda-time ---
[INFO] Using 'UTF-8' encoding to copy filtered resources.
[INFO] Copying 34 resources
[INFO] 
[INFO] --- maven-compiler-plugin:3.3:testCompile (default-testCompile) @ joda-time ---
[INFO] Nothing to compile - all classes are up to date
[INFO] 
[INFO] --- maven-surefire-plugin:2.18.1:test (default-test) @ joda-time ---
[INFO] Surefire report directory: /home/perham/Study/LittleDarwin/Cases/joda-time-2.8.1/target/surefire-reports

-------------------------------------------------------
 T E S T S
-------------------------------------------------------
Running org.joda.time.TestAllPackages

TestBuddhistChronology.testCalendar

TestCopticChronology.testCalendar

TestEthiopicChronology.testCalendar

TestIslamicChronology.testCalendar

Testing Gregorian chronology over 1000 iterations
100% complete (i=1000)

Testing Julian chronology over 1000 iterations
100% complete (i=1000)
Writing zoneinfo files
Writing ZoneInfoMap
Tests run: 4157, Failures: 64, Errors: 0, Skipped: 0, Time elapsed: 5.338 sec <<< FAILURE! - in org.joda.time.TestAllPackages
testWithers(org.joda.time.TestLocalDateTime_Basics)  Time elapsed: 0.005 sec  <<< FAILURE!
junit.framework.AssertionFailedError: expected:<2000> but was:<1970>
	at junit.framework.Assert.fail(Assert.java:47)
	at junit.framework.Assert.failNotEquals(Assert.java:280)
	at junit.framework.Assert.assertEquals(Assert.java:64)
	at junit.framework.Assert.assertEquals(Assert.java:198)
	at junit.framework.Assert.assertEquals(Assert.java:204)
	at org.joda.time.TestLocalDateTime_Basics.check(TestLocalDateTime_Basics.java:1101)
	at org.joda.time.TestLocalDateTime_Basics.testWithers(TestLocalDateTime_Basics.java:739)

testPlus_RP(org.joda.time.TestLocalDateTime_Basics)  Time elapsed: 0.01 sec  <<< FAILURE!
junit.framework.AssertionFailedError: expected:<2003-07-29T15:26:37.048> but was:<2002-05-03T10:20:30.040>
	at junit.framework.Assert.fail(Assert.java:47)
	at junit.framework.Assert.failNotEquals(Assert.java:280)
	at junit.framework.Assert.assertEquals(Assert.java:64)
	at junit.framework.Assert.assertEquals(Assert.java:71)
	at org.joda.time.TestLocalDateTime_Basics.testPlus_RP(TestLocalDateTime_Basics.java:537)

testPlusYears_int(org.joda.time.TestLocalDateTime_Basics)  Time elapsed: 0 sec  <<< FAILURE!
junit.framework.AssertionFailedError: expected:<2003-05-03T10:20:30.040> but was:<2002-05-03T10:20:30.040>
	at junit.framework.Assert.fail(Assert.java:47)
	at junit.framework.Assert.failNotEquals(Assert.java:280)
	at junit.framework.Assert.assertEquals(Assert.java:64)
	at junit.framework.Assert.assertEquals(Assert.java:71)
	at org.joda.time.TestLocalDateTime_Basics.testPlusYears_int(TestLocalDateTime_Basics.java:547)

testPlusMonths_int(org.joda.time.TestLocalDateTime_Basics)  Time elapsed: 0 sec  <<< FAILURE!
junit.framework.AssertionFailedError: expected:<2002-06-03T10:20:30.040> but was:<2002-05-03T10:20:30.040>
	at junit.framework.Assert.fail(Assert.java:47)
	at junit.framework.Assert.failNotEquals(Assert.java:280)
	at junit.framework.Assert.assertEquals(Assert.java:64)
	at junit.framework.Assert.assertEquals(Assert.java:71)
	at org.joda.time.TestLocalDateTime_Basics.testPlusMonths_int(TestLocalDateTime_Basics.java:557)

testPlusWeeks_int(org.joda.time.TestLocalDateTime_Basics)  Time elapsed: 0 sec  <<< FAILURE!
junit.framework.AssertionFailedError: expected:<2002-05-10T10:20:30.040> but was:<2002-05-03T10:20:30.040>
	at junit.framework.Assert.fail(Assert.java:47)
	at junit.framework.Assert.failNotEquals(Assert.java:280)
	at junit.framework.Assert.assertEquals(Assert.java:64)
	at junit.framework.Assert.assertEquals(Assert.java:71)
	at org.joda.time.TestLocalDateTime_Basics.testPlusWeeks_int(TestLocalDateTime_Basics.java:567)

testPlusDays_int(org.joda.time.TestLocalDateTime_Basics)  Time elapsed: 0 sec  <<< FAILURE!
junit.framework.AssertionFailedError: expected:<2002-05-04T10:20:30.040> but was:<2002-05-03T10:20:30.040>
	at junit.framework.Assert.fail(Assert.java:47)
	at junit.framework.Assert.failNotEquals(Assert.java:280)
	at junit.framework.Assert.assertEquals(Assert.java:64)
	at junit.framework.Assert.assertEquals(Assert.java:71)
	at org.joda.time.TestLocalDateTime_Basics.testPlusDays_int(TestLocalDateTime_Basics.java:577)

testPlusHours_int(org.joda.time.TestLocalDateTime_Basics)  Time elapsed: 0 sec  <<< FAILURE!
junit.framework.AssertionFailedError: expected:<2002-05-03T11:20:30.040> but was:<2002-05-03T10:20:30.040>
	at junit.framework.Assert.fail(Assert.java:47)
	at junit.framework.Assert.failNotEquals(Assert.java:280)
	at junit.framework.Assert.assertEquals(Assert.java:64)
	at junit.framework.Assert.assertEquals(Assert.java:71)
	at org.joda.time.TestLocalDateTime_Basics.testPlusHours_int(TestLocalDateTime_Basics.java:587)

testPlusMinutes_int(org.joda.time.TestLocalDateTime_Basics)  Time elapsed: 0 sec  <<< FAILURE!
junit.framework.AssertionFailedError: expected:<2002-05-03T10:21:30.040> but was:<2002-05-03T10:20:30.040>
	at junit.framework.Assert.fail(Assert.java:47)
	at junit.framework.Assert.failNotEquals(Assert.java:280)
	at junit.framework.Assert.assertEquals(Assert.java:64)
	at junit.framework.Assert.assertEquals(Assert.java:71)
	at org.joda.time.TestLocalDateTime_Basics.testPlusMinutes_int(TestLocalDateTime_Basics.java:597)

testPlusSeconds_int(org.joda.time.TestLocalDateTime_Basics)  Time elapsed: 0 sec  <<< FAILURE!
junit.framework.AssertionFailedError: expected:<2002-05-03T10:20:31.040> but was:<2002-05-03T10:20:30.040>
	at junit.framework.Assert.fail(Assert.java:47)
	at junit.framework.Assert.failNotEquals(Assert.java:280)
	at junit.framework.Assert.assertEquals(Assert.java:64)
	at junit.framework.Assert.assertEquals(Assert.java:71)
	at org.joda.time.TestLocalDateTime_Basics.testPlusSeconds_int(TestLocalDateTime_Basics.java:607)

testPlusMillis_int(org.joda.time.TestLocalDateTime_Basics)  Time elapsed: 0 sec  <<< FAILURE!
junit.framework.AssertionFailedError: expected:<2002-05-03T10:20:30.041> but was:<2002-05-03T10:20:30.040>
	at junit.framework.Assert.fail(Assert.java:47)
	at junit.framework.Assert.failNotEquals(Assert.java:280)
	at junit.framework.Assert.assertEquals(Assert.java:64)
	at junit.framework.Assert.assertEquals(Assert.java:71)
	at org.joda.time.TestLocalDateTime_Basics.testPlusMillis_int(TestLocalDateTime_Basics.java:617)

testMinus_RP(org.joda.time.TestLocalDateTime_Basics)  Time elapsed: 0 sec  <<< FAILURE!
junit.framework.AssertionFailedError: expected:<2001-03-26T09:19:29.039> but was:<2002-05-03T10:20:30.040>
	at junit.framework.Assert.fail(Assert.java:47)
	at junit.framework.Assert.failNotEquals(Assert.java:280)
	at junit.framework.Assert.assertEquals(Assert.java:64)
	at junit.framework.Assert.assertEquals(Assert.java:71)
	at org.joda.time.TestLocalDateTime_Basics.testMinus_RP(TestLocalDateTime_Basics.java:629)

testMinusYears_int(org.joda.time.TestLocalDateTime_Basics)  Time elapsed: 0.001 sec  <<< FAILURE!
junit.framework.AssertionFailedError: expected:<2001-05-03T10:20:30.040> but was:<2002-05-03T10:20:30.040>
	at junit.framework.Assert.fail(Assert.java:47)
	at junit.framework.Assert.failNotEquals(Assert.java:280)
	at junit.framework.Assert.assertEquals(Assert.java:64)
	at junit.framework.Assert.assertEquals(Assert.java:71)
	at org.joda.time.TestLocalDateTime_Basics.testMinusYears_int(TestLocalDateTime_Basics.java:639)

testMinusMonths_int(org.joda.time.TestLocalDateTime_Basics)  Time elapsed: 0.001 sec  <<< FAILURE!
junit.framework.AssertionFailedError: expected:<2002-04-03T10:20:30.040> but was:<2002-05-03T10:20:30.040>
	at junit.framework.Assert.fail(Assert.java:47)
	at junit.framework.Assert.failNotEquals(Assert.java:280)
	at junit.framework.Assert.assertEquals(Assert.java:64)
	at junit.framework.Assert.assertEquals(Assert.java:71)
	at org.joda.time.TestLocalDateTime_Basics.testMinusMonths_int(TestLocalDateTime_Basics.java:649)

testMinusWeeks_int(org.joda.time.TestLocalDateTime_Basics)  Time elapsed: 0 sec  <<< FAILURE!
junit.framework.AssertionFailedError: expected:<2002-04-26T10:20:30.040> but was:<2002-05-03T10:20:30.040>
	at junit.framework.Assert.fail(Assert.java:47)
	at junit.framework.Assert.failNotEquals(Assert.java:280)
	at junit.framework.Assert.assertEquals(Assert.java:64)
	at junit.framework.Assert.assertEquals(Assert.java:71)
	at org.joda.time.TestLocalDateTime_Basics.testMinusWeeks_int(TestLocalDateTime_Basics.java:659)

testMinusDays_int(org.joda.time.TestLocalDateTime_Basics)  Time elapsed: 0.001 sec  <<< FAILURE!
junit.framework.AssertionFailedError: expected:<2002-05-02T10:20:30.040> but was:<2002-05-03T10:20:30.040>
	at junit.framework.Assert.fail(Assert.java:47)
	at junit.framework.Assert.failNotEquals(Assert.java:280)
	at junit.framework.Assert.assertEquals(Assert.java:64)
	at junit.framework.Assert.assertEquals(Assert.java:71)
	at org.joda.time.TestLocalDateTime_Basics.testMinusDays_int(TestLocalDateTime_Basics.java:669)

testMinusHours_int(org.joda.time.TestLocalDateTime_Basics)  Time elapsed: 0.001 sec  <<< FAILURE!
junit.framework.AssertionFailedError: expected:<2002-05-03T09:20:30.040> but was:<2002-05-03T10:20:30.040>
	at junit.framework.Assert.fail(Assert.java:47)
	at junit.framework.Assert.failNotEquals(Assert.java:280)
	at junit.framework.Assert.assertEquals(Assert.java:64)
	at junit.framework.Assert.assertEquals(Assert.java:71)
	at org.joda.time.TestLocalDateTime_Basics.testMinusHours_int(TestLocalDateTime_Basics.java:679)

testMinusMinutes_int(org.joda.time.TestLocalDateTime_Basics)  Time elapsed: 0.001 sec  <<< FAILURE!
junit.framework.AssertionFailedError: expected:<2002-05-03T10:19:30.040> but was:<2002-05-03T10:20:30.040>
	at junit.framework.Assert.fail(Assert.java:47)
	at junit.framework.Assert.failNotEquals(Assert.java:280)
	at junit.framework.Assert.assertEquals(Assert.java:64)
	at junit.framework.Assert.assertEquals(Assert.java:71)
	at org.joda.time.TestLocalDateTime_Basics.testMinusMinutes_int(TestLocalDateTime_Basics.java:689)

testMinusSeconds_int(org.joda.time.TestLocalDateTime_Basics)  Time elapsed: 0.001 sec  <<< FAILURE!
junit.framework.AssertionFailedError: expected:<2002-05-03T10:20:29.040> but was:<2002-05-03T10:20:30.040>
	at junit.framework.Assert.fail(Assert.java:47)
	at junit.framework.Assert.failNotEquals(Assert.java:280)
	at junit.framework.Assert.assertEquals(Assert.java:64)
	at junit.framework.Assert.assertEquals(Assert.java:71)
	at org.joda.time.TestLocalDateTime_Basics.testMinusSeconds_int(TestLocalDateTime_Basics.java:699)

testMinusMillis_int(org.joda.time.TestLocalDateTime_Basics)  Time elapsed: 0.001 sec  <<< FAILURE!
junit.framework.AssertionFailedError: expected:<2002-05-03T10:20:30.039> but was:<2002-05-03T10:20:30.040>
	at junit.framework.Assert.fail(Assert.java:47)
	at junit.framework.Assert.failNotEquals(Assert.java:280)
	at junit.framework.Assert.assertEquals(Assert.java:64)
	at junit.framework.Assert.assertEquals(Assert.java:71)
	at org.joda.time.TestLocalDateTime_Basics.testMinusMillis_int(TestLocalDateTime_Basics.java:709)

testWithDate(org.joda.time.TestLocalDateTime_Basics)  Time elapsed: 0 sec  <<< FAILURE!
junit.framework.AssertionFailedError: expected:<2006> but was:<2004>
	at junit.framework.Assert.fail(Assert.java:47)
	at junit.framework.Assert.failNotEquals(Assert.java:280)
	at junit.framework.Assert.assertEquals(Assert.java:64)
	at junit.framework.Assert.assertEquals(Assert.java:198)
	at junit.framework.Assert.assertEquals(Assert.java:204)
	at org.joda.time.TestLocalDateTime_Basics.check(TestLocalDateTime_Basics.java:1101)
	at org.joda.time.TestLocalDateTime_Basics.testWithDate(TestLocalDateTime_Basics.java:465)

testWithTime(org.joda.time.TestLocalDateTime_Basics)  Time elapsed: 0.001 sec  <<< FAILURE!
junit.framework.AssertionFailedError: expected:<9> but was:<10>
	at junit.framework.Assert.fail(Assert.java:47)
	at junit.framework.Assert.failNotEquals(Assert.java:280)
	at junit.framework.Assert.assertEquals(Assert.java:64)
	at junit.framework.Assert.assertEquals(Assert.java:198)
	at junit.framework.Assert.assertEquals(Assert.java:204)
	at org.joda.time.TestLocalDateTime_Basics.check(TestLocalDateTime_Basics.java:1104)
	at org.joda.time.TestLocalDateTime_Basics.testWithTime(TestLocalDateTime_Basics.java:474)

testWithField_DateTimeFieldType_int_1(org.joda.time.TestLocalDateTime_Basics)  Time elapsed: 0.001 sec  <<< FAILURE!
junit.framework.AssertionFailedError: expected:<2006-06-09T10:20:30.040> but was:<2004-06-09T10:20:30.040>
	at junit.framework.Assert.fail(Assert.java:47)
	at junit.framework.Assert.failNotEquals(Assert.java:280)
	at junit.framework.Assert.assertEquals(Assert.java:64)
	at junit.framework.Assert.assertEquals(Assert.java:71)
	at org.joda.time.TestLocalDateTime_Basics.testWithField_DateTimeFieldType_int_1(TestLocalDateTime_Basics.java:483)

testWithField_DateTimeFieldType_int_3(org.joda.time.TestLocalDateTime_Basics)  Time elapsed: 0.001 sec  <<< FAILURE!
junit.framework.AssertionFailedError: expected same:<2004-06-09T10:20:30.040> was not:<2004-06-09T10:20:30.040>
	at junit.framework.Assert.fail(Assert.java:47)
	at junit.framework.Assert.failNotSame(Assert.java:276)
	at junit.framework.Assert.assertSame(Assert.java:239)
	at junit.framework.Assert.assertSame(Assert.java:246)
	at org.joda.time.TestLocalDateTime_Basics.testWithField_DateTimeFieldType_int_3(TestLocalDateTime_Basics.java:498)

testWithFieldAdded_DurationFieldType_int_1(org.joda.time.TestLocalDateTime_Basics)  Time elapsed: 0 sec  <<< FAILURE!
junit.framework.AssertionFailedError: expected:<2010-06-09T10:20:30.040> but was:<2004-06-09T10:20:30.040>
	at junit.framework.Assert.fail(Assert.java:47)
	at junit.framework.Assert.failNotEquals(Assert.java:280)
	at junit.framework.Assert.assertEquals(Assert.java:64)
	at junit.framework.Assert.assertEquals(Assert.java:71)
	at org.joda.time.TestLocalDateTime_Basics.testWithFieldAdded_DurationFieldType_int_1(TestLocalDateTime_Basics.java:507)

testPropertyWithMaximumValueDayOfMonth(org.joda.time.TestLocalDateTime_Properties)  Time elapsed: 0 sec  <<< FAILURE!
junit.framework.AssertionFailedError: expected:<30> but was:<9>
	at junit.framework.Assert.fail(Assert.java:47)
	at junit.framework.Assert.failNotEquals(Assert.java:280)
	at junit.framework.Assert.assertEquals(Assert.java:64)
	at junit.framework.Assert.assertEquals(Assert.java:198)
	at junit.framework.Assert.assertEquals(Assert.java:204)
	at org.joda.time.TestLocalDateTime_Properties.check(TestLocalDateTime_Properties.java:1078)
	at org.joda.time.TestLocalDateTime_Properties.testPropertyWithMaximumValueDayOfMonth(TestLocalDateTime_Properties.java:464)

testPropertyWithMinimumValueDayOfMonth(org.joda.time.TestLocalDateTime_Properties)  Time elapsed: 0.001 sec  <<< FAILURE!
junit.framework.AssertionFailedError: expected:<1> but was:<9>
	at junit.framework.Assert.fail(Assert.java:47)
	at junit.framework.Assert.failNotEquals(Assert.java:280)
	at junit.framework.Assert.assertEquals(Assert.java:64)
	at junit.framework.Assert.assertEquals(Assert.java:198)
	at junit.framework.Assert.assertEquals(Assert.java:204)
	at org.joda.time.TestLocalDateTime_Properties.check(TestLocalDateTime_Properties.java:1078)
	at org.joda.time.TestLocalDateTime_Properties.testPropertyWithMinimumValueDayOfMonth(TestLocalDateTime_Properties.java:471)

testPropertyAddToCopyMinute(org.joda.time.TestLocalDateTime_Properties)  Time elapsed: 0.001 sec  <<< FAILURE!
junit.framework.AssertionFailedError: expected:<29> but was:<20>
	at junit.framework.Assert.fail(Assert.java:47)
	at junit.framework.Assert.failNotEquals(Assert.java:280)
	at junit.framework.Assert.assertEquals(Assert.java:64)
	at junit.framework.Assert.assertEquals(Assert.java:198)
	at junit.framework.Assert.assertEquals(Assert.java:204)
	at org.joda.time.TestLocalDateTime_Properties.check(TestLocalDateTime_Properties.java:1080)
	at org.joda.time.TestLocalDateTime_Properties.testPropertyAddToCopyMinute(TestLocalDateTime_Properties.java:727)

testPropertyAddWrapFieldToCopyMinute(org.joda.time.TestLocalDateTime_Properties)  Time elapsed: 0 sec  <<< FAILURE!
junit.framework.AssertionFailedError: expected:<29> but was:<20>
	at junit.framework.Assert.fail(Assert.java:47)
	at junit.framework.Assert.failNotEquals(Assert.java:280)
	at junit.framework.Assert.assertEquals(Assert.java:64)
	at junit.framework.Assert.assertEquals(Assert.java:198)
	at junit.framework.Assert.assertEquals(Assert.java:204)
	at org.joda.time.TestLocalDateTime_Properties.check(TestLocalDateTime_Properties.java:1080)
	at org.joda.time.TestLocalDateTime_Properties.testPropertyAddWrapFieldToCopyMinute(TestLocalDateTime_Properties.java:767)

testPropertySetMinute(org.joda.time.TestLocalDateTime_Properties)  Time elapsed: 0 sec  <<< FAILURE!
junit.framework.AssertionFailedError: expected:<12> but was:<20>
	at junit.framework.Assert.fail(Assert.java:47)
	at junit.framework.Assert.failNotEquals(Assert.java:280)
	at junit.framework.Assert.assertEquals(Assert.java:64)
	at junit.framework.Assert.assertEquals(Assert.java:198)
	at junit.framework.Assert.assertEquals(Assert.java:204)
	at org.joda.time.TestLocalDateTime_Properties.check(TestLocalDateTime_Properties.java:1080)
	at org.joda.time.TestLocalDateTime_Properties.testPropertySetMinute(TestLocalDateTime_Properties.java:780)

testPropertySetTextMinute(org.joda.time.TestLocalDateTime_Properties)  Time elapsed: 0.001 sec  <<< FAILURE!
junit.framework.AssertionFailedError: expected:<12> but was:<20>
	at junit.framework.Assert.fail(Assert.java:47)
	at junit.framework.Assert.failNotEquals(Assert.java:280)
	at junit.framework.Assert.assertEquals(Assert.java:64)
	at junit.framework.Assert.assertEquals(Assert.java:198)
	at junit.framework.Assert.assertEquals(Assert.java:204)
	at org.joda.time.TestLocalDateTime_Properties.check(TestLocalDateTime_Properties.java:1080)
	at org.joda.time.TestLocalDateTime_Properties.testPropertySetTextMinute(TestLocalDateTime_Properties.java:796)

testPropertyWithMaxMinValueSecond(org.joda.time.TestLocalDateTime_Properties)  Time elapsed: 0.001 sec  <<< FAILURE!
junit.framework.AssertionFailedError: expected:<59> but was:<30>
	at junit.framework.Assert.fail(Assert.java:47)
	at junit.framework.Assert.failNotEquals(Assert.java:280)
	at junit.framework.Assert.assertEquals(Assert.java:64)
	at junit.framework.Assert.assertEquals(Assert.java:198)
	at junit.framework.Assert.assertEquals(Assert.java:204)
	at org.joda.time.TestLocalDateTime_Properties.check(TestLocalDateTime_Properties.java:1081)
	at org.joda.time.TestLocalDateTime_Properties.testPropertyWithMaxMinValueSecond(TestLocalDateTime_Properties.java:850)

testPropertyAddToCopySecond(org.joda.time.TestLocalDateTime_Properties)  Time elapsed: 0 sec  <<< FAILURE!
junit.framework.AssertionFailedError: expected:<39> but was:<30>
	at junit.framework.Assert.fail(Assert.java:47)
	at junit.framework.Assert.failNotEquals(Assert.java:280)
	at junit.framework.Assert.assertEquals(Assert.java:64)
	at junit.framework.Assert.assertEquals(Assert.java:198)
	at junit.framework.Assert.assertEquals(Assert.java:204)
	at org.joda.time.TestLocalDateTime_Properties.check(TestLocalDateTime_Properties.java:1081)
	at org.joda.time.TestLocalDateTime_Properties.testPropertyAddToCopySecond(TestLocalDateTime_Properties.java:858)

testPropertyAddWrapFieldToCopySecond(org.joda.time.TestLocalDateTime_Properties)  Time elapsed: 0.001 sec  <<< FAILURE!
junit.framework.AssertionFailedError: expected:<39> but was:<30>
	at junit.framework.Assert.fail(Assert.java:47)
	at junit.framework.Assert.failNotEquals(Assert.java:280)
	at junit.framework.Assert.assertEquals(Assert.java:64)
	at junit.framework.Assert.assertEquals(Assert.java:198)
	at junit.framework.Assert.assertEquals(Assert.java:204)
	at org.joda.time.TestLocalDateTime_Properties.check(TestLocalDateTime_Properties.java:1081)
	at org.joda.time.TestLocalDateTime_Properties.testPropertyAddWrapFieldToCopySecond(TestLocalDateTime_Properties.java:895)

testPropertySetSecond(org.joda.time.TestLocalDateTime_Properties)  Time elapsed: 0 sec  <<< FAILURE!
junit.framework.AssertionFailedError: expected:<12> but was:<30>
	at junit.framework.Assert.fail(Assert.java:47)
	at junit.framework.Assert.failNotEquals(Assert.java:280)
	at junit.framework.Assert.assertEquals(Assert.java:64)
	at junit.framework.Assert.assertEquals(Assert.java:198)
	at junit.framework.Assert.assertEquals(Assert.java:204)
	at org.joda.time.TestLocalDateTime_Properties.check(TestLocalDateTime_Properties.java:1081)
	at org.joda.time.TestLocalDateTime_Properties.testPropertySetSecond(TestLocalDateTime_Properties.java:908)

testPropertySetTextSecond(org.joda.time.TestLocalDateTime_Properties)  Time elapsed: 0.001 sec  <<< FAILURE!
junit.framework.AssertionFailedError: expected:<12> but was:<30>
	at junit.framework.Assert.fail(Assert.java:47)
	at junit.framework.Assert.failNotEquals(Assert.java:280)
	at junit.framework.Assert.assertEquals(Assert.java:64)
	at junit.framework.Assert.assertEquals(Assert.java:198)
	at junit.framework.Assert.assertEquals(Assert.java:204)
	at org.joda.time.TestLocalDateTime_Properties.check(TestLocalDateTime_Properties.java:1081)
	at org.joda.time.TestLocalDateTime_Properties.testPropertySetTextSecond(TestLocalDateTime_Properties.java:924)

testPropertyWithMaxMinValueMilli(org.joda.time.TestLocalDateTime_Properties)  Time elapsed: 0.001 sec  <<< FAILURE!
junit.framework.AssertionFailedError: expected:<999> but was:<40>
	at junit.framework.Assert.fail(Assert.java:47)
	at junit.framework.Assert.failNotEquals(Assert.java:280)
	at junit.framework.Assert.assertEquals(Assert.java:64)
	at junit.framework.Assert.assertEquals(Assert.java:198)
	at junit.framework.Assert.assertEquals(Assert.java:204)
	at org.joda.time.TestLocalDateTime_Properties.check(TestLocalDateTime_Properties.java:1082)
	at org.joda.time.TestLocalDateTime_Properties.testPropertyWithMaxMinValueMilli(TestLocalDateTime_Properties.java:978)

testPropertyAddToCopyMilli(org.joda.time.TestLocalDateTime_Properties)  Time elapsed: 0 sec  <<< FAILURE!
junit.framework.AssertionFailedError: expected:<49> but was:<40>
	at junit.framework.Assert.fail(Assert.java:47)
	at junit.framework.Assert.failNotEquals(Assert.java:280)
	at junit.framework.Assert.assertEquals(Assert.java:64)
	at junit.framework.Assert.assertEquals(Assert.java:198)
	at junit.framework.Assert.assertEquals(Assert.java:204)
	at org.joda.time.TestLocalDateTime_Properties.check(TestLocalDateTime_Properties.java:1082)
	at org.joda.time.TestLocalDateTime_Properties.testPropertyAddToCopyMilli(TestLocalDateTime_Properties.java:986)

testPropertyAddWrapFieldToCopyMilli(org.joda.time.TestLocalDateTime_Properties)  Time elapsed: 0.001 sec  <<< FAILURE!
junit.framework.AssertionFailedError: expected:<49> but was:<40>
	at junit.framework.Assert.fail(Assert.java:47)
	at junit.framework.Assert.failNotEquals(Assert.java:280)
	at junit.framework.Assert.assertEquals(Assert.java:64)
	at junit.framework.Assert.assertEquals(Assert.java:198)
	at junit.framework.Assert.assertEquals(Assert.java:204)
	at org.joda.time.TestLocalDateTime_Properties.check(TestLocalDateTime_Properties.java:1082)
	at org.joda.time.TestLocalDateTime_Properties.testPropertyAddWrapFieldToCopyMilli(TestLocalDateTime_Properties.java:1020)

testPropertySetMilli(org.joda.time.TestLocalDateTime_Properties)  Time elapsed: 0 sec  <<< FAILURE!
junit.framework.AssertionFailedError: expected:<12> but was:<40>
	at junit.framework.Assert.fail(Assert.java:47)
	at junit.framework.Assert.failNotEquals(Assert.java:280)
	at junit.framework.Assert.assertEquals(Assert.java:64)
	at junit.framework.Assert.assertEquals(Assert.java:198)
	at junit.framework.Assert.assertEquals(Assert.java:204)
	at org.joda.time.TestLocalDateTime_Properties.check(TestLocalDateTime_Properties.java:1082)
	at org.joda.time.TestLocalDateTime_Properties.testPropertySetMilli(TestLocalDateTime_Properties.java:1033)

testPropertySetTextMilli(org.joda.time.TestLocalDateTime_Properties)  Time elapsed: 0.001 sec  <<< FAILURE!
junit.framework.AssertionFailedError: expected:<12> but was:<40>
	at junit.framework.Assert.fail(Assert.java:47)
	at junit.framework.Assert.failNotEquals(Assert.java:280)
	at junit.framework.Assert.assertEquals(Assert.java:64)
	at junit.framework.Assert.assertEquals(Assert.java:198)
	at junit.framework.Assert.assertEquals(Assert.java:204)
	at org.joda.time.TestLocalDateTime_Properties.check(TestLocalDateTime_Properties.java:1082)
	at org.joda.time.TestLocalDateTime_Properties.testPropertySetTextMilli(TestLocalDateTime_Properties.java:1049)

testPropertyAddToCopyYear(org.joda.time.TestLocalDateTime_Properties)  Time elapsed: 0.001 sec  <<< FAILURE!
junit.framework.AssertionFailedError: expected:<1981> but was:<1972>
	at junit.framework.Assert.fail(Assert.java:47)
	at junit.framework.Assert.failNotEquals(Assert.java:280)
	at junit.framework.Assert.assertEquals(Assert.java:64)
	at junit.framework.Assert.assertEquals(Assert.java:198)
	at junit.framework.Assert.assertEquals(Assert.java:204)
	at org.joda.time.TestLocalDateTime_Properties.check(TestLocalDateTime_Properties.java:1076)
	at org.joda.time.TestLocalDateTime_Properties.testPropertyAddToCopyYear(TestLocalDateTime_Properties.java:118)

testPropertyAddWrapFieldToCopyYear(org.joda.time.TestLocalDateTime_Properties)  Time elapsed: 0 sec  <<< FAILURE!
junit.framework.AssertionFailedError: expected:<1981> but was:<1972>
	at junit.framework.Assert.fail(Assert.java:47)
	at junit.framework.Assert.failNotEquals(Assert.java:280)
	at junit.framework.Assert.assertEquals(Assert.java:64)
	at junit.framework.Assert.assertEquals(Assert.java:198)
	at junit.framework.Assert.assertEquals(Assert.java:204)
	at org.joda.time.TestLocalDateTime_Properties.check(TestLocalDateTime_Properties.java:1076)
	at org.joda.time.TestLocalDateTime_Properties.testPropertyAddWrapFieldToCopyYear(TestLocalDateTime_Properties.java:149)

testPropertySetCopyTextMonth(org.joda.time.TestLocalDateTime_Properties)  Time elapsed: 0.001 sec  <<< FAILURE!
junit.framework.AssertionFailedError: expected:<12> but was:<6>
	at junit.framework.Assert.fail(Assert.java:47)
	at junit.framework.Assert.failNotEquals(Assert.java:280)
	at junit.framework.Assert.assertEquals(Assert.java:64)
	at junit.framework.Assert.assertEquals(Assert.java:198)
	at junit.framework.Assert.assertEquals(Assert.java:204)
	at org.joda.time.TestLocalDateTime_Properties.check(TestLocalDateTime_Properties.java:1077)
	at org.joda.time.TestLocalDateTime_Properties.testPropertySetCopyTextMonth(TestLocalDateTime_Properties.java:308)

testPropertyAddToCopyDay(org.joda.time.TestLocalDateTime_Properties)  Time elapsed: 0.001 sec  <<< FAILURE!
junit.framework.AssertionFailedError: expected:<18> but was:<9>
	at junit.framework.Assert.fail(Assert.java:47)
	at junit.framework.Assert.failNotEquals(Assert.java:280)
	at junit.framework.Assert.assertEquals(Assert.java:64)
	at junit.framework.Assert.assertEquals(Assert.java:198)
	at junit.framework.Assert.assertEquals(Assert.java:204)
	at org.joda.time.TestLocalDateTime_Properties.check(TestLocalDateTime_Properties.java:1078)
	at org.joda.time.TestLocalDateTime_Properties.testPropertyAddToCopyDay(TestLocalDateTime_Properties.java:378)

testPropertyAddWrapFieldToCopyDay(org.joda.time.TestLocalDateTime_Properties)  Time elapsed: 0 sec  <<< FAILURE!
junit.framework.AssertionFailedError: expected:<30> but was:<9>
	at junit.framework.Assert.fail(Assert.java:47)
	at junit.framework.Assert.failNotEquals(Assert.java:280)
	at junit.framework.Assert.assertEquals(Assert.java:64)
	at junit.framework.Assert.assertEquals(Assert.java:198)
	at junit.framework.Assert.assertEquals(Assert.java:204)
	at org.joda.time.TestLocalDateTime_Properties.check(TestLocalDateTime_Properties.java:1078)
	at org.joda.time.TestLocalDateTime_Properties.testPropertyAddWrapFieldToCopyDay(TestLocalDateTime_Properties.java:415)

testPropertySetCopyDay(org.joda.time.TestLocalDateTime_Properties)  Time elapsed: 0.001 sec  <<< FAILURE!
junit.framework.AssertionFailedError: expected:<12> but was:<9>
	at junit.framework.Assert.fail(Assert.java:47)
	at junit.framework.Assert.failNotEquals(Assert.java:280)
	at junit.framework.Assert.assertEquals(Assert.java:64)
	at junit.framework.Assert.assertEquals(Assert.java:198)
	at junit.framework.Assert.assertEquals(Assert.java:204)
	at org.joda.time.TestLocalDateTime_Properties.check(TestLocalDateTime_Properties.java:1078)
	at org.joda.time.TestLocalDateTime_Properties.testPropertySetCopyDay(TestLocalDateTime_Properties.java:441)

testPropertySetCopyTextDay(org.joda.time.TestLocalDateTime_Properties)  Time elapsed: 0 sec  <<< FAILURE!
junit.framework.AssertionFailedError: expected:<12> but was:<9>
	at junit.framework.Assert.fail(Assert.java:47)
	at junit.framework.Assert.failNotEquals(Assert.java:280)
	at junit.framework.Assert.assertEquals(Assert.java:64)
	at junit.framework.Assert.assertEquals(Assert.java:198)
	at junit.framework.Assert.assertEquals(Assert.java:204)
	at org.joda.time.TestLocalDateTime_Properties.check(TestLocalDateTime_Properties.java:1078)
	at org.joda.time.TestLocalDateTime_Properties.testPropertySetCopyTextDay(TestLocalDateTime_Properties.java:457)

testPropertyRoundHour(org.joda.time.TestLocalDateTime_Properties)  Time elapsed: 0 sec  <<< FAILURE!
junit.framework.AssertionFailedError: expected:<11> but was:<10>
	at junit.framework.Assert.fail(Assert.java:47)
	at junit.framework.Assert.failNotEquals(Assert.java:280)
	at junit.framework.Assert.assertEquals(Assert.java:64)
	at junit.framework.Assert.assertEquals(Assert.java:198)
	at junit.framework.Assert.assertEquals(Assert.java:204)
	at org.joda.time.TestLocalDateTime_Properties.check(TestLocalDateTime_Properties.java:1079)
	at org.joda.time.TestLocalDateTime_Properties.testPropertyRoundHour(TestLocalDateTime_Properties.java:551)

testPropertyWithMaxMinValueHour(org.joda.time.TestLocalDateTime_Properties)  Time elapsed: 0.001 sec  <<< FAILURE!
junit.framework.AssertionFailedError: expected:<23> but was:<0>
	at junit.framework.Assert.fail(Assert.java:47)
	at junit.framework.Assert.failNotEquals(Assert.java:280)
	at junit.framework.Assert.assertEquals(Assert.java:64)
	at junit.framework.Assert.assertEquals(Assert.java:198)
	at junit.framework.Assert.assertEquals(Assert.java:204)
	at org.joda.time.TestLocalDateTime_Properties.check(TestLocalDateTime_Properties.java:1079)
	at org.joda.time.TestLocalDateTime_Properties.testPropertyWithMaxMinValueHour(TestLocalDateTime_Properties.java:589)

testPropertyAddToCopyHour(org.joda.time.TestLocalDateTime_Properties)  Time elapsed: 0 sec  <<< FAILURE!
junit.framework.AssertionFailedError: expected:<19> but was:<10>
	at junit.framework.Assert.fail(Assert.java:47)
	at junit.framework.Assert.failNotEquals(Assert.java:280)
	at junit.framework.Assert.assertEquals(Assert.java:64)
	at junit.framework.Assert.assertEquals(Assert.java:198)
	at junit.framework.Assert.assertEquals(Assert.java:204)
	at org.joda.time.TestLocalDateTime_Properties.check(TestLocalDateTime_Properties.java:1079)
	at org.joda.time.TestLocalDateTime_Properties.testPropertyAddToCopyHour(TestLocalDateTime_Properties.java:597)

testPropertyAddWrapFieldToCopyHour(org.joda.time.TestLocalDateTime_Properties)  Time elapsed: 0.001 sec  <<< FAILURE!
junit.framework.AssertionFailedError: expected:<19> but was:<10>
	at junit.framework.Assert.fail(Assert.java:47)
	at junit.framework.Assert.failNotEquals(Assert.java:280)
	at junit.framework.Assert.assertEquals(Assert.java:64)
	at junit.framework.Assert.assertEquals(Assert.java:198)
	at junit.framework.Assert.assertEquals(Assert.java:204)
	at org.joda.time.TestLocalDateTime_Properties.check(TestLocalDateTime_Properties.java:1079)
	at org.joda.time.TestLocalDateTime_Properties.testPropertyAddWrapFieldToCopyHour(TestLocalDateTime_Properties.java:619)

testPropertySetHour(org.joda.time.TestLocalDateTime_Properties)  Time elapsed: 0 sec  <<< FAILURE!
junit.framework.AssertionFailedError: expected:<12> but was:<10>
	at junit.framework.Assert.fail(Assert.java:47)
	at junit.framework.Assert.failNotEquals(Assert.java:280)
	at junit.framework.Assert.assertEquals(Assert.java:64)
	at junit.framework.Assert.assertEquals(Assert.java:198)
	at junit.framework.Assert.assertEquals(Assert.java:204)
	at org.joda.time.TestLocalDateTime_Properties.check(TestLocalDateTime_Properties.java:1079)
	at org.joda.time.TestLocalDateTime_Properties.testPropertySetHour(TestLocalDateTime_Properties.java:635)

testPropertySetTextHour(org.joda.time.TestLocalDateTime_Properties)  Time elapsed: 0 sec  <<< FAILURE!
junit.framework.AssertionFailedError: expected:<12> but was:<10>
	at junit.framework.Assert.fail(Assert.java:47)
	at junit.framework.Assert.failNotEquals(Assert.java:280)
	at junit.framework.Assert.assertEquals(Assert.java:64)
	at junit.framework.Assert.assertEquals(Assert.java:198)
	at junit.framework.Assert.assertEquals(Assert.java:204)
	at org.joda.time.TestLocalDateTime_Properties.check(TestLocalDateTime_Properties.java:1079)
	at org.joda.time.TestLocalDateTime_Properties.testPropertySetTextHour(TestLocalDateTime_Properties.java:651)

testPropertyWithMaximumValueHour(org.joda.time.TestLocalDateTime_Properties)  Time elapsed: 0 sec  <<< FAILURE!
junit.framework.AssertionFailedError: expected:<23> but was:<10>
	at junit.framework.Assert.fail(Assert.java:47)
	at junit.framework.Assert.failNotEquals(Assert.java:280)
	at junit.framework.Assert.assertEquals(Assert.java:64)
	at junit.framework.Assert.assertEquals(Assert.java:198)
	at junit.framework.Assert.assertEquals(Assert.java:204)
	at org.joda.time.TestLocalDateTime_Properties.check(TestLocalDateTime_Properties.java:1079)
	at org.joda.time.TestLocalDateTime_Properties.testPropertyWithMaximumValueHour(TestLocalDateTime_Properties.java:658)

testPropertyWithMinimumValueHour(org.joda.time.TestLocalDateTime_Properties)  Time elapsed: 0.001 sec  <<< FAILURE!
junit.framework.AssertionFailedError: expected:<0> but was:<10>
	at junit.framework.Assert.fail(Assert.java:47)
	at junit.framework.Assert.failNotEquals(Assert.java:280)
	at junit.framework.Assert.assertEquals(Assert.java:64)
	at junit.framework.Assert.assertEquals(Assert.java:198)
	at junit.framework.Assert.assertEquals(Assert.java:204)
	at org.joda.time.TestLocalDateTime_Properties.check(TestLocalDateTime_Properties.java:1079)
	at org.joda.time.TestLocalDateTime_Properties.testPropertyWithMinimumValueHour(TestLocalDateTime_Properties.java:665)

testPropertyWithMaxMinValueMinute(org.joda.time.TestLocalDateTime_Properties)  Time elapsed: 0 sec  <<< FAILURE!
junit.framework.AssertionFailedError: expected:<59> but was:<20>
	at junit.framework.Assert.fail(Assert.java:47)
	at junit.framework.Assert.failNotEquals(Assert.java:280)
	at junit.framework.Assert.assertEquals(Assert.java:64)
	at junit.framework.Assert.assertEquals(Assert.java:198)
	at junit.framework.Assert.assertEquals(Assert.java:204)
	at org.joda.time.TestLocalDateTime_Properties.check(TestLocalDateTime_Properties.java:1080)
	at org.joda.time.TestLocalDateTime_Properties.testPropertyWithMaxMinValueMinute(TestLocalDateTime_Properties.java:719)

testPropertySetCopyYear(org.joda.time.TestLocalDateTime_Properties)  Time elapsed: 0.001 sec  <<< FAILURE!
junit.framework.AssertionFailedError: expected:<12> but was:<1972>
	at junit.framework.Assert.fail(Assert.java:47)
	at junit.framework.Assert.failNotEquals(Assert.java:280)
	at junit.framework.Assert.assertEquals(Assert.java:64)
	at junit.framework.Assert.assertEquals(Assert.java:198)
	at junit.framework.Assert.assertEquals(Assert.java:204)
	at org.joda.time.TestLocalDateTime_Properties.check(TestLocalDateTime_Properties.java:1076)
	at org.joda.time.TestLocalDateTime_Properties.testPropertySetCopyYear(TestLocalDateTime_Properties.java:165)

testPropertySetCopyTextYear(org.joda.time.TestLocalDateTime_Properties)  Time elapsed: 0 sec  <<< FAILURE!
junit.framework.AssertionFailedError: expected:<12> but was:<1972>
	at junit.framework.Assert.fail(Assert.java:47)
	at junit.framework.Assert.failNotEquals(Assert.java:280)
	at junit.framework.Assert.assertEquals(Assert.java:64)
	at junit.framework.Assert.assertEquals(Assert.java:198)
	at junit.framework.Assert.assertEquals(Assert.java:204)
	at org.joda.time.TestLocalDateTime_Properties.check(TestLocalDateTime_Properties.java:1076)
	at org.joda.time.TestLocalDateTime_Properties.testPropertySetCopyTextYear(TestLocalDateTime_Properties.java:172)

testPropertyAddToCopyMonth(org.joda.time.TestLocalDateTime_Properties)  Time elapsed: 0 sec  <<< FAILURE!
junit.framework.AssertionFailedError: expected:<12> but was:<6>
	at junit.framework.Assert.fail(Assert.java:47)
	at junit.framework.Assert.failNotEquals(Assert.java:280)
	at junit.framework.Assert.assertEquals(Assert.java:64)
	at junit.framework.Assert.assertEquals(Assert.java:198)
	at junit.framework.Assert.assertEquals(Assert.java:204)
	at org.joda.time.TestLocalDateTime_Properties.check(TestLocalDateTime_Properties.java:1077)
	at org.joda.time.TestLocalDateTime_Properties.testPropertyAddToCopyMonth(TestLocalDateTime_Properties.java:231)

testPropertyAddWrapFieldToCopyMonth(org.joda.time.TestLocalDateTime_Properties)  Time elapsed: 0.002 sec  <<< FAILURE!
junit.framework.AssertionFailedError: expected:<10> but was:<6>
	at junit.framework.Assert.fail(Assert.java:47)
	at junit.framework.Assert.failNotEquals(Assert.java:280)
	at junit.framework.Assert.assertEquals(Assert.java:64)
	at junit.framework.Assert.assertEquals(Assert.java:198)
	at junit.framework.Assert.assertEquals(Assert.java:204)
	at org.joda.time.TestLocalDateTime_Properties.check(TestLocalDateTime_Properties.java:1077)
	at org.joda.time.TestLocalDateTime_Properties.testPropertyAddWrapFieldToCopyMonth(TestLocalDateTime_Properties.java:261)

testPropertySetCopyMonth(org.joda.time.TestLocalDateTime_Properties)  Time elapsed: 0 sec  <<< FAILURE!
junit.framework.AssertionFailedError: expected:<12> but was:<6>
	at junit.framework.Assert.fail(Assert.java:47)
	at junit.framework.Assert.failNotEquals(Assert.java:280)
	at junit.framework.Assert.assertEquals(Assert.java:64)
	at junit.framework.Assert.assertEquals(Assert.java:198)
	at junit.framework.Assert.assertEquals(Assert.java:204)
	at org.joda.time.TestLocalDateTime_Properties.check(TestLocalDateTime_Properties.java:1077)
	at org.joda.time.TestLocalDateTime_Properties.testPropertySetCopyMonth(TestLocalDateTime_Properties.java:288)

testAddToLocalDate(org.joda.time.TestHours)  Time elapsed: 0.001 sec  <<< FAILURE!
junit.framework.AssertionFailedError: expected:<2006-06-02T02:00:00.000> but was:<2006-06-01T00:00:00.000>
	at junit.framework.Assert.fail(Assert.java:47)
	at junit.framework.Assert.failNotEquals(Assert.java:280)
	at junit.framework.Assert.assertEquals(Assert.java:64)
	at junit.framework.Assert.assertEquals(Assert.java:71)
	at org.joda.time.TestHours.testAddToLocalDate(TestHours.java:394)

testAddToLocalDate(org.joda.time.TestMinutes)  Time elapsed: 0 sec  <<< FAILURE!
junit.framework.AssertionFailedError: expected:<2006-06-01T00:26:00.000> but was:<2006-06-01T00:00:00.000>
	at junit.framework.Assert.fail(Assert.java:47)
	at junit.framework.Assert.failNotEquals(Assert.java:280)
	at junit.framework.Assert.assertEquals(Assert.java:64)
	at junit.framework.Assert.assertEquals(Assert.java:71)
	at org.joda.time.TestMinutes.testAddToLocalDate(TestMinutes.java:377)

testAddToLocalDate(org.joda.time.TestSeconds)  Time elapsed: 0 sec  <<< FAILURE!
junit.framework.AssertionFailedError: expected:<2006-06-01T00:00:26.000> but was:<2006-06-01T00:00:00.000>
	at junit.framework.Assert.fail(Assert.java:47)
	at junit.framework.Assert.failNotEquals(Assert.java:280)
	at junit.framework.Assert.assertEquals(Assert.java:64)
	at junit.framework.Assert.assertEquals(Assert.java:71)
	at org.joda.time.TestSeconds.testAddToLocalDate(TestSeconds.java:367)


Results :

Failed tests: 
  org.joda.time.TestHours#testAddToLocalDate AssertionFailedError expected:<2006...
  org.joda.time.TestLocalDateTime_Basics#testMinusDays_int AssertionFailedError ...
  org.joda.time.TestLocalDateTime_Basics#testMinusHours_int AssertionFailedError
  org.joda.time.TestLocalDateTime_Basics#testMinusMillis_int AssertionFailedError
  org.joda.time.TestLocalDateTime_Basics#testMinusMinutes_int AssertionFailedError
  org.joda.time.TestLocalDateTime_Basics#testMinusMonths_int AssertionFailedError
  org.joda.time.TestLocalDateTime_Basics#testMinusSeconds_int AssertionFailedError
  org.joda.time.TestLocalDateTime_Basics#testMinusWeeks_int AssertionFailedError
  org.joda.time.TestLocalDateTime_Basics#testMinusYears_int AssertionFailedError
  org.joda.time.TestLocalDateTime_Basics#testMinus_RP AssertionFailedError expec...
  org.joda.time.TestLocalDateTime_Basics#testPlusDays_int AssertionFailedError e...
  org.joda.time.TestLocalDateTime_Basics#testPlusHours_int AssertionFailedError ...
  org.joda.time.TestLocalDateTime_Basics#testPlusMillis_int AssertionFailedError
  org.joda.time.TestLocalDateTime_Basics#testPlusMinutes_int AssertionFailedError
  org.joda.time.TestLocalDateTime_Basics#testPlusMonths_int AssertionFailedError
  org.joda.time.TestLocalDateTime_Basics#testPlusSeconds_int AssertionFailedError
  org.joda.time.TestLocalDateTime_Basics#testPlusWeeks_int AssertionFailedError ...
  org.joda.time.TestLocalDateTime_Basics#testPlusYears_int AssertionFailedError ...
  org.joda.time.TestLocalDateTime_Basics#testPlus_RP AssertionFailedError expect...
  org.joda.time.TestLocalDateTime_Basics#testWithDate AssertionFailedError expec...
  org.joda.time.TestLocalDateTime_Basics#testWithFieldAdded_DurationFieldType_int_1 AssertionFailedError
  org.joda.time.TestLocalDateTime_Basics#testWithField_DateTimeFieldType_int_1 AssertionFailedError
  org.joda.time.TestLocalDateTime_Basics#testWithField_DateTimeFieldType_int_3 AssertionFailedError
  org.joda.time.TestLocalDateTime_Basics#testWithTime AssertionFailedError expec...
  org.joda.time.TestLocalDateTime_Basics#testWithers AssertionFailedError expect...
  org.joda.time.TestLocalDateTime_Properties#testPropertyAddToCopyDay AssertionFailedError
  org.joda.time.TestLocalDateTime_Properties#testPropertyAddToCopyHour AssertionFailedError
  org.joda.time.TestLocalDateTime_Properties#testPropertyAddToCopyMilli AssertionFailedError
  org.joda.time.TestLocalDateTime_Properties#testPropertyAddToCopyMinute AssertionFailedError
  org.joda.time.TestLocalDateTime_Properties#testPropertyAddToCopyMonth AssertionFailedError
  org.joda.time.TestLocalDateTime_Properties#testPropertyAddToCopySecond AssertionFailedError
  org.joda.time.TestLocalDateTime_Properties#testPropertyAddToCopyYear AssertionFailedError
  org.joda.time.TestLocalDateTime_Properties#testPropertyAddWrapFieldToCopyDay AssertionFailedError
  org.joda.time.TestLocalDateTime_Properties#testPropertyAddWrapFieldToCopyHour AssertionFailedError
  org.joda.time.TestLocalDateTime_Properties#testPropertyAddWrapFieldToCopyMilli AssertionFailedError
  org.joda.time.TestLocalDateTime_Properties#testPropertyAddWrapFieldToCopyMinute AssertionFailedError
  org.joda.time.TestLocalDateTime_Properties#testPropertyAddWrapFieldToCopyMonth AssertionFailedError
  org.joda.time.TestLocalDateTime_Properties#testPropertyAddWrapFieldToCopySecond AssertionFailedError
  org.joda.time.TestLocalDateTime_Properties#testPropertyAddWrapFieldToCopyYear AssertionFailedError
  org.joda.time.TestLocalDateTime_Properties#testPropertyRoundHour AssertionFailedError
  org.joda.time.TestLocalDateTime_Properties#testPropertySetCopyDay AssertionFailedError
  org.joda.time.TestLocalDateTime_Properties#testPropertySetCopyMonth AssertionFailedError
  org.joda.time.TestLocalDateTime_Properties#testPropertySetCopyTextDay AssertionFailedError
  org.joda.time.TestLocalDateTime_Properties#testPropertySetCopyTextMonth AssertionFailedError
  org.joda.time.TestLocalDateTime_Properties#testPropertySetCopyTextYear AssertionFailedError
  org.joda.time.TestLocalDateTime_Properties#testPropertySetCopyYear AssertionFailedError
  org.joda.time.TestLocalDateTime_Properties#testPropertySetHour AssertionFailedError
  org.joda.time.TestLocalDateTime_Properties#testPropertySetMilli AssertionFailedError
  org.joda.time.TestLocalDateTime_Properties#testPropertySetMinute AssertionFailedError
  org.joda.time.TestLocalDateTime_Properties#testPropertySetSecond AssertionFailedError
  org.joda.time.TestLocalDateTime_Properties#testPropertySetTextHour AssertionFailedError
  org.joda.time.TestLocalDateTime_Properties#testPropertySetTextMilli AssertionFailedError
  org.joda.time.TestLocalDateTime_Properties#testPropertySetTextMinute AssertionFailedError
  org.joda.time.TestLocalDateTime_Properties#testPropertySetTextSecond AssertionFailedError
  org.joda.time.TestLocalDateTime_Properties#testPropertyWithMaxMinValueHour AssertionFailedError
  org.joda.time.TestLocalDateTime_Properties#testPropertyWithMaxMinValueMilli AssertionFailedError
  org.joda.time.TestLocalDateTime_Properties#testPropertyWithMaxMinValueMinute AssertionFailedError
  org.joda.time.TestLocalDateTime_Properties#testPropertyWithMaxMinValueSecond AssertionFailedError
  org.joda.time.TestLocalDateTime_Properties#testPropertyWithMaximumValueDayOfMonth AssertionFailedError
  org.joda.time.TestLocalDateTime_Properties#testPropertyWithMaximumValueHour AssertionFailedError
  org.joda.time.TestLocalDateTime_Properties#testPropertyWithMinimumValueDayOfMonth AssertionFailedError
  org.joda.time.TestLocalDateTime_Properties#testPropertyWithMinimumValueHour AssertionFailedError
  org.joda.time.TestMinutes#testAddToLocalDate AssertionFailedError expected:<20...
  org.joda.time.TestSeconds#testAddToLocalDate AssertionFailedError expected:<20...

Tests run: 4157, Failures: 64, Errors: 0, Skipped: 0

[INFO] ------------------------------------------------------------------------
[INFO] BUILD FAILURE
[INFO] ------------------------------------------------------------------------
[INFO] Total time: 15.384s
[INFO] Finished at: Wed Aug 05 17:07:23 BST 2015
[INFO] Final Memory: 8M/209M
[INFO] ------------------------------------------------------------------------
[ERROR] Failed to execute goal org.apache.maven.plugins:maven-surefire-plugin:2.18.1:test (default-test) on project joda-time: There are test failures.
[ERROR] 
[ERROR] Please refer to /home/perham/Study/LittleDarwin/Cases/joda-time-2.8.1/target/surefire-reports for the individual test results.
[ERROR] -> [Help 1]
[ERROR] 
[ERROR] To see the full stack trace of the errors, re-run Maven with the -e switch.
[ERROR] Re-run Maven using the -X switch to enable full debug logging.
[ERROR] 
[ERROR] For more information about the errors and possible solutions, please read the following articles:
[ERROR] [Help 1] http://cwiki.apache.org/confluence/display/MAVEN/MojoFailureException
