[INFO] Scanning for projects...
[INFO]                                                                         
[INFO] ------------------------------------------------------------------------
[INFO] Building Joda-Time 2.8.1
[INFO] ------------------------------------------------------------------------
[INFO] 
[INFO] --- maven-resources-plugin:2.7:resources (default-resources) @ joda-time ---
[INFO] Using 'UTF-8' encoding to copy filtered resources.
[INFO] Copying 2 resources to META-INF
[INFO] Copying 10 resources
[INFO] 
[INFO] --- maven-compiler-plugin:3.3:compile (default-compile) @ joda-time ---
[INFO] Changes detected - recompiling the module!
[INFO] Compiling 166 source files to /home/perham/Study/LittleDarwin/Cases/joda-time-2.8.1/target/classes
[INFO] 
[INFO] --- exec-maven-plugin:1.4.0:java (compile-tzdb) @ joda-time ---
Writing zoneinfo files
Writing ZoneInfoMap
[INFO] 
[INFO] --- maven-resources-plugin:2.7:testResources (default-testResources) @ joda-time ---
[INFO] Using 'UTF-8' encoding to copy filtered resources.
[INFO] Copying 34 resources
[INFO] 
[INFO] --- maven-compiler-plugin:3.3:testCompile (default-testCompile) @ joda-time ---
[INFO] Nothing to compile - all classes are up to date
[INFO] 
[INFO] --- maven-surefire-plugin:2.18.1:test (default-test) @ joda-time ---
[INFO] Surefire report directory: /home/perham/Study/LittleDarwin/Cases/joda-time-2.8.1/target/surefire-reports

-------------------------------------------------------
 T E S T S
-------------------------------------------------------
Running org.joda.time.TestAllPackages

TestBuddhistChronology.testCalendar

TestCopticChronology.testCalendar

TestEthiopicChronology.testCalendar

TestIslamicChronology.testCalendar

Testing Gregorian chronology over 1000 iterations
100% complete (i=1000)

Testing Julian chronology over 1000 iterations
100% complete (i=1000)
Writing zoneinfo files
Writing ZoneInfoMap
Tests run: 4157, Failures: 2, Errors: 14, Skipped: 0, Time elapsed: 5.791 sec <<< FAILURE! - in org.joda.time.TestAllPackages
testFactory_fromCalendarFields(org.joda.time.TestLocalDateTime_Constructors)  Time elapsed: 0.004 sec  <<< ERROR!
org.joda.time.IllegalFieldValueException: Value 0 for monthOfYear must be in the range [1,12]
	at org.joda.time.field.FieldUtils.verifyValueBounds(FieldUtils.java:252)
	at org.joda.time.chrono.BasicChronology.getDateMidnightMillis(BasicChronology.java:612)
	at org.joda.time.chrono.BasicChronology.getDateTimeMillis(BasicChronology.java:177)
	at org.joda.time.chrono.GregorianChronology.getDateTimeMillis(GregorianChronology.java:44)
	at org.joda.time.chrono.AssembledChronology.getDateTimeMillis(AssembledChronology.java:133)
	at org.joda.time.LocalDateTime.<init>(LocalDateTime.java:78)
	at org.joda.time.LocalDateTime.<init>(LocalDateTime.java:75)
	at org.joda.time.LocalDateTime.fromCalendarFields(LocalDateTime.java:45)
	at org.joda.time.TestLocalDateTime_Constructors.testFactory_fromCalendarFields(TestLocalDateTime_Constructors.java:109)

testFactory_fromCalendarFields_beforeYearZero1(org.joda.time.TestLocalDateTime_Constructors)  Time elapsed: 0.001 sec  <<< ERROR!
org.joda.time.IllegalFieldValueException: Value 0 for monthOfYear must be in the range [1,12]
	at org.joda.time.field.FieldUtils.verifyValueBounds(FieldUtils.java:252)
	at org.joda.time.chrono.BasicChronology.getDateMidnightMillis(BasicChronology.java:612)
	at org.joda.time.chrono.BasicChronology.getDateTimeMillis(BasicChronology.java:177)
	at org.joda.time.chrono.GregorianChronology.getDateTimeMillis(GregorianChronology.java:44)
	at org.joda.time.chrono.AssembledChronology.getDateTimeMillis(AssembledChronology.java:133)
	at org.joda.time.LocalDateTime.<init>(LocalDateTime.java:78)
	at org.joda.time.LocalDateTime.<init>(LocalDateTime.java:75)
	at org.joda.time.LocalDateTime.fromCalendarFields(LocalDateTime.java:45)
	at org.joda.time.TestLocalDateTime_Constructors.testFactory_fromCalendarFields_beforeYearZero1(TestLocalDateTime_Constructors.java:117)

testFactory_fromCalendarFields_beforeYearZero3(org.joda.time.TestLocalDateTime_Constructors)  Time elapsed: 0.001 sec  <<< ERROR!
org.joda.time.IllegalFieldValueException: Value 0 for monthOfYear must be in the range [1,12]
	at org.joda.time.field.FieldUtils.verifyValueBounds(FieldUtils.java:252)
	at org.joda.time.chrono.BasicChronology.getDateMidnightMillis(BasicChronology.java:612)
	at org.joda.time.chrono.BasicChronology.getDateTimeMillis(BasicChronology.java:177)
	at org.joda.time.chrono.GregorianChronology.getDateTimeMillis(GregorianChronology.java:44)
	at org.joda.time.chrono.AssembledChronology.getDateTimeMillis(AssembledChronology.java:133)
	at org.joda.time.LocalDateTime.<init>(LocalDateTime.java:78)
	at org.joda.time.LocalDateTime.<init>(LocalDateTime.java:75)
	at org.joda.time.LocalDateTime.fromCalendarFields(LocalDateTime.java:45)
	at org.joda.time.TestLocalDateTime_Constructors.testFactory_fromCalendarFields_beforeYearZero3(TestLocalDateTime_Constructors.java:125)

testFactory_fromDateFields_before1970(org.joda.time.TestLocalDateTime_Constructors)  Time elapsed: 0.002 sec  <<< ERROR!
org.joda.time.IllegalFieldValueException: Value 0 for monthOfYear must be in the range [1,12]
	at org.joda.time.field.FieldUtils.verifyValueBounds(FieldUtils.java:252)
	at org.joda.time.chrono.BasicChronology.getDateMidnightMillis(BasicChronology.java:612)
	at org.joda.time.chrono.BasicChronology.getDateTimeMillis(BasicChronology.java:177)
	at org.joda.time.chrono.GregorianChronology.getDateTimeMillis(GregorianChronology.java:44)
	at org.joda.time.chrono.AssembledChronology.getDateTimeMillis(AssembledChronology.java:133)
	at org.joda.time.LocalDateTime.<init>(LocalDateTime.java:78)
	at org.joda.time.LocalDateTime.<init>(LocalDateTime.java:75)
	at org.joda.time.LocalDateTime.fromCalendarFields(LocalDateTime.java:45)
	at org.joda.time.LocalDateTime.fromDateFields(LocalDateTime.java:49)
	at org.joda.time.TestLocalDateTime_Constructors.testFactory_fromDateFields_before1970(TestLocalDateTime_Constructors.java:147)

testFactory_fromDateFields_beforeYearZero1(org.joda.time.TestLocalDateTime_Constructors)  Time elapsed: 0.003 sec  <<< ERROR!
org.joda.time.IllegalFieldValueException: Value 0 for monthOfYear must be in the range [1,12]
	at org.joda.time.field.FieldUtils.verifyValueBounds(FieldUtils.java:252)
	at org.joda.time.chrono.BasicChronology.getDateMidnightMillis(BasicChronology.java:612)
	at org.joda.time.chrono.BasicChronology.getDateTimeMillis(BasicChronology.java:177)
	at org.joda.time.chrono.GregorianChronology.getDateTimeMillis(GregorianChronology.java:44)
	at org.joda.time.chrono.AssembledChronology.getDateTimeMillis(AssembledChronology.java:133)
	at org.joda.time.LocalDateTime.<init>(LocalDateTime.java:78)
	at org.joda.time.LocalDateTime.<init>(LocalDateTime.java:75)
	at org.joda.time.LocalDateTime.fromCalendarFields(LocalDateTime.java:45)
	at org.joda.time.LocalDateTime.fromDateFields(LocalDateTime.java:49)
	at org.joda.time.TestLocalDateTime_Constructors.testFactory_fromDateFields_beforeYearZero1(TestLocalDateTime_Constructors.java:155)

testFactory_fromDateFields_beforeYearZero3(org.joda.time.TestLocalDateTime_Constructors)  Time elapsed: 0 sec  <<< ERROR!
org.joda.time.IllegalFieldValueException: Value 0 for monthOfYear must be in the range [1,12]
	at org.joda.time.field.FieldUtils.verifyValueBounds(FieldUtils.java:252)
	at org.joda.time.chrono.BasicChronology.getDateMidnightMillis(BasicChronology.java:612)
	at org.joda.time.chrono.BasicChronology.getDateTimeMillis(BasicChronology.java:177)
	at org.joda.time.chrono.GregorianChronology.getDateTimeMillis(GregorianChronology.java:44)
	at org.joda.time.chrono.AssembledChronology.getDateTimeMillis(AssembledChronology.java:133)
	at org.joda.time.LocalDateTime.<init>(LocalDateTime.java:78)
	at org.joda.time.LocalDateTime.<init>(LocalDateTime.java:75)
	at org.joda.time.LocalDateTime.fromCalendarFields(LocalDateTime.java:45)
	at org.joda.time.LocalDateTime.fromDateFields(LocalDateTime.java:49)
	at org.joda.time.TestLocalDateTime_Constructors.testFactory_fromDateFields_beforeYearZero3(TestLocalDateTime_Constructors.java:163)

testToDate_summer(org.joda.time.TestLocalDateTime_Basics)  Time elapsed: 0.243 sec  <<< ERROR!
org.joda.time.IllegalFieldValueException: Value 31 for dayOfMonth must be in the range [1,30]
	at org.joda.time.field.FieldUtils.verifyValueBounds(FieldUtils.java:252)
	at org.joda.time.chrono.BasicChronology.getDateMidnightMillis(BasicChronology.java:613)
	at org.joda.time.chrono.BasicChronology.getDateTimeMillis(BasicChronology.java:177)
	at org.joda.time.chrono.GregorianChronology.getDateTimeMillis(GregorianChronology.java:44)
	at org.joda.time.chrono.AssembledChronology.getDateTimeMillis(AssembledChronology.java:133)
	at org.joda.time.LocalDateTime.<init>(LocalDateTime.java:78)
	at org.joda.time.LocalDateTime.<init>(LocalDateTime.java:75)
	at org.joda.time.LocalDateTime.fromCalendarFields(LocalDateTime.java:45)
	at org.joda.time.LocalDateTime.correctDstTransition(LocalDateTime.java:131)
	at org.joda.time.LocalDateTime.toDate(LocalDateTime.java:120)
	at org.joda.time.TestLocalDateTime_Basics.testToDate_summer(TestLocalDateTime_Basics.java:853)

testToDate_winter(org.joda.time.TestLocalDateTime_Basics)  Time elapsed: 0.001 sec  <<< ERROR!
org.joda.time.IllegalFieldValueException: Value -1 for monthOfYear must be in the range [1,12]
	at org.joda.time.field.FieldUtils.verifyValueBounds(FieldUtils.java:252)
	at org.joda.time.chrono.BasicChronology.getDateMidnightMillis(BasicChronology.java:612)
	at org.joda.time.chrono.BasicChronology.getDateTimeMillis(BasicChronology.java:177)
	at org.joda.time.chrono.GregorianChronology.getDateTimeMillis(GregorianChronology.java:44)
	at org.joda.time.chrono.AssembledChronology.getDateTimeMillis(AssembledChronology.java:133)
	at org.joda.time.LocalDateTime.<init>(LocalDateTime.java:78)
	at org.joda.time.LocalDateTime.<init>(LocalDateTime.java:75)
	at org.joda.time.LocalDateTime.fromCalendarFields(LocalDateTime.java:45)
	at org.joda.time.LocalDateTime.correctDstTransition(LocalDateTime.java:129)
	at org.joda.time.LocalDateTime.toDate(LocalDateTime.java:120)
	at org.joda.time.TestLocalDateTime_Basics.testToDate_winter(TestLocalDateTime_Basics.java:871)

testToDate_springDST(org.joda.time.TestLocalDateTime_Basics)  Time elapsed: 0.095 sec  <<< ERROR!
org.joda.time.IllegalFieldValueException: Value 29 for dayOfMonth must be in the range [1,28]
	at org.joda.time.field.FieldUtils.verifyValueBounds(FieldUtils.java:252)
	at org.joda.time.chrono.BasicChronology.getDateMidnightMillis(BasicChronology.java:613)
	at org.joda.time.chrono.BasicChronology.getDateTimeMillis(BasicChronology.java:177)
	at org.joda.time.chrono.GregorianChronology.getDateTimeMillis(GregorianChronology.java:44)
	at org.joda.time.chrono.AssembledChronology.getDateTimeMillis(AssembledChronology.java:133)
	at org.joda.time.LocalDateTime.<init>(LocalDateTime.java:78)
	at org.joda.time.LocalDateTime.<init>(LocalDateTime.java:75)
	at org.joda.time.LocalDateTime.fromCalendarFields(LocalDateTime.java:45)
	at org.joda.time.LocalDateTime.correctDstTransition(LocalDateTime.java:131)
	at org.joda.time.LocalDateTime.toDate(LocalDateTime.java:120)
	at org.joda.time.TestLocalDateTime_Basics.testToDate_springDST(TestLocalDateTime_Basics.java:894)

testToDate_springDST_2Hour40Savings(org.joda.time.TestLocalDateTime_Basics)  Time elapsed: 0.008 sec  <<< ERROR!
org.joda.time.IllegalFieldValueException: Value 29 for dayOfMonth must be in the range [1,28]
	at org.joda.time.field.FieldUtils.verifyValueBounds(FieldUtils.java:252)
	at org.joda.time.chrono.BasicChronology.getDateMidnightMillis(BasicChronology.java:613)
	at org.joda.time.chrono.BasicChronology.getDateTimeMillis(BasicChronology.java:177)
	at org.joda.time.chrono.GregorianChronology.getDateTimeMillis(GregorianChronology.java:44)
	at org.joda.time.chrono.AssembledChronology.getDateTimeMillis(AssembledChronology.java:133)
	at org.joda.time.LocalDateTime.<init>(LocalDateTime.java:78)
	at org.joda.time.LocalDateTime.<init>(LocalDateTime.java:75)
	at org.joda.time.LocalDateTime.fromCalendarFields(LocalDateTime.java:45)
	at org.joda.time.LocalDateTime.correctDstTransition(LocalDateTime.java:131)
	at org.joda.time.LocalDateTime.toDate(LocalDateTime.java:120)
	at org.joda.time.TestLocalDateTime_Basics.testToDate_springDST_2Hour40Savings(TestLocalDateTime_Basics.java:910)

testToDate_autumnDST(org.joda.time.TestLocalDateTime_Basics)  Time elapsed: 0.112 sec  <<< FAILURE!
junit.framework.ComparisonFailure: expected:<[Tue Oct 02 00:20:30 GMT+02]:00 2007> but was:<[Sun Dec 02 00:20:30 GMT+01]:00 2007>
	at junit.framework.Assert.assertEquals(Assert.java:81)
	at junit.framework.Assert.assertEquals(Assert.java:87)
	at org.joda.time.TestLocalDateTime_Basics.testToDate_autumnDST(TestLocalDateTime_Basics.java:928)

testToDate_summer_Zone(org.joda.time.TestLocalDateTime_Basics)  Time elapsed: 0.037 sec  <<< ERROR!
org.joda.time.IllegalFieldValueException: Value 31 for dayOfMonth must be in the range [1,30]
	at org.joda.time.field.FieldUtils.verifyValueBounds(FieldUtils.java:252)
	at org.joda.time.chrono.BasicChronology.getDateMidnightMillis(BasicChronology.java:613)
	at org.joda.time.chrono.BasicChronology.getDateTimeMillis(BasicChronology.java:177)
	at org.joda.time.chrono.GregorianChronology.getDateTimeMillis(GregorianChronology.java:44)
	at org.joda.time.chrono.AssembledChronology.getDateTimeMillis(AssembledChronology.java:133)
	at org.joda.time.LocalDateTime.<init>(LocalDateTime.java:78)
	at org.joda.time.LocalDateTime.<init>(LocalDateTime.java:75)
	at org.joda.time.LocalDateTime.fromCalendarFields(LocalDateTime.java:45)
	at org.joda.time.LocalDateTime.correctDstTransition(LocalDateTime.java:131)
	at org.joda.time.LocalDateTime.toDate(LocalDateTime.java:126)
	at org.joda.time.TestLocalDateTime_Basics.testToDate_summer_Zone(TestLocalDateTime_Basics.java:938)

testToDate_winter_Zone(org.joda.time.TestLocalDateTime_Basics)  Time elapsed: 0.001 sec  <<< ERROR!
org.joda.time.IllegalFieldValueException: Value -1 for monthOfYear must be in the range [1,12]
	at org.joda.time.field.FieldUtils.verifyValueBounds(FieldUtils.java:252)
	at org.joda.time.chrono.BasicChronology.getDateMidnightMillis(BasicChronology.java:612)
	at org.joda.time.chrono.BasicChronology.getDateTimeMillis(BasicChronology.java:177)
	at org.joda.time.chrono.GregorianChronology.getDateTimeMillis(GregorianChronology.java:44)
	at org.joda.time.chrono.AssembledChronology.getDateTimeMillis(AssembledChronology.java:133)
	at org.joda.time.LocalDateTime.<init>(LocalDateTime.java:78)
	at org.joda.time.LocalDateTime.<init>(LocalDateTime.java:75)
	at org.joda.time.LocalDateTime.fromCalendarFields(LocalDateTime.java:45)
	at org.joda.time.LocalDateTime.correctDstTransition(LocalDateTime.java:129)
	at org.joda.time.LocalDateTime.toDate(LocalDateTime.java:126)
	at org.joda.time.TestLocalDateTime_Basics.testToDate_winter_Zone(TestLocalDateTime_Basics.java:956)

testToDate_springDST_Zone(org.joda.time.TestLocalDateTime_Basics)  Time elapsed: 0.005 sec  <<< ERROR!
org.joda.time.IllegalFieldValueException: Value 29 for dayOfMonth must be in the range [1,28]
	at org.joda.time.field.FieldUtils.verifyValueBounds(FieldUtils.java:252)
	at org.joda.time.chrono.BasicChronology.getDateMidnightMillis(BasicChronology.java:613)
	at org.joda.time.chrono.BasicChronology.getDateTimeMillis(BasicChronology.java:177)
	at org.joda.time.chrono.GregorianChronology.getDateTimeMillis(GregorianChronology.java:44)
	at org.joda.time.chrono.AssembledChronology.getDateTimeMillis(AssembledChronology.java:133)
	at org.joda.time.LocalDateTime.<init>(LocalDateTime.java:78)
	at org.joda.time.LocalDateTime.<init>(LocalDateTime.java:75)
	at org.joda.time.LocalDateTime.fromCalendarFields(LocalDateTime.java:45)
	at org.joda.time.LocalDateTime.correctDstTransition(LocalDateTime.java:131)
	at org.joda.time.LocalDateTime.toDate(LocalDateTime.java:126)
	at org.joda.time.TestLocalDateTime_Basics.testToDate_springDST_Zone(TestLocalDateTime_Basics.java:979)

testToDate_springDST_2Hour40Savings_Zone(org.joda.time.TestLocalDateTime_Basics)  Time elapsed: 0.006 sec  <<< ERROR!
org.joda.time.IllegalFieldValueException: Value 29 for dayOfMonth must be in the range [1,28]
	at org.joda.time.field.FieldUtils.verifyValueBounds(FieldUtils.java:252)
	at org.joda.time.chrono.BasicChronology.getDateMidnightMillis(BasicChronology.java:613)
	at org.joda.time.chrono.BasicChronology.getDateTimeMillis(BasicChronology.java:177)
	at org.joda.time.chrono.GregorianChronology.getDateTimeMillis(GregorianChronology.java:44)
	at org.joda.time.chrono.AssembledChronology.getDateTimeMillis(AssembledChronology.java:133)
	at org.joda.time.LocalDateTime.<init>(LocalDateTime.java:78)
	at org.joda.time.LocalDateTime.<init>(LocalDateTime.java:75)
	at org.joda.time.LocalDateTime.fromCalendarFields(LocalDateTime.java:45)
	at org.joda.time.LocalDateTime.correctDstTransition(LocalDateTime.java:131)
	at org.joda.time.LocalDateTime.toDate(LocalDateTime.java:126)
	at org.joda.time.TestLocalDateTime_Basics.testToDate_springDST_2Hour40Savings_Zone(TestLocalDateTime_Basics.java:995)

testToDate_autumnDST_Zone(org.joda.time.TestLocalDateTime_Basics)  Time elapsed: 0.018 sec  <<< FAILURE!
junit.framework.ComparisonFailure: expected:<[Tue Oct 02 00:20:30 GMT+02]:00 2007> but was:<[Sun Dec 02 00:20:30 GMT+01]:00 2007>
	at junit.framework.Assert.assertEquals(Assert.java:81)
	at junit.framework.Assert.assertEquals(Assert.java:87)
	at org.joda.time.TestLocalDateTime_Basics.testToDate_autumnDST_Zone(TestLocalDateTime_Basics.java:1013)


Results :

Failed tests: 
  org.joda.time.TestLocalDateTime_Basics#testToDate_autumnDST ComparisonFailure ...
  org.joda.time.TestLocalDateTime_Basics#testToDate_autumnDST_Zone ComparisonFailure
Tests in error: 
  org.joda.time.TestLocalDateTime_Basics#testToDate_springDST IllegalFieldValueException
  org.joda.time.TestLocalDateTime_Basics#testToDate_springDST_2Hour40Savings IllegalFieldValueException
  org.joda.time.TestLocalDateTime_Basics#testToDate_springDST_2Hour40Savings_Zone IllegalFieldValueException
  org.joda.time.TestLocalDateTime_Basics#testToDate_springDST_Zone IllegalFieldValueException
  org.joda.time.TestLocalDateTime_Basics#testToDate_summer IllegalFieldValueException
  org.joda.time.TestLocalDateTime_Basics#testToDate_summer_Zone IllegalFieldValueException
  org.joda.time.TestLocalDateTime_Basics#testToDate_winter IllegalFieldValueException
  org.joda.time.TestLocalDateTime_Basics#testToDate_winter_Zone IllegalFieldValueException
  org.joda.time.TestLocalDateTime_Constructors#testFactory_fromCalendarFields IllegalFieldValueException
  org.joda.time.TestLocalDateTime_Constructors#testFactory_fromCalendarFields_beforeYearZero1 IllegalFieldValueException
  org.joda.time.TestLocalDateTime_Constructors#testFactory_fromCalendarFields_beforeYearZero3 IllegalFieldValueException
  org.joda.time.TestLocalDateTime_Constructors#testFactory_fromDateFields_before1970 IllegalFieldValueException
  org.joda.time.TestLocalDateTime_Constructors#testFactory_fromDateFields_beforeYearZero1 IllegalFieldValueException
  org.joda.time.TestLocalDateTime_Constructors#testFactory_fromDateFields_beforeYearZero3 IllegalFieldValueException

Tests run: 4157, Failures: 2, Errors: 14, Skipped: 0

[INFO] ------------------------------------------------------------------------
[INFO] BUILD FAILURE
[INFO] ------------------------------------------------------------------------
[INFO] Total time: 15.878s
[INFO] Finished at: Wed Aug 05 16:57:14 BST 2015
[INFO] Final Memory: 9M/213M
[INFO] ------------------------------------------------------------------------
[ERROR] Failed to execute goal org.apache.maven.plugins:maven-surefire-plugin:2.18.1:test (default-test) on project joda-time: There are test failures.
[ERROR] 
[ERROR] Please refer to /home/perham/Study/LittleDarwin/Cases/joda-time-2.8.1/target/surefire-reports for the individual test results.
[ERROR] -> [Help 1]
[ERROR] 
[ERROR] To see the full stack trace of the errors, re-run Maven with the -e switch.
[ERROR] Re-run Maven using the -X switch to enable full debug logging.
[ERROR] 
[ERROR] For more information about the errors and possible solutions, please read the following articles:
[ERROR] [Help 1] http://cwiki.apache.org/confluence/display/MAVEN/MojoFailureException
