[INFO] Scanning for projects...
[INFO]                                                                         
[INFO] ------------------------------------------------------------------------
[INFO] Building Joda-Time 2.8.1
[INFO] ------------------------------------------------------------------------
[INFO] 
[INFO] --- maven-resources-plugin:2.7:resources (default-resources) @ joda-time ---
[INFO] Using 'UTF-8' encoding to copy filtered resources.
[INFO] Copying 2 resources to META-INF
[INFO] Copying 10 resources
[INFO] 
[INFO] --- maven-compiler-plugin:3.3:compile (default-compile) @ joda-time ---
[INFO] Changes detected - recompiling the module!
[INFO] Compiling 166 source files to /home/perham/Study/LittleDarwin/Cases/joda-time-2.8.1/target/classes
[INFO] 
[INFO] --- exec-maven-plugin:1.4.0:java (compile-tzdb) @ joda-time ---
Writing zoneinfo files
Writing ZoneInfoMap
[INFO] 
[INFO] --- maven-resources-plugin:2.7:testResources (default-testResources) @ joda-time ---
[INFO] Using 'UTF-8' encoding to copy filtered resources.
[INFO] Copying 34 resources
[INFO] 
[INFO] --- maven-compiler-plugin:3.3:testCompile (default-testCompile) @ joda-time ---
[INFO] Nothing to compile - all classes are up to date
[INFO] 
[INFO] --- maven-surefire-plugin:2.18.1:test (default-test) @ joda-time ---
[INFO] Surefire report directory: /home/perham/Study/LittleDarwin/Cases/joda-time-2.8.1/target/surefire-reports

-------------------------------------------------------
 T E S T S
-------------------------------------------------------
Running org.joda.time.TestAllPackages

TestBuddhistChronology.testCalendar

TestCopticChronology.testCalendar

TestEthiopicChronology.testCalendar

TestIslamicChronology.testCalendar

Testing Gregorian chronology over 1000 iterations
100% complete (i=1000)

Testing Julian chronology over 1000 iterations
100% complete (i=1000)
Writing zoneinfo files
Writing ZoneInfoMap
Tests run: 4157, Failures: 10, Errors: 7, Skipped: 0, Time elapsed: 5.323 sec <<< FAILURE! - in org.joda.time.TestAllPackages
testConstructor_ObjectLocalDate(org.joda.time.TestLocalDate_Constructors)  Time elapsed: 0.005 sec  <<< ERROR!
java.lang.IllegalArgumentException: Field 'year' is not supported
	at org.joda.time.LocalDate.get(LocalDate.java:104)
	at org.joda.time.convert.ReadablePartialConverter.getPartialValues(ReadablePartialConverter.java:91)
	at org.joda.time.convert.AbstractConverter.getPartialValues(AbstractConverter.java:123)
	at org.joda.time.LocalDate.<init>(LocalDate.java:83)
	at org.joda.time.LocalDate.<init>(LocalDate.java:72)
	at org.joda.time.TestLocalDate_Constructors.testConstructor_ObjectLocalDate(TestLocalDate_Constructors.java:407)

testConstructor_Object_Chronology_crossChronology(org.joda.time.TestLocalDate_Constructors)  Time elapsed: 0 sec  <<< ERROR!
java.lang.IllegalArgumentException: Field 'year' is not supported
	at org.joda.time.LocalDate.get(LocalDate.java:104)
	at org.joda.time.convert.ReadablePartialConverter.getPartialValues(ReadablePartialConverter.java:91)
	at org.joda.time.convert.AbstractConverter.getPartialValues(AbstractConverter.java:123)
	at org.joda.time.LocalDate.<init>(LocalDate.java:83)
	at org.joda.time.TestLocalDate_Constructors.testConstructor_Object_Chronology_crossChronology(TestLocalDate_Constructors.java:487)

testToString(org.joda.time.TestLocalDate_Basics)  Time elapsed: 0.002 sec  <<< FAILURE!
junit.framework.ComparisonFailure: expected:<[2002-06-09]> but was:<[����-��-��]>
	at junit.framework.Assert.assertEquals(Assert.java:81)
	at junit.framework.Assert.assertEquals(Assert.java:87)
	at org.joda.time.TestLocalDate_Basics.testToString(TestLocalDate_Basics.java:1126)

testToString_String(org.joda.time.TestLocalDate_Basics)  Time elapsed: 0 sec  <<< FAILURE!
junit.framework.ComparisonFailure: expected:<[2002] ��> but was:<[����] ��>
	at junit.framework.Assert.assertEquals(Assert.java:81)
	at junit.framework.Assert.assertEquals(Assert.java:87)
	at org.joda.time.TestLocalDate_Basics.testToString_String(TestLocalDate_Basics.java:1132)

testToString_String_Locale(org.joda.time.TestLocalDate_Basics)  Time elapsed: 0.001 sec  <<< FAILURE!
junit.framework.ComparisonFailure: expected:<[Tue 9/6]> but was:<[� �/�]>
	at junit.framework.Assert.assertEquals(Assert.java:81)
	at junit.framework.Assert.assertEquals(Assert.java:87)
	at org.joda.time.TestLocalDate_Basics.testToString_String_Locale(TestLocalDate_Basics.java:1139)

testToString_DTFormatter(org.joda.time.TestLocalDate_Basics)  Time elapsed: 0 sec  <<< FAILURE!
junit.framework.ComparisonFailure: expected:<[2002] ��> but was:<[����] ��>
	at junit.framework.Assert.assertEquals(Assert.java:81)
	at junit.framework.Assert.assertEquals(Assert.java:87)
	at org.joda.time.TestLocalDate_Basics.testToString_DTFormatter(TestLocalDate_Basics.java:1149)

testGet_DateTimeFieldType(org.joda.time.TestLocalDate_Basics)  Time elapsed: 0 sec  <<< ERROR!
java.lang.IllegalArgumentException: Field 'year' is not supported
	at org.joda.time.LocalDate.get(LocalDate.java:104)
	at org.joda.time.TestLocalDate_Basics.testGet_DateTimeFieldType(TestLocalDate_Basics.java:123)

testPropertyCompareToYear(org.joda.time.TestLocalDate_Properties)  Time elapsed: 0.001 sec  <<< ERROR!
java.lang.IllegalArgumentException: Field 'year' is not supported
	at org.joda.time.LocalDate.get(LocalDate.java:104)
	at org.joda.time.field.AbstractReadableInstantFieldProperty.compareTo(AbstractReadableInstantFieldProperty.java:424)
	at org.joda.time.TestLocalDate_Properties.testPropertyCompareToYear(TestLocalDate_Properties.java:173)

testPropertyCompareToMonth(org.joda.time.TestLocalDate_Properties)  Time elapsed: 0 sec  <<< ERROR!
java.lang.IllegalArgumentException: Field 'monthOfYear' is not supported
	at org.joda.time.LocalDate.get(LocalDate.java:104)
	at org.joda.time.field.AbstractReadableInstantFieldProperty.compareTo(AbstractReadableInstantFieldProperty.java:424)
	at org.joda.time.TestLocalDate_Properties.testPropertyCompareToMonth(TestLocalDate_Properties.java:317)

testPropertyCompareToDay(org.joda.time.TestLocalDate_Properties)  Time elapsed: 0 sec  <<< ERROR!
java.lang.IllegalArgumentException: Field 'dayOfMonth' is not supported
	at org.joda.time.LocalDate.get(LocalDate.java:104)
	at org.joda.time.field.AbstractReadableInstantFieldProperty.compareTo(AbstractReadableInstantFieldProperty.java:424)
	at org.joda.time.TestLocalDate_Properties.testPropertyCompareToDay(TestLocalDate_Properties.java:472)

testConstructor_ObjectLocalDate(org.joda.time.TestLocalTime_Constructors)  Time elapsed: 0 sec  <<< FAILURE!
junit.framework.AssertionFailedError
	at junit.framework.Assert.fail(Assert.java:47)
	at junit.framework.Assert.fail(Assert.java:53)
	at org.joda.time.TestLocalTime_Constructors.testConstructor_ObjectLocalDate(TestLocalTime_Constructors.java:474)

testIsMatch_Partial(org.joda.time.TestPartial_Match)  Time elapsed: 0.002 sec  <<< ERROR!
java.lang.IllegalArgumentException: Field 'year' is not supported
	at org.joda.time.LocalDate.get(LocalDate.java:104)
	at org.joda.time.Partial.isMatch(Partial.java:715)
	at org.joda.time.TestPartial_Match.testIsMatch_Partial(TestPartial_Match.java:131)

test_DateTime_JustAfterLastEverOverlap(org.joda.time.TestDateTimeZoneCutover)  Time elapsed: 0.002 sec  <<< FAILURE!
junit.framework.ComparisonFailure: expected:<[2008-08-10]> but was:<[����-��-��]>
	at junit.framework.Assert.assertEquals(Assert.java:81)
	at junit.framework.Assert.assertEquals(Assert.java:87)
	at org.joda.time.TestDateTimeZoneCutover.test_DateTime_JustAfterLastEverOverlap(TestDateTimeZoneCutover.java:1099)

test_LocalDate_new_Gaza(org.joda.time.TestDateTimeZoneCutover)  Time elapsed: 0.001 sec  <<< FAILURE!
junit.framework.ComparisonFailure: expected:<[2007-04-01]> but was:<[����-��-��]>
	at junit.framework.Assert.assertEquals(Assert.java:81)
	at junit.framework.Assert.assertEquals(Assert.java:87)
	at org.joda.time.TestDateTimeZoneCutover.test_LocalDate_new_Gaza(TestDateTimeZoneCutover.java:216)

test_LocalDate_new_Turk(org.joda.time.TestDateTimeZoneCutover)  Time elapsed: 0.001 sec  <<< FAILURE!
junit.framework.ComparisonFailure: expected:<[2007-04-01]> but was:<[����-��-��]>
	at junit.framework.Assert.assertEquals(Assert.java:81)
	at junit.framework.Assert.assertEquals(Assert.java:87)
	at org.joda.time.TestDateTimeZoneCutover.test_LocalDate_new_Turk(TestDateTimeZoneCutover.java:433)

testLocalDate(org.joda.time.TestStringConvert)  Time elapsed: 0.002 sec  <<< FAILURE!
junit.framework.ComparisonFailure: expected:<[2010-06-30]> but was:<[����-��-��]>
	at junit.framework.Assert.assertEquals(Assert.java:81)
	at junit.framework.Assert.assertEquals(Assert.java:87)
	at org.joda.time.TestStringConvert.testLocalDate(TestStringConvert.java:84)

testPrint_appendableMethods(org.joda.time.format.TestDateTimeFormatter)  Time elapsed: 0.001 sec  <<< FAILURE!
junit.framework.ComparisonFailure: expected:<[2004-06-09]> but was:<[����-��-��]>
	at junit.framework.Assert.assertEquals(Assert.java:81)
	at junit.framework.Assert.assertEquals(Assert.java:87)
	at org.joda.time.format.TestDateTimeFormatter.testPrint_appendableMethods(TestDateTimeFormatter.java:216)


Results :

Failed tests: 
  org.joda.time.TestDateTimeZoneCutover#test_DateTime_JustAfterLastEverOverlap ComparisonFailure
  org.joda.time.TestDateTimeZoneCutover#test_LocalDate_new_Gaza ComparisonFailure
  org.joda.time.TestDateTimeZoneCutover#test_LocalDate_new_Turk ComparisonFailure
  org.joda.time.TestLocalDate_Basics#testToString ComparisonFailure expected:<[2...
  org.joda.time.TestLocalDate_Basics#testToString_DTFormatter ComparisonFailure ...
  org.joda.time.TestLocalDate_Basics#testToString_String ComparisonFailure expec...
  org.joda.time.TestLocalDate_Basics#testToString_String_Locale ComparisonFailure
  org.joda.time.TestLocalTime_Constructors#testConstructor_ObjectLocalDate AssertionFailedError
  org.joda.time.TestStringConvert#testLocalDate ComparisonFailure expected:<[201...
  org.joda.time.format.TestDateTimeFormatter#testPrint_appendableMethods ComparisonFailure
Tests in error: 
  org.joda.time.TestLocalDate_Basics#testGet_DateTimeFieldType IllegalArgumentException
  org.joda.time.TestLocalDate_Constructors#testConstructor_ObjectLocalDate IllegalArgumentException
  org.joda.time.TestLocalDate_Constructors#testConstructor_Object_Chronology_crossChronology IllegalArgumentException
  org.joda.time.TestLocalDate_Properties#testPropertyCompareToDay IllegalArgumentException
  org.joda.time.TestLocalDate_Properties#testPropertyCompareToMonth IllegalArgumentException
  org.joda.time.TestLocalDate_Properties#testPropertyCompareToYear IllegalArgumentException
  org.joda.time.TestPartial_Match#testIsMatch_Partial IllegalArgumentException F...

Tests run: 4157, Failures: 10, Errors: 7, Skipped: 0

[INFO] ------------------------------------------------------------------------
[INFO] BUILD FAILURE
[INFO] ------------------------------------------------------------------------
[INFO] Total time: 15.719s
[INFO] Finished at: Wed Aug 05 16:48:03 BST 2015
[INFO] Final Memory: 9M/213M
[INFO] ------------------------------------------------------------------------
[ERROR] Failed to execute goal org.apache.maven.plugins:maven-surefire-plugin:2.18.1:test (default-test) on project joda-time: There are test failures.
[ERROR] 
[ERROR] Please refer to /home/perham/Study/LittleDarwin/Cases/joda-time-2.8.1/target/surefire-reports for the individual test results.
[ERROR] -> [Help 1]
[ERROR] 
[ERROR] To see the full stack trace of the errors, re-run Maven with the -e switch.
[ERROR] Re-run Maven using the -X switch to enable full debug logging.
[ERROR] 
[ERROR] For more information about the errors and possible solutions, please read the following articles:
[ERROR] [Help 1] http://cwiki.apache.org/confluence/display/MAVEN/MojoFailureException
