[INFO] Scanning for projects...
[INFO]                                                                         
[INFO] ------------------------------------------------------------------------
[INFO] Building Joda-Time 2.8.1
[INFO] ------------------------------------------------------------------------
[INFO] 
[INFO] --- maven-resources-plugin:2.7:resources (default-resources) @ joda-time ---
[INFO] Using 'UTF-8' encoding to copy filtered resources.
[INFO] Copying 2 resources to META-INF
[INFO] Copying 10 resources
[INFO] 
[INFO] --- maven-compiler-plugin:3.3:compile (default-compile) @ joda-time ---
[INFO] Changes detected - recompiling the module!
[INFO] Compiling 166 source files to /home/perham/Study/LittleDarwin/Cases/joda-time-2.8.1/target/classes
[INFO] 
[INFO] --- exec-maven-plugin:1.4.0:java (compile-tzdb) @ joda-time ---
Writing zoneinfo files
Writing ZoneInfoMap
[INFO] 
[INFO] --- maven-resources-plugin:2.7:testResources (default-testResources) @ joda-time ---
[INFO] Using 'UTF-8' encoding to copy filtered resources.
[INFO] Copying 34 resources
[INFO] 
[INFO] --- maven-compiler-plugin:3.3:testCompile (default-testCompile) @ joda-time ---
[INFO] Nothing to compile - all classes are up to date
[INFO] 
[INFO] --- maven-surefire-plugin:2.18.1:test (default-test) @ joda-time ---
[INFO] Surefire report directory: /home/perham/Study/LittleDarwin/Cases/joda-time-2.8.1/target/surefire-reports

-------------------------------------------------------
 T E S T S
-------------------------------------------------------
Running org.joda.time.TestAllPackages

TestBuddhistChronology.testCalendar

TestCopticChronology.testCalendar

TestEthiopicChronology.testCalendar

TestIslamicChronology.testCalendar

Testing Gregorian chronology over 1000 iterations
100% complete (i=1000)

Testing Julian chronology over 1000 iterations
100% complete (i=1000)
Writing zoneinfo files
Writing ZoneInfoMap
Tests run: 4157, Failures: 72, Errors: 0, Skipped: 0, Time elapsed: 5.474 sec <<< FAILURE! - in org.joda.time.TestAllPackages
testToLocalDate(org.joda.time.TestDateTime_Basics)  Time elapsed: 0.004 sec  <<< FAILURE!
junit.framework.AssertionFailedError: expected:<1718-07-27> but was:<1718-07-27>
	at junit.framework.Assert.fail(Assert.java:47)
	at junit.framework.Assert.failNotEquals(Assert.java:280)
	at junit.framework.Assert.assertEquals(Assert.java:64)
	at junit.framework.Assert.assertEquals(Assert.java:71)
	at org.joda.time.TestDateTime_Basics.testToLocalDate(TestDateTime_Basics.java:741)

testToLocalDate(org.joda.time.TestDateMidnight_Basics)  Time elapsed: 0.002 sec  <<< FAILURE!
junit.framework.AssertionFailedError: expected:<1718-07-27> but was:<1718-07-27>
	at junit.framework.Assert.fail(Assert.java:47)
	at junit.framework.Assert.failNotEquals(Assert.java:280)
	at junit.framework.Assert.assertEquals(Assert.java:64)
	at junit.framework.Assert.assertEquals(Assert.java:71)
	at org.joda.time.TestDateMidnight_Basics.testToLocalDate(TestDateMidnight_Basics.java:650)

testToLocalDate(org.joda.time.TestLocalDateTime_Basics)  Time elapsed: 0.001 sec  <<< FAILURE!
junit.framework.AssertionFailedError: expected:<2005-06-09> but was:<2005-06-09>
	at junit.framework.Assert.fail(Assert.java:47)
	at junit.framework.Assert.failNotEquals(Assert.java:280)
	at junit.framework.Assert.assertEquals(Assert.java:64)
	at junit.framework.Assert.assertEquals(Assert.java:71)
	at org.joda.time.TestLocalDateTime_Basics.testToLocalDate(TestLocalDateTime_Basics.java:820)

testConstructor(org.joda.time.TestLocalDate_Constructors)  Time elapsed: 0.001 sec  <<< FAILURE!
junit.framework.AssertionFailedError: expected:<1970-06-09> but was:<1970-06-09>
	at junit.framework.Assert.fail(Assert.java:47)
	at junit.framework.Assert.failNotEquals(Assert.java:280)
	at junit.framework.Assert.assertEquals(Assert.java:64)
	at junit.framework.Assert.assertEquals(Assert.java:71)
	at org.joda.time.TestLocalDate_Constructors.testConstructor(TestLocalDate_Constructors.java:172)

testConstructor_DateTimeZone(org.joda.time.TestLocalDate_Constructors)  Time elapsed: 0.001 sec  <<< FAILURE!
junit.framework.AssertionFailedError: expected:<2005-06-08> but was:<2005-06-08>
	at junit.framework.Assert.fail(Assert.java:47)
	at junit.framework.Assert.failNotEquals(Assert.java:280)
	at junit.framework.Assert.assertEquals(Assert.java:64)
	at junit.framework.Assert.assertEquals(Assert.java:71)
	at org.joda.time.TestLocalDate_Constructors.testConstructor_DateTimeZone(TestLocalDate_Constructors.java:185)

testConstructor_Chronology(org.joda.time.TestLocalDate_Constructors)  Time elapsed: 0 sec  <<< FAILURE!
junit.framework.AssertionFailedError: expected:<1970-06-09> but was:<1970-06-09>
	at junit.framework.Assert.fail(Assert.java:47)
	at junit.framework.Assert.failNotEquals(Assert.java:280)
	at junit.framework.Assert.assertEquals(Assert.java:64)
	at junit.framework.Assert.assertEquals(Assert.java:71)
	at org.joda.time.TestLocalDate_Constructors.testConstructor_Chronology(TestLocalDate_Constructors.java:213)

testParse_noFormatter(org.joda.time.TestLocalDate_Constructors)  Time elapsed: 0 sec  <<< FAILURE!
junit.framework.AssertionFailedError: expected:<2010-06-30> but was:<2010-06-30>
	at junit.framework.Assert.fail(Assert.java:47)
	at junit.framework.Assert.failNotEquals(Assert.java:280)
	at junit.framework.Assert.assertEquals(Assert.java:64)
	at junit.framework.Assert.assertEquals(Assert.java:71)
	at org.joda.time.TestLocalDate_Constructors.testParse_noFormatter(TestLocalDate_Constructors.java:87)

testParse_formatter(org.joda.time.TestLocalDate_Constructors)  Time elapsed: 0.001 sec  <<< FAILURE!
junit.framework.AssertionFailedError: expected:<2010-06-30> but was:<2010-06-30>
	at junit.framework.Assert.fail(Assert.java:47)
	at junit.framework.Assert.failNotEquals(Assert.java:280)
	at junit.framework.Assert.assertEquals(Assert.java:64)
	at junit.framework.Assert.assertEquals(Assert.java:71)
	at org.joda.time.TestLocalDate_Constructors.testParse_formatter(TestLocalDate_Constructors.java:93)

testFactory_fromCalendarFields(org.joda.time.TestLocalDate_Constructors)  Time elapsed: 0 sec  <<< FAILURE!
junit.framework.AssertionFailedError: expected:<1970-02-03> but was:<1970-02-03>
	at junit.framework.Assert.fail(Assert.java:47)
	at junit.framework.Assert.failNotEquals(Assert.java:280)
	at junit.framework.Assert.assertEquals(Assert.java:64)
	at junit.framework.Assert.assertEquals(Assert.java:71)
	at org.joda.time.TestLocalDate_Constructors.testFactory_fromCalendarFields(TestLocalDate_Constructors.java:101)

testFactory_fromCalendarFields_beforeYearZero1(org.joda.time.TestLocalDate_Constructors)  Time elapsed: 0.001 sec  <<< FAILURE!
junit.framework.AssertionFailedError: expected:<0000-02-03> but was:<0000-02-03>
	at junit.framework.Assert.fail(Assert.java:47)
	at junit.framework.Assert.failNotEquals(Assert.java:280)
	at junit.framework.Assert.assertEquals(Assert.java:64)
	at junit.framework.Assert.assertEquals(Assert.java:71)
	at org.joda.time.TestLocalDate_Constructors.testFactory_fromCalendarFields_beforeYearZero1(TestLocalDate_Constructors.java:109)

testFactory_fromCalendarFields_beforeYearZero3(org.joda.time.TestLocalDate_Constructors)  Time elapsed: 0 sec  <<< FAILURE!
junit.framework.AssertionFailedError: expected:<-0002-02-03> but was:<-0002-02-03>
	at junit.framework.Assert.fail(Assert.java:47)
	at junit.framework.Assert.failNotEquals(Assert.java:280)
	at junit.framework.Assert.assertEquals(Assert.java:64)
	at junit.framework.Assert.assertEquals(Assert.java:71)
	at org.joda.time.TestLocalDate_Constructors.testFactory_fromCalendarFields_beforeYearZero3(TestLocalDate_Constructors.java:117)

testFactory_fromDateFields_after1970(org.joda.time.TestLocalDate_Constructors)  Time elapsed: 0.001 sec  <<< FAILURE!
junit.framework.AssertionFailedError: expected:<1970-02-03> but was:<1970-02-03>
	at junit.framework.Assert.fail(Assert.java:47)
	at junit.framework.Assert.failNotEquals(Assert.java:280)
	at junit.framework.Assert.assertEquals(Assert.java:64)
	at junit.framework.Assert.assertEquals(Assert.java:71)
	at org.joda.time.TestLocalDate_Constructors.testFactory_fromDateFields_after1970(TestLocalDate_Constructors.java:132)

testFactory_fromDateFields_before1970(org.joda.time.TestLocalDate_Constructors)  Time elapsed: 0 sec  <<< FAILURE!
junit.framework.AssertionFailedError: expected:<1969-02-03> but was:<1969-02-03>
	at junit.framework.Assert.fail(Assert.java:47)
	at junit.framework.Assert.failNotEquals(Assert.java:280)
	at junit.framework.Assert.assertEquals(Assert.java:64)
	at junit.framework.Assert.assertEquals(Assert.java:71)
	at org.joda.time.TestLocalDate_Constructors.testFactory_fromDateFields_before1970(TestLocalDate_Constructors.java:139)

testFactory_fromDateFields_beforeYearZero1(org.joda.time.TestLocalDate_Constructors)  Time elapsed: 0 sec  <<< FAILURE!
junit.framework.AssertionFailedError: expected:<0000-02-03> but was:<0000-02-03>
	at junit.framework.Assert.fail(Assert.java:47)
	at junit.framework.Assert.failNotEquals(Assert.java:280)
	at junit.framework.Assert.assertEquals(Assert.java:64)
	at junit.framework.Assert.assertEquals(Assert.java:71)
	at org.joda.time.TestLocalDate_Constructors.testFactory_fromDateFields_beforeYearZero1(TestLocalDate_Constructors.java:147)

testFactory_fromDateFields_beforeYearZero3(org.joda.time.TestLocalDate_Constructors)  Time elapsed: 0.001 sec  <<< FAILURE!
junit.framework.AssertionFailedError: expected:<-0002-02-03> but was:<-0002-02-03>
	at junit.framework.Assert.fail(Assert.java:47)
	at junit.framework.Assert.failNotEquals(Assert.java:280)
	at junit.framework.Assert.assertEquals(Assert.java:64)
	at junit.framework.Assert.assertEquals(Assert.java:71)
	at org.joda.time.TestLocalDate_Constructors.testFactory_fromDateFields_beforeYearZero3(TestLocalDate_Constructors.java:155)

testPlus_RP(org.joda.time.TestLocalDate_Basics)  Time elapsed: 0.001 sec  <<< FAILURE!
junit.framework.AssertionFailedError: expected:<2003-07-28> but was:<2003-07-28>
	at junit.framework.Assert.fail(Assert.java:47)
	at junit.framework.Assert.failNotEquals(Assert.java:280)
	at junit.framework.Assert.assertEquals(Assert.java:64)
	at junit.framework.Assert.assertEquals(Assert.java:71)
	at org.joda.time.TestLocalDate_Basics.testPlus_RP(TestLocalDate_Basics.java:521)

testEqualsHashCode(org.joda.time.TestLocalDate_Basics)  Time elapsed: 0 sec  <<< FAILURE!
junit.framework.AssertionFailedError: expected:<true> but was:<false>
	at junit.framework.Assert.fail(Assert.java:47)
	at junit.framework.Assert.failNotEquals(Assert.java:280)
	at junit.framework.Assert.assertEquals(Assert.java:64)
	at junit.framework.Assert.assertEquals(Assert.java:146)
	at junit.framework.Assert.assertEquals(Assert.java:152)
	at org.joda.time.TestLocalDate_Basics.testEqualsHashCode(TestLocalDate_Basics.java:247)

testSerialization(org.joda.time.TestLocalDate_Basics)  Time elapsed: 0.003 sec  <<< FAILURE!
junit.framework.AssertionFailedError: expected:<1972-06-09> but was:<1972-06-09>
	at junit.framework.Assert.fail(Assert.java:47)
	at junit.framework.Assert.failNotEquals(Assert.java:280)
	at junit.framework.Assert.assertEquals(Assert.java:64)
	at junit.framework.Assert.assertEquals(Assert.java:71)
	at org.joda.time.TestLocalDate_Basics.testSerialization(TestLocalDate_Basics.java:1117)

testPlusYears_int(org.joda.time.TestLocalDate_Basics)  Time elapsed: 0 sec  <<< FAILURE!
junit.framework.AssertionFailedError: expected:<2003-05-03> but was:<2003-05-03>
	at junit.framework.Assert.fail(Assert.java:47)
	at junit.framework.Assert.failNotEquals(Assert.java:280)
	at junit.framework.Assert.assertEquals(Assert.java:64)
	at junit.framework.Assert.assertEquals(Assert.java:71)
	at org.joda.time.TestLocalDate_Basics.testPlusYears_int(TestLocalDate_Basics.java:531)

testPlusMonths_int(org.joda.time.TestLocalDate_Basics)  Time elapsed: 0.001 sec  <<< FAILURE!
junit.framework.AssertionFailedError: expected:<2002-06-03> but was:<2002-06-03>
	at junit.framework.Assert.fail(Assert.java:47)
	at junit.framework.Assert.failNotEquals(Assert.java:280)
	at junit.framework.Assert.assertEquals(Assert.java:64)
	at junit.framework.Assert.assertEquals(Assert.java:71)
	at org.joda.time.TestLocalDate_Basics.testPlusMonths_int(TestLocalDate_Basics.java:541)

testPlusWeeks_int(org.joda.time.TestLocalDate_Basics)  Time elapsed: 0 sec  <<< FAILURE!
junit.framework.AssertionFailedError: expected:<2002-05-10> but was:<2002-05-10>
	at junit.framework.Assert.fail(Assert.java:47)
	at junit.framework.Assert.failNotEquals(Assert.java:280)
	at junit.framework.Assert.assertEquals(Assert.java:64)
	at junit.framework.Assert.assertEquals(Assert.java:71)
	at org.joda.time.TestLocalDate_Basics.testPlusWeeks_int(TestLocalDate_Basics.java:551)

testPlusDays_int(org.joda.time.TestLocalDate_Basics)  Time elapsed: 0.001 sec  <<< FAILURE!
junit.framework.AssertionFailedError: expected:<2002-05-04> but was:<2002-05-04>
	at junit.framework.Assert.fail(Assert.java:47)
	at junit.framework.Assert.failNotEquals(Assert.java:280)
	at junit.framework.Assert.assertEquals(Assert.java:64)
	at junit.framework.Assert.assertEquals(Assert.java:71)
	at org.joda.time.TestLocalDate_Basics.testPlusDays_int(TestLocalDate_Basics.java:561)

testMinus_RP(org.joda.time.TestLocalDate_Basics)  Time elapsed: 0.002 sec  <<< FAILURE!
junit.framework.AssertionFailedError: expected:<2001-03-26> but was:<2001-03-26>
	at junit.framework.Assert.fail(Assert.java:47)
	at junit.framework.Assert.failNotEquals(Assert.java:280)
	at junit.framework.Assert.assertEquals(Assert.java:64)
	at junit.framework.Assert.assertEquals(Assert.java:71)
	at org.joda.time.TestLocalDate_Basics.testMinus_RP(TestLocalDate_Basics.java:576)

testMinusYears_int(org.joda.time.TestLocalDate_Basics)  Time elapsed: 0 sec  <<< FAILURE!
junit.framework.AssertionFailedError: expected:<2001-05-03> but was:<2001-05-03>
	at junit.framework.Assert.fail(Assert.java:47)
	at junit.framework.Assert.failNotEquals(Assert.java:280)
	at junit.framework.Assert.assertEquals(Assert.java:64)
	at junit.framework.Assert.assertEquals(Assert.java:71)
	at org.joda.time.TestLocalDate_Basics.testMinusYears_int(TestLocalDate_Basics.java:586)

testMinusMonths_int(org.joda.time.TestLocalDate_Basics)  Time elapsed: 0 sec  <<< FAILURE!
junit.framework.AssertionFailedError: expected:<2002-04-03> but was:<2002-04-03>
	at junit.framework.Assert.fail(Assert.java:47)
	at junit.framework.Assert.failNotEquals(Assert.java:280)
	at junit.framework.Assert.assertEquals(Assert.java:64)
	at junit.framework.Assert.assertEquals(Assert.java:71)
	at org.joda.time.TestLocalDate_Basics.testMinusMonths_int(TestLocalDate_Basics.java:596)

testMinusWeeks_int(org.joda.time.TestLocalDate_Basics)  Time elapsed: 0.001 sec  <<< FAILURE!
junit.framework.AssertionFailedError: expected:<2002-04-26> but was:<2002-04-26>
	at junit.framework.Assert.fail(Assert.java:47)
	at junit.framework.Assert.failNotEquals(Assert.java:280)
	at junit.framework.Assert.assertEquals(Assert.java:64)
	at junit.framework.Assert.assertEquals(Assert.java:71)
	at org.joda.time.TestLocalDate_Basics.testMinusWeeks_int(TestLocalDate_Basics.java:606)

testMinusDays_int(org.joda.time.TestLocalDate_Basics)  Time elapsed: 0.001 sec  <<< FAILURE!
junit.framework.AssertionFailedError: expected:<2002-05-02> but was:<2002-05-02>
	at junit.framework.Assert.fail(Assert.java:47)
	at junit.framework.Assert.failNotEquals(Assert.java:280)
	at junit.framework.Assert.assertEquals(Assert.java:64)
	at junit.framework.Assert.assertEquals(Assert.java:71)
	at org.joda.time.TestLocalDate_Basics.testMinusDays_int(TestLocalDate_Basics.java:616)

testToDate_springDST(org.joda.time.TestLocalDate_Basics)  Time elapsed: 0.002 sec  <<< FAILURE!
junit.framework.ComparisonFailure: expected:<[Mon Apr 02 01:00:00 GMT+02]:00 2007> but was:<[Sun Apr 01 23:00:01 GMT+01]:00 2007>
	at junit.framework.Assert.assertEquals(Assert.java:81)
	at junit.framework.Assert.assertEquals(Assert.java:87)
	at org.joda.time.TestLocalDate_Basics.testToDate_springDST(TestLocalDate_Basics.java:1040)

testToDate_springDST_2Hour40Savings(org.joda.time.TestLocalDate_Basics)  Time elapsed: 0 sec  <<< FAILURE!
junit.framework.ComparisonFailure: expected:<[Mon Apr 02 02:40:00 GMT+03:4]0 2007> but was:<[Sun Apr 01 21:20:01 GMT+01:0]0 2007>
	at junit.framework.Assert.assertEquals(Assert.java:81)
	at junit.framework.Assert.assertEquals(Assert.java:87)
	at org.joda.time.TestLocalDate_Basics.testToDate_springDST_2Hour40Savings(TestLocalDate_Basics.java:1056)

testToDate_autumnDST(org.joda.time.TestLocalDate_Basics)  Time elapsed: 0.001 sec  <<< FAILURE!
junit.framework.ComparisonFailure: expected:<...ct 02 00:00:00 GMT+0[2]:00 2007> but was:<...ct 02 00:00:00 GMT+0[1]:00 2007>
	at junit.framework.Assert.assertEquals(Assert.java:81)
	at junit.framework.Assert.assertEquals(Assert.java:87)
	at org.joda.time.TestLocalDate_Basics.testToDate_autumnDST(TestLocalDate_Basics.java:1072)

testWithField_DateTimeFieldType_int_1(org.joda.time.TestLocalDate_Basics)  Time elapsed: 0 sec  <<< FAILURE!
junit.framework.AssertionFailedError: expected:<2004-06-09> but was:<2004-06-09>
	at junit.framework.Assert.fail(Assert.java:47)
	at junit.framework.Assert.failNotEquals(Assert.java:280)
	at junit.framework.Assert.assertEquals(Assert.java:64)
	at junit.framework.Assert.assertEquals(Assert.java:71)
	at org.joda.time.TestLocalDate_Basics.testWithField_DateTimeFieldType_int_1(TestLocalDate_Basics.java:450)

testWithFieldAdded_DurationFieldType_int_1(org.joda.time.TestLocalDate_Basics)  Time elapsed: 0 sec  <<< FAILURE!
junit.framework.AssertionFailedError: expected:<2004-06-09> but was:<2004-06-09>
	at junit.framework.Assert.fail(Assert.java:47)
	at junit.framework.Assert.failNotEquals(Assert.java:280)
	at junit.framework.Assert.assertEquals(Assert.java:64)
	at junit.framework.Assert.assertEquals(Assert.java:71)
	at org.joda.time.TestLocalDate_Basics.testWithFieldAdded_DurationFieldType_int_1(TestLocalDate_Basics.java:482)

testEqualsHashCodeLenient(org.joda.time.TestLocalDate_Basics)  Time elapsed: 0.001 sec  <<< FAILURE!
junit.framework.AssertionFailedError: expected:<true> but was:<false>
	at junit.framework.Assert.fail(Assert.java:47)
	at junit.framework.Assert.failNotEquals(Assert.java:280)
	at junit.framework.Assert.assertEquals(Assert.java:64)
	at junit.framework.Assert.assertEquals(Assert.java:146)
	at junit.framework.Assert.assertEquals(Assert.java:152)
	at org.joda.time.TestLocalDate_Basics.testEqualsHashCodeLenient(TestLocalDate_Basics.java:289)

testEqualsHashCodeStrict(org.joda.time.TestLocalDate_Basics)  Time elapsed: 0.001 sec  <<< FAILURE!
junit.framework.AssertionFailedError: expected:<true> but was:<false>
	at junit.framework.Assert.fail(Assert.java:47)
	at junit.framework.Assert.failNotEquals(Assert.java:280)
	at junit.framework.Assert.assertEquals(Assert.java:64)
	at junit.framework.Assert.assertEquals(Assert.java:146)
	at junit.framework.Assert.assertEquals(Assert.java:152)
	at org.joda.time.TestLocalDate_Basics.testEqualsHashCodeStrict(TestLocalDate_Basics.java:301)

testWithField_DateTimeFieldType_int_4(org.joda.time.TestLocalDate_Basics)  Time elapsed: 0.001 sec  <<< FAILURE!
junit.framework.AssertionFailedError: expected:<2004-06-09> but was:<2004-06-09>
	at junit.framework.Assert.fail(Assert.java:47)
	at junit.framework.Assert.failNotEquals(Assert.java:280)
	at junit.framework.Assert.assertEquals(Assert.java:64)
	at junit.framework.Assert.assertEquals(Assert.java:71)
	at org.joda.time.TestLocalDate_Basics.testWithField_DateTimeFieldType_int_4(TestLocalDate_Basics.java:473)

testAddToLocalDate(org.joda.time.TestYears)  Time elapsed: 0.001 sec  <<< FAILURE!
junit.framework.AssertionFailedError: expected:<2009-06-01> but was:<2009-06-01>
	at junit.framework.Assert.fail(Assert.java:47)
	at junit.framework.Assert.failNotEquals(Assert.java:280)
	at junit.framework.Assert.assertEquals(Assert.java:64)
	at junit.framework.Assert.assertEquals(Assert.java:71)
	at org.joda.time.TestYears.testAddToLocalDate(TestYears.java:318)

testAddToLocalDate(org.joda.time.TestMonths)  Time elapsed: 0.017 sec  <<< FAILURE!
junit.framework.AssertionFailedError: expected:<2006-09-01> but was:<2006-09-01>
	at junit.framework.Assert.fail(Assert.java:47)
	at junit.framework.Assert.failNotEquals(Assert.java:280)
	at junit.framework.Assert.assertEquals(Assert.java:64)
	at junit.framework.Assert.assertEquals(Assert.java:71)
	at org.joda.time.TestMonths.testAddToLocalDate(TestMonths.java:363)

testAddToLocalDate(org.joda.time.TestWeeks)  Time elapsed: 0 sec  <<< FAILURE!
junit.framework.AssertionFailedError: expected:<2006-06-22> but was:<2006-06-22>
	at junit.framework.Assert.fail(Assert.java:47)
	at junit.framework.Assert.failNotEquals(Assert.java:280)
	at junit.framework.Assert.assertEquals(Assert.java:64)
	at junit.framework.Assert.assertEquals(Assert.java:71)
	at org.joda.time.TestWeeks.testAddToLocalDate(TestWeeks.java:397)

testAddToLocalDate(org.joda.time.TestDays)  Time elapsed: 0.001 sec  <<< FAILURE!
junit.framework.AssertionFailedError: expected:<2006-06-21> but was:<2006-06-21>
	at junit.framework.Assert.fail(Assert.java:47)
	at junit.framework.Assert.failNotEquals(Assert.java:280)
	at junit.framework.Assert.assertEquals(Assert.java:64)
	at junit.framework.Assert.assertEquals(Assert.java:71)
	at org.joda.time.TestDays.testAddToLocalDate(TestDays.java:432)

testToLocalDate(org.joda.time.TestYearMonthDay_Basics)  Time elapsed: 0.001 sec  <<< FAILURE!
junit.framework.AssertionFailedError: expected:<2005-06-09> but was:<2005-06-09>
	at junit.framework.Assert.fail(Assert.java:47)
	at junit.framework.Assert.failNotEquals(Assert.java:280)
	at junit.framework.Assert.assertEquals(Assert.java:64)
	at junit.framework.Assert.assertEquals(Assert.java:71)
	at org.joda.time.TestYearMonthDay_Basics.testToLocalDate(TestYearMonthDay_Basics.java:530)

testToLocalDate(org.joda.time.TestYearMonth_Basics)  Time elapsed: 0.001 sec  <<< FAILURE!
junit.framework.AssertionFailedError: expected:<2005-06-09> but was:<2005-06-09>
	at junit.framework.Assert.fail(Assert.java:47)
	at junit.framework.Assert.failNotEquals(Assert.java:280)
	at junit.framework.Assert.assertEquals(Assert.java:64)
	at junit.framework.Assert.assertEquals(Assert.java:71)
	at org.joda.time.TestYearMonth_Basics.testToLocalDate(TestYearMonth_Basics.java:504)

testToLocalDate(org.joda.time.TestMonthDay_Basics)  Time elapsed: 0.001 sec  <<< FAILURE!
junit.framework.AssertionFailedError: expected:<2009-06-06> but was:<2009-06-06>
	at junit.framework.Assert.fail(Assert.java:47)
	at junit.framework.Assert.failNotEquals(Assert.java:280)
	at junit.framework.Assert.assertEquals(Assert.java:64)
	at junit.framework.Assert.assertEquals(Assert.java:71)
	at org.joda.time.TestMonthDay_Basics.testToLocalDate(TestMonthDay_Basics.java:702)

testLocalDate(org.joda.time.TestStringConvert)  Time elapsed: 0.003 sec  <<< FAILURE!
junit.framework.AssertionFailedError: expected:<2010-06-30> but was:<2010-06-30>
	at junit.framework.Assert.fail(Assert.java:47)
	at junit.framework.Assert.failNotEquals(Assert.java:280)
	at junit.framework.Assert.assertEquals(Assert.java:64)
	at junit.framework.Assert.assertEquals(Assert.java:71)
	at org.joda.time.TestStringConvert.testLocalDate(TestStringConvert.java:85)

testSerializedLocalDate(org.joda.time.TestSerialization)  Time elapsed: 0 sec  <<< FAILURE!
junit.framework.AssertionFailedError: expected:<2002-06-09> but was:<2002-06-09>
	at junit.framework.Assert.fail(Assert.java:47)
	at junit.framework.Assert.failNotEquals(Assert.java:280)
	at junit.framework.Assert.assertEquals(Assert.java:64)
	at junit.framework.Assert.assertEquals(Assert.java:71)
	at org.joda.time.TestSerialization.loadAndCompare(TestSerialization.java:300)
	at org.joda.time.TestSerialization.testSerializedLocalDate(TestSerialization.java:174)

testSerializedLocalDateBuddhist(org.joda.time.TestSerialization)  Time elapsed: 0.002 sec  <<< FAILURE!
junit.framework.AssertionFailedError: expected:<2545-06-09> but was:<2545-06-09>
	at junit.framework.Assert.fail(Assert.java:47)
	at junit.framework.Assert.failNotEquals(Assert.java:280)
	at junit.framework.Assert.assertEquals(Assert.java:64)
	at junit.framework.Assert.assertEquals(Assert.java:71)
	at org.joda.time.TestSerialization.loadAndCompare(TestSerialization.java:300)
	at org.joda.time.TestSerialization.testSerializedLocalDateBuddhist(TestSerialization.java:180)

test_plusYears_positiveToPositive(org.joda.time.chrono.TestGJDate)  Time elapsed: 0 sec  <<< FAILURE!
junit.framework.AssertionFailedError: expected:<0007-06-30> but was:<0007-06-30>
	at junit.framework.Assert.fail(Assert.java:47)
	at junit.framework.Assert.failNotEquals(Assert.java:280)
	at junit.framework.Assert.assertEquals(Assert.java:64)
	at junit.framework.Assert.assertEquals(Assert.java:71)
	at org.joda.time.chrono.TestGJDate.test_plusYears_positiveToPositive(TestGJDate.java:55)

test_plusYears_positiveToZero(org.joda.time.chrono.TestGJDate)  Time elapsed: 0.001 sec  <<< FAILURE!
junit.framework.AssertionFailedError: expected:<-0001-06-30> but was:<-0001-06-30>
	at junit.framework.Assert.fail(Assert.java:47)
	at junit.framework.Assert.failNotEquals(Assert.java:280)
	at junit.framework.Assert.assertEquals(Assert.java:64)
	at junit.framework.Assert.assertEquals(Assert.java:71)
	at org.joda.time.chrono.TestGJDate.test_plusYears_positiveToZero(TestGJDate.java:61)

test_plusYears_positiveToNegative(org.joda.time.chrono.TestGJDate)  Time elapsed: 0 sec  <<< FAILURE!
junit.framework.AssertionFailedError: expected:<-0002-06-30> but was:<-0002-06-30>
	at junit.framework.Assert.fail(Assert.java:47)
	at junit.framework.Assert.failNotEquals(Assert.java:280)
	at junit.framework.Assert.assertEquals(Assert.java:64)
	at junit.framework.Assert.assertEquals(Assert.java:71)
	at org.joda.time.chrono.TestGJDate.test_plusYears_positiveToNegative(TestGJDate.java:67)

test_plusYears_negativeToNegative(org.joda.time.chrono.TestGJDate)  Time elapsed: 0.001 sec  <<< FAILURE!
junit.framework.AssertionFailedError: expected:<-0001-06-30> but was:<-0001-06-30>
	at junit.framework.Assert.fail(Assert.java:47)
	at junit.framework.Assert.failNotEquals(Assert.java:280)
	at junit.framework.Assert.assertEquals(Assert.java:64)
	at junit.framework.Assert.assertEquals(Assert.java:71)
	at org.joda.time.chrono.TestGJDate.test_plusYears_negativeToNegative(TestGJDate.java:74)

test_plusYears_negativeToZero(org.joda.time.chrono.TestGJDate)  Time elapsed: 0 sec  <<< FAILURE!
junit.framework.AssertionFailedError: expected:<0001-06-30> but was:<0001-06-30>
	at junit.framework.Assert.fail(Assert.java:47)
	at junit.framework.Assert.failNotEquals(Assert.java:280)
	at junit.framework.Assert.assertEquals(Assert.java:64)
	at junit.framework.Assert.assertEquals(Assert.java:71)
	at org.joda.time.chrono.TestGJDate.test_plusYears_negativeToZero(TestGJDate.java:80)

test_plusYears_negativeToPositive(org.joda.time.chrono.TestGJDate)  Time elapsed: 0.001 sec  <<< FAILURE!
junit.framework.AssertionFailedError: expected:<0002-06-30> but was:<0002-06-30>
	at junit.framework.Assert.fail(Assert.java:47)
	at junit.framework.Assert.failNotEquals(Assert.java:280)
	at junit.framework.Assert.assertEquals(Assert.java:64)
	at junit.framework.Assert.assertEquals(Assert.java:71)
	at org.joda.time.chrono.TestGJDate.test_plusYears_negativeToPositive(TestGJDate.java:86)

test_plusYears_positiveToPositive_crossCutover(org.joda.time.chrono.TestGJDate)  Time elapsed: 0 sec  <<< FAILURE!
junit.framework.AssertionFailedError: expected:<2007-06-30> but was:<2007-06-30>
	at junit.framework.Assert.fail(Assert.java:47)
	at junit.framework.Assert.failNotEquals(Assert.java:280)
	at junit.framework.Assert.assertEquals(Assert.java:64)
	at junit.framework.Assert.assertEquals(Assert.java:71)
	at org.joda.time.chrono.TestGJDate.test_plusYears_positiveToPositive_crossCutover(TestGJDate.java:93)

test_plusYears_positiveToZero_crossCutover(org.joda.time.chrono.TestGJDate)  Time elapsed: 0.001 sec  <<< FAILURE!
junit.framework.AssertionFailedError: expected:<-0001-06-30> but was:<-0001-06-30>
	at junit.framework.Assert.fail(Assert.java:47)
	at junit.framework.Assert.failNotEquals(Assert.java:280)
	at junit.framework.Assert.assertEquals(Assert.java:64)
	at junit.framework.Assert.assertEquals(Assert.java:71)
	at org.joda.time.chrono.TestGJDate.test_plusYears_positiveToZero_crossCutover(TestGJDate.java:99)

test_plusYears_positiveToNegative_crossCutover(org.joda.time.chrono.TestGJDate)  Time elapsed: 0 sec  <<< FAILURE!
junit.framework.AssertionFailedError: expected:<-0002-06-30> but was:<-0002-06-30>
	at junit.framework.Assert.fail(Assert.java:47)
	at junit.framework.Assert.failNotEquals(Assert.java:280)
	at junit.framework.Assert.assertEquals(Assert.java:64)
	at junit.framework.Assert.assertEquals(Assert.java:71)
	at org.joda.time.chrono.TestGJDate.test_plusYears_positiveToNegative_crossCutover(TestGJDate.java:105)

test_plusYears_negativeToPositive_crossCutover(org.joda.time.chrono.TestGJDate)  Time elapsed: 0.001 sec  <<< FAILURE!
junit.framework.AssertionFailedError: expected:<2002-06-30> but was:<2002-06-30>
	at junit.framework.Assert.fail(Assert.java:47)
	at junit.framework.Assert.failNotEquals(Assert.java:280)
	at junit.framework.Assert.assertEquals(Assert.java:64)
	at junit.framework.Assert.assertEquals(Assert.java:71)
	at org.joda.time.chrono.TestGJDate.test_plusYears_negativeToPositive_crossCutover(TestGJDate.java:111)

test_plusWeekyears_positiveToZero_crossCutover(org.joda.time.chrono.TestGJDate)  Time elapsed: 0.001 sec  <<< FAILURE!
junit.framework.AssertionFailedError: expected:<-0001-06-28> but was:<-0001-06-28>
	at junit.framework.Assert.fail(Assert.java:47)
	at junit.framework.Assert.failNotEquals(Assert.java:280)
	at junit.framework.Assert.assertEquals(Assert.java:64)
	at junit.framework.Assert.assertEquals(Assert.java:71)
	at org.joda.time.chrono.TestGJDate.test_plusWeekyears_positiveToZero_crossCutover(TestGJDate.java:118)

test_plusWeekyears_positiveToNegative_crossCutover(org.joda.time.chrono.TestGJDate)  Time elapsed: 0 sec  <<< FAILURE!
junit.framework.AssertionFailedError: expected:<-0002-06-30> but was:<-0002-06-30>
	at junit.framework.Assert.fail(Assert.java:47)
	at junit.framework.Assert.failNotEquals(Assert.java:280)
	at junit.framework.Assert.assertEquals(Assert.java:64)
	at junit.framework.Assert.assertEquals(Assert.java:71)
	at org.joda.time.chrono.TestGJDate.test_plusWeekyears_positiveToNegative_crossCutover(TestGJDate.java:124)

testParseLocalDate_monthDay_withDefaultYear_feb29(org.joda.time.format.TestDateTimeFormatter)  Time elapsed: 0 sec  <<< FAILURE!
junit.framework.AssertionFailedError: expected:<2012-02-29> but was:<2012-02-29>
	at junit.framework.Assert.fail(Assert.java:47)
	at junit.framework.Assert.failNotEquals(Assert.java:280)
	at junit.framework.Assert.assertEquals(Assert.java:64)
	at junit.framework.Assert.assertEquals(Assert.java:71)
	at org.joda.time.format.TestDateTimeFormatter.testParseLocalDate_monthDay_withDefaultYear_feb29(TestDateTimeFormatter.java:422)

testParseLocalDate_weekyear_month_week_2010(org.joda.time.format.TestDateTimeFormatter)  Time elapsed: 0.001 sec  <<< FAILURE!
junit.framework.AssertionFailedError: expected:<2010-01-04> but was:<2010-01-04>
	at junit.framework.Assert.fail(Assert.java:47)
	at junit.framework.Assert.failNotEquals(Assert.java:280)
	at junit.framework.Assert.assertEquals(Assert.java:64)
	at junit.framework.Assert.assertEquals(Assert.java:71)
	at org.joda.time.format.TestDateTimeFormatter.testParseLocalDate_weekyear_month_week_2010(TestDateTimeFormatter.java:428)

testParseLocalDate_weekyear_month_week_2011(org.joda.time.format.TestDateTimeFormatter)  Time elapsed: 0 sec  <<< FAILURE!
junit.framework.AssertionFailedError: expected:<2011-01-03> but was:<2011-01-03>
	at junit.framework.Assert.fail(Assert.java:47)
	at junit.framework.Assert.failNotEquals(Assert.java:280)
	at junit.framework.Assert.assertEquals(Assert.java:64)
	at junit.framework.Assert.assertEquals(Assert.java:71)
	at org.joda.time.format.TestDateTimeFormatter.testParseLocalDate_weekyear_month_week_2011(TestDateTimeFormatter.java:434)

testParseLocalDate_weekyear_month_week_2012(org.joda.time.format.TestDateTimeFormatter)  Time elapsed: 0.001 sec  <<< FAILURE!
junit.framework.AssertionFailedError: expected:<2012-01-02> but was:<2012-01-02>
	at junit.framework.Assert.fail(Assert.java:47)
	at junit.framework.Assert.failNotEquals(Assert.java:280)
	at junit.framework.Assert.assertEquals(Assert.java:64)
	at junit.framework.Assert.assertEquals(Assert.java:71)
	at org.joda.time.format.TestDateTimeFormatter.testParseLocalDate_weekyear_month_week_2012(TestDateTimeFormatter.java:440)

testParseLocalDate_year_month_week_2010(org.joda.time.format.TestDateTimeFormatter)  Time elapsed: 0 sec  <<< FAILURE!
junit.framework.AssertionFailedError: expected:<2010-01-04> but was:<2010-01-04>
	at junit.framework.Assert.fail(Assert.java:47)
	at junit.framework.Assert.failNotEquals(Assert.java:280)
	at junit.framework.Assert.assertEquals(Assert.java:64)
	at junit.framework.Assert.assertEquals(Assert.java:71)
	at org.joda.time.format.TestDateTimeFormatter.testParseLocalDate_year_month_week_2010(TestDateTimeFormatter.java:454)

testParseLocalDate_year_month_week_2011(org.joda.time.format.TestDateTimeFormatter)  Time elapsed: 0.001 sec  <<< FAILURE!
junit.framework.AssertionFailedError: expected:<2011-01-03> but was:<2011-01-03>
	at junit.framework.Assert.fail(Assert.java:47)
	at junit.framework.Assert.failNotEquals(Assert.java:280)
	at junit.framework.Assert.assertEquals(Assert.java:64)
	at junit.framework.Assert.assertEquals(Assert.java:71)
	at org.joda.time.format.TestDateTimeFormatter.testParseLocalDate_year_month_week_2011(TestDateTimeFormatter.java:460)

testParseLocalDate_year_month_week_2012(org.joda.time.format.TestDateTimeFormatter)  Time elapsed: 0 sec  <<< FAILURE!
junit.framework.AssertionFailedError: expected:<2012-01-02> but was:<2012-01-02>
	at junit.framework.Assert.fail(Assert.java:47)
	at junit.framework.Assert.failNotEquals(Assert.java:280)
	at junit.framework.Assert.assertEquals(Assert.java:64)
	at junit.framework.Assert.assertEquals(Assert.java:71)
	at org.joda.time.format.TestDateTimeFormatter.testParseLocalDate_year_month_week_2012(TestDateTimeFormatter.java:466)

testParseLocalDate_year_month_week_2013(org.joda.time.format.TestDateTimeFormatter)  Time elapsed: 0.001 sec  <<< FAILURE!
junit.framework.AssertionFailedError: expected:<2012-12-31> but was:<2012-12-31>
	at junit.framework.Assert.fail(Assert.java:47)
	at junit.framework.Assert.failNotEquals(Assert.java:280)
	at junit.framework.Assert.assertEquals(Assert.java:64)
	at junit.framework.Assert.assertEquals(Assert.java:71)
	at org.joda.time.format.TestDateTimeFormatter.testParseLocalDate_year_month_week_2013(TestDateTimeFormatter.java:472)

testParseLocalDate_year_month_week_2014(org.joda.time.format.TestDateTimeFormatter)  Time elapsed: 0 sec  <<< FAILURE!
junit.framework.AssertionFailedError: expected:<2013-12-30> but was:<2013-12-30>
	at junit.framework.Assert.fail(Assert.java:47)
	at junit.framework.Assert.failNotEquals(Assert.java:280)
	at junit.framework.Assert.assertEquals(Assert.java:64)
	at junit.framework.Assert.assertEquals(Assert.java:71)
	at org.joda.time.format.TestDateTimeFormatter.testParseLocalDate_year_month_week_2014(TestDateTimeFormatter.java:478)

testParseLocalDate_year_month_week_2015(org.joda.time.format.TestDateTimeFormatter)  Time elapsed: 0 sec  <<< FAILURE!
junit.framework.AssertionFailedError: expected:<2014-12-29> but was:<2014-12-29>
	at junit.framework.Assert.fail(Assert.java:47)
	at junit.framework.Assert.failNotEquals(Assert.java:280)
	at junit.framework.Assert.assertEquals(Assert.java:64)
	at junit.framework.Assert.assertEquals(Assert.java:71)
	at org.joda.time.format.TestDateTimeFormatter.testParseLocalDate_year_month_week_2015(TestDateTimeFormatter.java:484)

testParseLocalDate_year_month_week_2016(org.joda.time.format.TestDateTimeFormatter)  Time elapsed: 0.001 sec  <<< FAILURE!
junit.framework.AssertionFailedError: expected:<2016-01-04> but was:<2016-01-04>
	at junit.framework.Assert.fail(Assert.java:47)
	at junit.framework.Assert.failNotEquals(Assert.java:280)
	at junit.framework.Assert.assertEquals(Assert.java:64)
	at junit.framework.Assert.assertEquals(Assert.java:71)
	at org.joda.time.format.TestDateTimeFormatter.testParseLocalDate_year_month_week_2016(TestDateTimeFormatter.java:490)

testParseLocalDate_simple(org.joda.time.format.TestDateTimeFormatter)  Time elapsed: 0.001 sec  <<< FAILURE!
junit.framework.AssertionFailedError: expected:<2004-06-09> but was:<2004-06-09>
	at junit.framework.Assert.fail(Assert.java:47)
	at junit.framework.Assert.failNotEquals(Assert.java:280)
	at junit.framework.Assert.assertEquals(Assert.java:64)
	at junit.framework.Assert.assertEquals(Assert.java:71)
	at org.joda.time.format.TestDateTimeFormatter.testParseLocalDate_simple(TestDateTimeFormatter.java:365)

testParseLocalDate_yearOfEra(org.joda.time.format.TestDateTimeFormatter)  Time elapsed: 0.001 sec  <<< FAILURE!
junit.framework.AssertionFailedError: expected:<2005-10-01> but was:<2005-10-01>
	at junit.framework.Assert.fail(Assert.java:47)
	at junit.framework.Assert.failNotEquals(Assert.java:280)
	at junit.framework.Assert.assertEquals(Assert.java:64)
	at junit.framework.Assert.assertEquals(Assert.java:71)
	at org.joda.time.format.TestDateTimeFormatter.testParseLocalDate_yearOfEra(TestDateTimeFormatter.java:384)

testParseLocalDate_yearOfCentury(org.joda.time.format.TestDateTimeFormatter)  Time elapsed: 0.002 sec  <<< FAILURE!
junit.framework.AssertionFailedError: expected:<2050-08-04> but was:<2050-08-04>
	at junit.framework.Assert.fail(Assert.java:47)
	at junit.framework.Assert.failNotEquals(Assert.java:280)
	at junit.framework.Assert.assertEquals(Assert.java:64)
	at junit.framework.Assert.assertEquals(Assert.java:71)
	at org.joda.time.format.TestDateTimeFormatter.testParseLocalDate_yearOfCentury(TestDateTimeFormatter.java:401)

testParseLocalDate_monthDay_feb29(org.joda.time.format.TestDateTimeFormatter)  Time elapsed: 0.001 sec  <<< FAILURE!
junit.framework.AssertionFailedError: expected:<2000-02-29> but was:<2000-02-29>
	at junit.framework.Assert.fail(Assert.java:47)
	at junit.framework.Assert.failNotEquals(Assert.java:280)
	at junit.framework.Assert.assertEquals(Assert.java:64)
	at junit.framework.Assert.assertEquals(Assert.java:71)
	at org.joda.time.format.TestDateTimeFormatter.testParseLocalDate_monthDay_feb29(TestDateTimeFormatter.java:411)


Results :

Failed tests: 
  org.joda.time.TestDateMidnight_Basics#testToLocalDate AssertionFailedError exp...
  org.joda.time.TestDateTime_Basics#testToLocalDate AssertionFailedError expecte...
  org.joda.time.TestDays#testAddToLocalDate AssertionFailedError expected:<2006-...
  org.joda.time.TestLocalDateTime_Basics#testToLocalDate AssertionFailedError ex...
  org.joda.time.TestLocalDate_Basics#testEqualsHashCode AssertionFailedError exp...
  org.joda.time.TestLocalDate_Basics#testEqualsHashCodeLenient AssertionFailedError
  org.joda.time.TestLocalDate_Basics#testEqualsHashCodeStrict AssertionFailedError
  org.joda.time.TestLocalDate_Basics#testMinusDays_int AssertionFailedError expe...
  org.joda.time.TestLocalDate_Basics#testMinusMonths_int AssertionFailedError ex...
  org.joda.time.TestLocalDate_Basics#testMinusWeeks_int AssertionFailedError exp...
  org.joda.time.TestLocalDate_Basics#testMinusYears_int AssertionFailedError exp...
  org.joda.time.TestLocalDate_Basics#testMinus_RP AssertionFailedError expected:...
  org.joda.time.TestLocalDate_Basics#testPlusDays_int AssertionFailedError expec...
  org.joda.time.TestLocalDate_Basics#testPlusMonths_int AssertionFailedError exp...
  org.joda.time.TestLocalDate_Basics#testPlusWeeks_int AssertionFailedError expe...
  org.joda.time.TestLocalDate_Basics#testPlusYears_int AssertionFailedError expe...
  org.joda.time.TestLocalDate_Basics#testPlus_RP AssertionFailedError expected:<...
  org.joda.time.TestLocalDate_Basics#testSerialization AssertionFailedError expe...
  org.joda.time.TestLocalDate_Basics#testToDate_autumnDST ComparisonFailure expe...
  org.joda.time.TestLocalDate_Basics#testToDate_springDST ComparisonFailure expe...
  org.joda.time.TestLocalDate_Basics#testToDate_springDST_2Hour40Savings ComparisonFailure
  org.joda.time.TestLocalDate_Basics#testWithFieldAdded_DurationFieldType_int_1 AssertionFailedError
  org.joda.time.TestLocalDate_Basics#testWithField_DateTimeFieldType_int_1 AssertionFailedError
  org.joda.time.TestLocalDate_Basics#testWithField_DateTimeFieldType_int_4 AssertionFailedError
  org.joda.time.TestLocalDate_Constructors#testConstructor AssertionFailedError ...
  org.joda.time.TestLocalDate_Constructors#testConstructor_Chronology AssertionFailedError
  org.joda.time.TestLocalDate_Constructors#testConstructor_DateTimeZone AssertionFailedError
  org.joda.time.TestLocalDate_Constructors#testFactory_fromCalendarFields AssertionFailedError
  org.joda.time.TestLocalDate_Constructors#testFactory_fromCalendarFields_beforeYearZero1 AssertionFailedError
  org.joda.time.TestLocalDate_Constructors#testFactory_fromCalendarFields_beforeYearZero3 AssertionFailedError
  org.joda.time.TestLocalDate_Constructors#testFactory_fromDateFields_after1970 AssertionFailedError
  org.joda.time.TestLocalDate_Constructors#testFactory_fromDateFields_before1970 AssertionFailedError
  org.joda.time.TestLocalDate_Constructors#testFactory_fromDateFields_beforeYearZero1 AssertionFailedError
  org.joda.time.TestLocalDate_Constructors#testFactory_fromDateFields_beforeYearZero3 AssertionFailedError
  org.joda.time.TestLocalDate_Constructors#testParse_formatter AssertionFailedError
  org.joda.time.TestLocalDate_Constructors#testParse_noFormatter AssertionFailedError
  org.joda.time.TestMonthDay_Basics#testToLocalDate AssertionFailedError expecte...
  org.joda.time.TestMonths#testAddToLocalDate AssertionFailedError expected:<200...
  org.joda.time.TestSerialization#testSerializedLocalDate AssertionFailedError e...
  org.joda.time.TestSerialization#testSerializedLocalDateBuddhist AssertionFailedError
  org.joda.time.TestStringConvert#testLocalDate AssertionFailedError expected:<2...
  org.joda.time.TestWeeks#testAddToLocalDate AssertionFailedError expected:<2006...
  org.joda.time.TestYearMonthDay_Basics#testToLocalDate AssertionFailedError exp...
  org.joda.time.TestYearMonth_Basics#testToLocalDate AssertionFailedError expect...
  org.joda.time.TestYears#testAddToLocalDate AssertionFailedError expected:<2009...
  org.joda.time.chrono.TestGJDate#test_plusWeekyears_positiveToNegative_crossCutover AssertionFailedError
  org.joda.time.chrono.TestGJDate#test_plusWeekyears_positiveToZero_crossCutover AssertionFailedError
  org.joda.time.chrono.TestGJDate#test_plusYears_negativeToNegative AssertionFailedError
  org.joda.time.chrono.TestGJDate#test_plusYears_negativeToPositive AssertionFailedError
  org.joda.time.chrono.TestGJDate#test_plusYears_negativeToPositive_crossCutover AssertionFailedError
  org.joda.time.chrono.TestGJDate#test_plusYears_negativeToZero AssertionFailedError
  org.joda.time.chrono.TestGJDate#test_plusYears_positiveToNegative AssertionFailedError
  org.joda.time.chrono.TestGJDate#test_plusYears_positiveToNegative_crossCutover AssertionFailedError
  org.joda.time.chrono.TestGJDate#test_plusYears_positiveToPositive AssertionFailedError
  org.joda.time.chrono.TestGJDate#test_plusYears_positiveToPositive_crossCutover AssertionFailedError
  org.joda.time.chrono.TestGJDate#test_plusYears_positiveToZero AssertionFailedError
  org.joda.time.chrono.TestGJDate#test_plusYears_positiveToZero_crossCutover AssertionFailedError
  org.joda.time.format.TestDateTimeFormatter#testParseLocalDate_monthDay_feb29 AssertionFailedError
  org.joda.time.format.TestDateTimeFormatter#testParseLocalDate_monthDay_withDefaultYear_feb29 AssertionFailedError
  org.joda.time.format.TestDateTimeFormatter#testParseLocalDate_simple AssertionFailedError
  org.joda.time.format.TestDateTimeFormatter#testParseLocalDate_weekyear_month_week_2010 AssertionFailedError
  org.joda.time.format.TestDateTimeFormatter#testParseLocalDate_weekyear_month_week_2011 AssertionFailedError
  org.joda.time.format.TestDateTimeFormatter#testParseLocalDate_weekyear_month_week_2012 AssertionFailedError
  org.joda.time.format.TestDateTimeFormatter#testParseLocalDate_yearOfCentury AssertionFailedError
  org.joda.time.format.TestDateTimeFormatter#testParseLocalDate_yearOfEra AssertionFailedError
  org.joda.time.format.TestDateTimeFormatter#testParseLocalDate_year_month_week_2010 AssertionFailedError
  org.joda.time.format.TestDateTimeFormatter#testParseLocalDate_year_month_week_2011 AssertionFailedError
  org.joda.time.format.TestDateTimeFormatter#testParseLocalDate_year_month_week_2012 AssertionFailedError
  org.joda.time.format.TestDateTimeFormatter#testParseLocalDate_year_month_week_2013 AssertionFailedError
  org.joda.time.format.TestDateTimeFormatter#testParseLocalDate_year_month_week_2014 AssertionFailedError
  org.joda.time.format.TestDateTimeFormatter#testParseLocalDate_year_month_week_2015 AssertionFailedError
  org.joda.time.format.TestDateTimeFormatter#testParseLocalDate_year_month_week_2016 AssertionFailedError

Tests run: 4157, Failures: 72, Errors: 0, Skipped: 0

[INFO] ------------------------------------------------------------------------
[INFO] BUILD FAILURE
[INFO] ------------------------------------------------------------------------
[INFO] Total time: 16.638s
[INFO] Finished at: Wed Aug 05 16:46:19 BST 2015
[INFO] Final Memory: 9M/211M
[INFO] ------------------------------------------------------------------------
[ERROR] Failed to execute goal org.apache.maven.plugins:maven-surefire-plugin:2.18.1:test (default-test) on project joda-time: There are test failures.
[ERROR] 
[ERROR] Please refer to /home/perham/Study/LittleDarwin/Cases/joda-time-2.8.1/target/surefire-reports for the individual test results.
[ERROR] -> [Help 1]
[ERROR] 
[ERROR] To see the full stack trace of the errors, re-run Maven with the -e switch.
[ERROR] Re-run Maven using the -X switch to enable full debug logging.
[ERROR] 
[ERROR] For more information about the errors and possible solutions, please read the following articles:
[ERROR] [Help 1] http://cwiki.apache.org/confluence/display/MAVEN/MojoFailureException
